module github.com/litmuschaos/test-tools

go 1.17

require (
    github.com/minio/minio-go v6.0.14+incompatible
	github.com/go-ini/ini v1.66.4 // indirect
	github.com/mitchellh/go-homedir v1.1.0 // indirect
	github.com/stretchr/testify v1.7.0 // indirect
	golang.org/x/crypto v0.0.0-20220214200702-86341886e292 // indirect
	golang.org/x/net v0.0.0-20220225172249-27dd8689420f // indirect
	golang.org/x/sys v0.0.0-20220227234510-4e6760a101f9 // indirect
	golang.org/x/text v0.3.7 // indirect
)
