[
  {
    "id": "6fd7edf8-04f0-4910-9d77-14e019fc0dbd",
    "name": "A3",
    "company": "Audi"
  },
  {
    "id": "6fd7edf8-04f0-4910-9d77-14e019fc0dbe",
    "name": "A4",
    "company": "Audi"
  },
  {
    "id": "6fd7edf8-04f0-4910-9d77-14e019fc0dbf",
    "name": "A200",
    "company": "Mercedes"
  },
  {
    "id": "6fd7edf8-04f0-4910-9d77-14e019fc0dba",
    "name": "Ranger",
    "company": "Ford"
  }
]