"chemin du fichier","nom du paquet","nom de la classe","wmc metric"
"./module-info.java","","module-info.java","2"
"./org/jfree/chart/ChartFactory.java","org.jfree.chart","ChartFactory.java","295"
"./org/jfree/chart/legend/LegendGraphic.java","org.jfree.chart.legend","LegendGraphic.java","69"
"./org/jfree/chart/legend/LegendTitle.java","org.jfree.chart.legend","LegendTitle.java","70"
"./org/jfree/chart/legend/LegendItem.java","org.jfree.chart.legend","LegendItem.java","74"
"./org/jfree/chart/legend/LegendItemCollection.java","org.jfree.chart.legend","LegendItemCollection.java","12"
"./org/jfree/chart/legend/LegendRenderingOrder.java","org.jfree.chart.legend","LegendRenderingOrder.java","7"
"./org/jfree/chart/legend/LegendItemBlockContainer.java","org.jfree.chart.legend","LegendItemBlockContainer.java","10"
"./org/jfree/chart/legend/LegendItemSource.java","org.jfree.chart.legend","LegendItemSource.java","6"
"./org/jfree/chart/legend/package-info.java","org.jfree.chart.legend","package-info.java","1"
"./org/jfree/chart/legend/PaintScaleLegend.java","org.jfree.chart.legend","PaintScaleLegend.java","69"
"./org/jfree/chart/Drawable.java","org.jfree.chart","Drawable.java","7"
"./org/jfree/chart/imagemap/StandardURLTagFragmentGenerator.java","org.jfree.chart.imagemap","StandardURLTagFragmentGenerator.java","8"
"./org/jfree/chart/imagemap/ImageMapUtils.java","org.jfree.chart.imagemap","ImageMapUtils.java","36"
"./org/jfree/chart/imagemap/URLTagFragmentGenerator.java","org.jfree.chart.imagemap","URLTagFragmentGenerator.java","9"
"./org/jfree/chart/imagemap/StandardToolTipTagFragmentGenerator.java","org.jfree.chart.imagemap","StandardToolTipTagFragmentGenerator.java","8"
"./org/jfree/chart/imagemap/ToolTipTagFragmentGenerator.java","org.jfree.chart.imagemap","ToolTipTagFragmentGenerator.java","9"
"./org/jfree/chart/imagemap/DynamicDriveToolTipTagFragmentGenerator.java","org.jfree.chart.imagemap","DynamicDriveToolTipTagFragmentGenerator.java","10"
"./org/jfree/chart/imagemap/OverLIBToolTipTagFragmentGenerator.java","org.jfree.chart.imagemap","OverLIBToolTipTagFragmentGenerator.java","7"
"./org/jfree/chart/imagemap/package-info.java","org.jfree.chart.imagemap","package-info.java","2"
"./org/jfree/chart/renderer/OutlierList.java","org.jfree.chart.renderer","OutlierList.java","17"
"./org/jfree/chart/renderer/Outlier.java","org.jfree.chart.renderer","Outlier.java","17"
"./org/jfree/chart/renderer/category/BarPainter.java","org.jfree.chart.renderer.category","BarPainter.java","14"
"./org/jfree/chart/renderer/category/MinMaxCategoryRenderer.java","org.jfree.chart.renderer.category","MinMaxCategoryRenderer.java","46"
"./org/jfree/chart/renderer/category/StatisticalBarRenderer.java","org.jfree.chart.renderer.category","StatisticalBarRenderer.java","61"
"./org/jfree/chart/renderer/category/LevelRenderer.java","org.jfree.chart.renderer.category","LevelRenderer.java","38"
"./org/jfree/chart/renderer/category/LineAndShapeRenderer.java","org.jfree.chart.renderer.category","LineAndShapeRenderer.java","82"
"./org/jfree/chart/renderer/category/BoxAndWhiskerRenderer.java","org.jfree.chart.renderer.category","BoxAndWhiskerRenderer.java","113"
"./org/jfree/chart/renderer/category/StackedAreaRenderer.java","org.jfree.chart.renderer.category","StackedAreaRenderer.java","45"
"./org/jfree/chart/renderer/category/StackedBarRenderer.java","org.jfree.chart.renderer.category","StackedBarRenderer.java","41"
"./org/jfree/chart/renderer/category/GanttRenderer.java","org.jfree.chart.renderer.category","GanttRenderer.java","55"
"./org/jfree/chart/renderer/category/DefaultCategoryItemRenderer.java","org.jfree.chart.renderer.category","DefaultCategoryItemRenderer.java","8"
"./org/jfree/chart/renderer/category/WaterfallBarRenderer.java","org.jfree.chart.renderer.category","WaterfallBarRenderer.java","52"
"./org/jfree/chart/renderer/category/BarRenderer.java","org.jfree.chart.renderer.category","BarRenderer.java","156"
"./org/jfree/chart/renderer/category/CategoryStepRenderer.java","org.jfree.chart.renderer.category","CategoryStepRenderer.java","37"
"./org/jfree/chart/renderer/category/LayeredBarRenderer.java","org.jfree.chart.renderer.category","LayeredBarRenderer.java","68"
"./org/jfree/chart/renderer/category/StandardBarPainter.java","org.jfree.chart.renderer.category","StandardBarPainter.java","30"
"./org/jfree/chart/renderer/category/CategoryItemRendererState.java","org.jfree.chart.renderer.category","CategoryItemRendererState.java","19"
"./org/jfree/chart/renderer/category/GroupedStackedBarRenderer.java","org.jfree.chart.renderer.category","GroupedStackedBarRenderer.java","37"
"./org/jfree/chart/renderer/category/CategoryItemRenderer.java","org.jfree.chart.renderer.category","CategoryItemRenderer.java","184"
"./org/jfree/chart/renderer/category/AreaRenderer.java","org.jfree.chart.renderer.category","AreaRenderer.java","31"
"./org/jfree/chart/renderer/category/GradientBarPainter.java","org.jfree.chart.renderer.category","GradientBarPainter.java","36"
"./org/jfree/chart/renderer/category/AbstractCategoryItemRenderer.java","org.jfree.chart.renderer.category","AbstractCategoryItemRenderer.java","180"
"./org/jfree/chart/renderer/category/StatisticalLineAndShapeRenderer.java","org.jfree.chart.renderer.category","StatisticalLineAndShapeRenderer.java","53"
"./org/jfree/chart/renderer/category/ScatterRenderer.java","org.jfree.chart.renderer.category","ScatterRenderer.java","61"
"./org/jfree/chart/renderer/category/package-info.java","org.jfree.chart.renderer.category","package-info.java","2"
"./org/jfree/chart/renderer/category/IntervalBarRenderer.java","org.jfree.chart.renderer.category","IntervalBarRenderer.java","26"
"./org/jfree/chart/renderer/RendererUtils.java","org.jfree.chart.renderer","RendererUtils.java","37"
"./org/jfree/chart/renderer/GrayPaintScale.java","org.jfree.chart.renderer","GrayPaintScale.java","27"
"./org/jfree/chart/renderer/PaintScale.java","org.jfree.chart.renderer","PaintScale.java","10"
"./org/jfree/chart/renderer/DefaultPolarItemRenderer.java","org.jfree.chart.renderer","DefaultPolarItemRenderer.java","82"
"./org/jfree/chart/renderer/NotOutlierException.java","org.jfree.chart.renderer","NotOutlierException.java","7"
"./org/jfree/chart/renderer/WaferMapRenderer.java","org.jfree.chart.renderer","WaferMapRenderer.java","36"
"./org/jfree/chart/renderer/RendererState.java","org.jfree.chart.renderer","RendererState.java","10"
"./org/jfree/chart/renderer/LookupPaintScale.java","org.jfree.chart.renderer","LookupPaintScale.java","41"
"./org/jfree/chart/renderer/PolarItemRenderer.java","org.jfree.chart.renderer","PolarItemRenderer.java","14"
"./org/jfree/chart/renderer/AreaRendererEndType.java","org.jfree.chart.renderer","AreaRendererEndType.java","7"
"./org/jfree/chart/renderer/xy/DeviationStepRenderer.java","org.jfree.chart.renderer.xy","DeviationStepRenderer.java","40"
"./org/jfree/chart/renderer/xy/XYBubbleRenderer.java","org.jfree.chart.renderer.xy","XYBubbleRenderer.java","39"
"./org/jfree/chart/renderer/xy/StackedXYAreaRenderer2.java","org.jfree.chart.renderer.xy","StackedXYAreaRenderer2.java","52"
"./org/jfree/chart/renderer/xy/XYItemRenderer.java","org.jfree.chart.renderer.xy","XYItemRenderer.java","147"
"./org/jfree/chart/renderer/xy/XYShapeRenderer.java","org.jfree.chart.renderer.xy","XYShapeRenderer.java","65"
"./org/jfree/chart/renderer/xy/XYSplineRenderer.java","org.jfree.chart.renderer.xy","XYSplineRenderer.java","64"
"./org/jfree/chart/renderer/xy/XYItemRendererState.java","org.jfree.chart.renderer.xy","XYItemRendererState.java","7"
"./org/jfree/chart/renderer/xy/StandardXYItemRenderer.java","org.jfree.chart.renderer.xy","StandardXYItemRenderer.java","116"
"./org/jfree/chart/renderer/xy/XYAreaRenderer.java","org.jfree.chart.renderer.xy","XYAreaRenderer.java","94"
"./org/jfree/chart/renderer/xy/HighLowRenderer.java","org.jfree.chart.renderer.xy","HighLowRenderer.java","56"
"./org/jfree/chart/renderer/xy/StackedXYBarRenderer.java","org.jfree.chart.renderer.xy","StackedXYBarRenderer.java","47"
"./org/jfree/chart/renderer/xy/SamplingXYLineRenderer.java","org.jfree.chart.renderer.xy","SamplingXYLineRenderer.java","42"
"./org/jfree/chart/renderer/xy/XYBarPainter.java","org.jfree.chart.renderer.xy","XYBarPainter.java","14"
"./org/jfree/chart/renderer/xy/XYAreaRenderer2.java","org.jfree.chart.renderer.xy","XYAreaRenderer2.java","37"
"./org/jfree/chart/renderer/xy/XYErrorRenderer.java","org.jfree.chart.renderer.xy","XYErrorRenderer.java","39"
"./org/jfree/chart/renderer/xy/XYBarRenderer.java","org.jfree.chart.renderer.xy","XYBarRenderer.java","147"
"./org/jfree/chart/renderer/xy/GradientXYBarPainter.java","org.jfree.chart.renderer.xy","GradientXYBarPainter.java","36"
"./org/jfree/chart/renderer/xy/DefaultXYItemRenderer.java","org.jfree.chart.renderer.xy","DefaultXYItemRenderer.java","8"
"./org/jfree/chart/renderer/xy/DeviationRenderer.java","org.jfree.chart.renderer.xy","DeviationRenderer.java","39"
"./org/jfree/chart/renderer/xy/XYBlockRenderer.java","org.jfree.chart.renderer.xy","XYBlockRenderer.java","53"
"./org/jfree/chart/renderer/xy/AbstractXYItemRenderer.java","org.jfree.chart.renderer.xy","AbstractXYItemRenderer.java","170"
"./org/jfree/chart/renderer/xy/StackedXYAreaRenderer.java","org.jfree.chart.renderer.xy","StackedXYAreaRenderer.java","75"
"./org/jfree/chart/renderer/xy/WindItemRenderer.java","org.jfree.chart.renderer.xy","WindItemRenderer.java","20"
"./org/jfree/chart/renderer/xy/XYStepAreaRenderer.java","org.jfree.chart.renderer.xy","XYStepAreaRenderer.java","65"
"./org/jfree/chart/renderer/xy/CandlestickRenderer.java","org.jfree.chart.renderer.xy","CandlestickRenderer.java","77"
"./org/jfree/chart/renderer/xy/YIntervalRenderer.java","org.jfree.chart.renderer.xy","YIntervalRenderer.java","26"
"./org/jfree/chart/renderer/xy/XYLineAndShapeRenderer.java","org.jfree.chart.renderer.xy","XYLineAndShapeRenderer.java","113"
"./org/jfree/chart/renderer/xy/XYDotRenderer.java","org.jfree.chart.renderer.xy","XYDotRenderer.java","37"
"./org/jfree/chart/renderer/xy/VectorRenderer.java","org.jfree.chart.renderer.xy","VectorRenderer.java","38"
"./org/jfree/chart/renderer/xy/XYStepRenderer.java","org.jfree.chart.renderer.xy","XYStepRenderer.java","37"
"./org/jfree/chart/renderer/xy/CyclicXYItemRenderer.java","org.jfree.chart.renderer.xy","CyclicXYItemRenderer.java","45"
"./org/jfree/chart/renderer/xy/XYBoxAndWhiskerRenderer.java","org.jfree.chart.renderer.xy","XYBoxAndWhiskerRenderer.java","81"
"./org/jfree/chart/renderer/xy/package-info.java","org.jfree.chart.renderer.xy","package-info.java","2"
"./org/jfree/chart/renderer/xy/XYDifferenceRenderer.java","org.jfree.chart.renderer.xy","XYDifferenceRenderer.java","121"
"./org/jfree/chart/renderer/xy/ClusteredXYBarRenderer.java","org.jfree.chart.renderer.xy","ClusteredXYBarRenderer.java","47"
"./org/jfree/chart/renderer/xy/StandardXYBarPainter.java","org.jfree.chart.renderer.xy","StandardXYBarPainter.java","30"
"./org/jfree/chart/renderer/package-info.java","org.jfree.chart.renderer","package-info.java","2"
"./org/jfree/chart/renderer/OutlierListCollection.java","org.jfree.chart.renderer","OutlierListCollection.java","17"
"./org/jfree/chart/renderer/AbstractRenderer.java","org.jfree.chart.renderer","AbstractRenderer.java","325"
"./org/jfree/chart/plot/CombinedRangeCategoryPlot.java","org.jfree.chart.plot","CombinedRangeCategoryPlot.java","75"
"./org/jfree/chart/plot/DrawingSupplier.java","org.jfree.chart.plot","DrawingSupplier.java","7"
"./org/jfree/chart/plot/Pannable.java","org.jfree.chart.plot","Pannable.java","12"
"./org/jfree/chart/plot/FastScatterPlot.java","org.jfree.chart.plot","FastScatterPlot.java","92"
"./org/jfree/chart/plot/CrosshairState.java","org.jfree.chart.plot","CrosshairState.java","40"
"./org/jfree/chart/plot/XYCrosshairState.java","org.jfree.chart.plot","XYCrosshairState.java","7"
"./org/jfree/chart/plot/PlotState.java","org.jfree.chart.plot","PlotState.java","7"
"./org/jfree/chart/plot/SeriesRenderingOrder.java","org.jfree.chart.plot","SeriesRenderingOrder.java","7"
"./org/jfree/chart/plot/WaferMapPlot.java","org.jfree.chart.plot","WaferMapPlot.java","27"
"./org/jfree/chart/plot/Crosshair.java","org.jfree.chart.plot","Crosshair.java","43"
"./org/jfree/chart/plot/DefaultDrawingSupplier.java","org.jfree.chart.plot","DefaultDrawingSupplier.java","41"
"./org/jfree/chart/plot/PolarAxisLocation.java","org.jfree.chart.plot","PolarAxisLocation.java","6"
"./org/jfree/chart/plot/PlotRenderingInfo.java","org.jfree.chart.plot","PlotRenderingInfo.java","28"
"./org/jfree/chart/plot/PolarPlot.java","org.jfree.chart.plot","PolarPlot.java","232"
"./org/jfree/chart/plot/RingPlot.java","org.jfree.chart.plot","RingPlot.java","65"
"./org/jfree/chart/plot/Zoomable.java","org.jfree.chart.plot","Zoomable.java","23"
"./org/jfree/chart/plot/MeterInterval.java","org.jfree.chart.plot","MeterInterval.java","20"
"./org/jfree/chart/plot/dial/DialLayerChangeListener.java","org.jfree.chart.plot.dial","DialLayerChangeListener.java","9"
"./org/jfree/chart/plot/dial/AbstractDialLayer.java","org.jfree.chart.plot.dial","AbstractDialLayer.java","27"
"./org/jfree/chart/plot/dial/ArcDialFrame.java","org.jfree.chart.plot.dial","ArcDialFrame.java","50"
"./org/jfree/chart/plot/dial/DialLayerChangeEvent.java","org.jfree.chart.plot.dial","DialLayerChangeEvent.java","7"
"./org/jfree/chart/plot/dial/StandardDialRange.java","org.jfree.chart.plot.dial","StandardDialRange.java","36"
"./org/jfree/chart/plot/dial/DialFrame.java","org.jfree.chart.plot.dial","DialFrame.java","10"
"./org/jfree/chart/plot/dial/DialTextAnnotation.java","org.jfree.chart.plot.dial","DialTextAnnotation.java","37"
"./org/jfree/chart/plot/dial/DialBackground.java","org.jfree.chart.plot.dial","DialBackground.java","45"
"./org/jfree/chart/plot/dial/StandardDialScale.java","org.jfree.chart.plot.dial","StandardDialScale.java","101"
"./org/jfree/chart/plot/dial/DialLayer.java","org.jfree.chart.plot.dial","DialLayer.java","13"
"./org/jfree/chart/plot/dial/DialScale.java","org.jfree.chart.plot.dial","DialScale.java","7"
"./org/jfree/chart/plot/dial/DialCap.java","org.jfree.chart.plot.dial","DialCap.java","30"
"./org/jfree/chart/plot/dial/StandardDialFrame.java","org.jfree.chart.plot.dial","StandardDialFrame.java","43"
"./org/jfree/chart/plot/dial/DialValueIndicator.java","org.jfree.chart.plot.dial","DialValueIndicator.java","73"
"./org/jfree/chart/plot/dial/DialPlot.java","org.jfree.chart.plot.dial","DialPlot.java","76"
"./org/jfree/chart/plot/dial/package-info.java","org.jfree.chart.plot.dial","package-info.java","2"
"./org/jfree/chart/plot/dial/DialPointer.java","org.jfree.chart.plot.dial","DialPointer.java","42"
"./org/jfree/chart/plot/pie/PieLabelLinkStyle.java","org.jfree.chart.plot.pie","PieLabelLinkStyle.java","7"
"./org/jfree/chart/plot/pie/MultiplePiePlot.java","org.jfree.chart.plot.pie","MultiplePiePlot.java","64"
"./org/jfree/chart/plot/pie/AbstractPieLabelDistributor.java","org.jfree.chart.plot.pie","AbstractPieLabelDistributor.java","9"
"./org/jfree/chart/plot/pie/PiePlotState.java","org.jfree.chart.plot.pie","PiePlotState.java","9"
"./org/jfree/chart/plot/pie/PieLabelRecord.java","org.jfree.chart.plot.pie","PieLabelRecord.java","25"
"./org/jfree/chart/plot/pie/PiePlot.java","org.jfree.chart.plot.pie","PiePlot.java","288"
"./org/jfree/chart/plot/pie/PieLabelDistributor.java","org.jfree.chart.plot.pie","PieLabelDistributor.java","30"
"./org/jfree/chart/plot/pie/package-info.java","org.jfree.chart.plot.pie","package-info.java","1"
"./org/jfree/chart/plot/DialShape.java","org.jfree.chart.plot","DialShape.java","7"
"./org/jfree/chart/plot/MeterPlot.java","org.jfree.chart.plot","MeterPlot.java","107"
"./org/jfree/chart/plot/ValueMarker.java","org.jfree.chart.plot","ValueMarker.java","15"
"./org/jfree/chart/plot/ValueAxisPlot.java","org.jfree.chart.plot","ValueAxisPlot.java","7"
"./org/jfree/chart/plot/DatasetRenderingOrder.java","org.jfree.chart.plot","DatasetRenderingOrder.java","7"
"./org/jfree/chart/plot/CategoryPlot.java","org.jfree.chart.plot","CategoryPlot.java","623"
"./org/jfree/chart/plot/XYPlot.java","org.jfree.chart.plot","XYPlot.java","721"
"./org/jfree/chart/plot/IntervalMarker.java","org.jfree.chart.plot","IntervalMarker.java","35"
"./org/jfree/chart/plot/CategoryMarker.java","org.jfree.chart.plot","CategoryMarker.java","18"
"./org/jfree/chart/plot/ThermometerPlot.java","org.jfree.chart.plot","ThermometerPlot.java","154"
"./org/jfree/chart/plot/CenterTextMode.java","org.jfree.chart.plot","CenterTextMode.java","7"
"./org/jfree/chart/plot/compass/MeterNeedle.java","org.jfree.chart.plot.compass","MeterNeedle.java","37"
"./org/jfree/chart/plot/compass/MiddlePinNeedle.java","org.jfree.chart.plot.compass","MiddlePinNeedle.java","17"
"./org/jfree/chart/plot/compass/WindNeedle.java","org.jfree.chart.plot.compass","WindNeedle.java","14"
"./org/jfree/chart/plot/compass/PointerNeedle.java","org.jfree.chart.plot.compass","PointerNeedle.java","21"
"./org/jfree/chart/plot/compass/ShipNeedle.java","org.jfree.chart.plot.compass","ShipNeedle.java","20"
"./org/jfree/chart/plot/compass/LongNeedle.java","org.jfree.chart.plot.compass","LongNeedle.java","21"
"./org/jfree/chart/plot/compass/ArrowNeedle.java","org.jfree.chart.plot.compass","ArrowNeedle.java","20"
"./org/jfree/chart/plot/compass/PinNeedle.java","org.jfree.chart.plot.compass","PinNeedle.java","17"
"./org/jfree/chart/plot/compass/PlumNeedle.java","org.jfree.chart.plot.compass","PlumNeedle.java","17"
"./org/jfree/chart/plot/compass/CompassPlot.java","org.jfree.chart.plot.compass","CompassPlot.java","68"
"./org/jfree/chart/plot/compass/package-info.java","org.jfree.chart.plot.compass","package-info.java","1"
"./org/jfree/chart/plot/compass/LineNeedle.java","org.jfree.chart.plot.compass","LineNeedle.java","15"
"./org/jfree/chart/plot/CategoryCrosshairState.java","org.jfree.chart.plot","CategoryCrosshairState.java","19"
"./org/jfree/chart/plot/CombinedRangeXYPlot.java","org.jfree.chart.plot","CombinedRangeXYPlot.java","91"
"./org/jfree/chart/plot/CombinedDomainXYPlot.java","org.jfree.chart.plot","CombinedDomainXYPlot.java","98"
"./org/jfree/chart/plot/SpiderWebPlot.java","org.jfree.chart.plot","SpiderWebPlot.java","101"
"./org/jfree/chart/plot/Marker.java","org.jfree.chart.plot","Marker.java","59"
"./org/jfree/chart/plot/Plot.java","org.jfree.chart.plot","Plot.java","181"
"./org/jfree/chart/plot/CombinedDomainCategoryPlot.java","org.jfree.chart.plot","CombinedDomainCategoryPlot.java","83"
"./org/jfree/chart/plot/package-info.java","org.jfree.chart.plot","package-info.java","1"
"./org/jfree/chart/plot/PlotOrientation.java","org.jfree.chart.plot","PlotOrientation.java","8"
"./org/jfree/chart/plot/flow/FlowPlot.java","org.jfree.chart.plot.flow","FlowPlot.java","103"
"./org/jfree/chart/plot/flow/package-info.java","org.jfree.chart.plot.flow","package-info.java","2"
"./org/jfree/chart/util/StringUtils.java","org.jfree.chart.util","StringUtils.java","12"
"./org/jfree/chart/util/DirectionalGradientPaintTransformer.java","org.jfree.chart.util","DirectionalGradientPaintTransformer.java","15"
"./org/jfree/chart/util/GradientPaintTransformer.java","org.jfree.chart.util","GradientPaintTransformer.java","11"
"./org/jfree/chart/util/StandardGradientPaintTransformer.java","org.jfree.chart.util","StandardGradientPaintTransformer.java","40"
"./org/jfree/chart/util/AttrStringUtils.java","org.jfree.chart.util","AttrStringUtils.java","42"
"./org/jfree/chart/util/ShadowGenerator.java","org.jfree.chart.util","ShadowGenerator.java","11"
"./org/jfree/chart/util/DefaultShadowGenerator.java","org.jfree.chart.util","DefaultShadowGenerator.java","28"
"./org/jfree/chart/util/GradientPaintTransformType.java","org.jfree.chart.util","GradientPaintTransformType.java","8"
"./org/jfree/chart/util/package-info.java","org.jfree.chart.util","package-info.java","1"
"./org/jfree/chart/util/ExportUtils.java","org.jfree.chart.util","ExportUtils.java","25"
"./org/jfree/chart/util/PaintAlpha.java","org.jfree.chart.util","PaintAlpha.java","36"
"./org/jfree/chart/title/Title.java","org.jfree.chart.title","Title.java","51"
"./org/jfree/chart/title/ShortTextTitle.java","org.jfree.chart.title","ShortTextTitle.java","34"
"./org/jfree/chart/title/ImageTitle.java","org.jfree.chart.title","ImageTitle.java","30"
"./org/jfree/chart/title/DateTitle.java","org.jfree.chart.title","DateTitle.java","15"
"./org/jfree/chart/title/TextTitle.java","org.jfree.chart.title","TextTitle.java","99"
"./org/jfree/chart/title/package-info.java","org.jfree.chart.title","package-info.java","1"
"./org/jfree/chart/title/CompositeTitle.java","org.jfree.chart.title","CompositeTitle.java","20"
"./org/jfree/chart/JFreeChart.java","org.jfree.chart","JFreeChart.java","188"
"./org/jfree/chart/entity/CategoryLabelEntity.java","org.jfree.chart.entity","CategoryLabelEntity.java","13"
"./org/jfree/chart/entity/TitleEntity.java","org.jfree.chart.entity","TitleEntity.java","22"
"./org/jfree/chart/entity/PlotEntity.java","org.jfree.chart.entity","PlotEntity.java","21"
"./org/jfree/chart/entity/AxisEntity.java","org.jfree.chart.entity","AxisEntity.java","22"
"./org/jfree/chart/entity/TickLabelEntity.java","org.jfree.chart.entity","TickLabelEntity.java","7"
"./org/jfree/chart/entity/CategoryItemEntity.java","org.jfree.chart.entity","CategoryItemEntity.java","15"
"./org/jfree/chart/entity/EntityCollection.java","org.jfree.chart.entity","EntityCollection.java","9"
"./org/jfree/chart/entity/JFreeChartEntity.java","org.jfree.chart.entity","JFreeChartEntity.java","21"
"./org/jfree/chart/entity/LegendItemEntity.java","org.jfree.chart.entity","LegendItemEntity.java","18"
"./org/jfree/chart/entity/PieSectionEntity.java","org.jfree.chart.entity","PieSectionEntity.java","15"
"./org/jfree/chart/entity/StandardEntityCollection.java","org.jfree.chart.entity","StandardEntityCollection.java","19"
"./org/jfree/chart/entity/ChartEntity.java","org.jfree.chart.entity","ChartEntity.java","51"
"./org/jfree/chart/entity/XYItemEntity.java","org.jfree.chart.entity","XYItemEntity.java","13"
"./org/jfree/chart/entity/FlowEntity.java","org.jfree.chart.entity","FlowEntity.java","12"
"./org/jfree/chart/entity/NodeEntity.java","org.jfree.chart.entity","NodeEntity.java","7"
"./org/jfree/chart/entity/package-info.java","org.jfree.chart.entity","package-info.java","1"
"./org/jfree/chart/entity/XYAnnotationEntity.java","org.jfree.chart.entity","XYAnnotationEntity.java","12"
"./org/jfree/chart/ChartUtils.java","org.jfree.chart","ChartUtils.java","97"
"./org/jfree/chart/swing/ApplicationFrame.java","org.jfree.chart.swing","ApplicationFrame.java","26"
"./org/jfree/chart/swing/DefaultSelectionZoomStrategy.java","org.jfree.chart.swing","DefaultSelectionZoomStrategy.java","20"
"./org/jfree/chart/swing/SelectionZoomStrategy.java","org.jfree.chart.swing","SelectionZoomStrategy.java","17"
"./org/jfree/chart/swing/ChartMouseListener.java","org.jfree.chart.swing","ChartMouseListener.java","11"
"./org/jfree/chart/swing/PolarChartPanel.java","org.jfree.chart.swing","PolarChartPanel.java","28"
"./org/jfree/chart/swing/UIUtils.java","org.jfree.chart.swing","UIUtils.java","19"
"./org/jfree/chart/swing/ChartFrame.java","org.jfree.chart.swing","ChartFrame.java","12"
"./org/jfree/chart/swing/NumberCellRenderer.java","org.jfree.chart.swing","NumberCellRenderer.java","11"
"./org/jfree/chart/swing/ChartPanel.java","org.jfree.chart.swing","ChartPanel.java","417"
"./org/jfree/chart/swing/OverlayChangeListener.java","org.jfree.chart.swing","OverlayChangeListener.java","8"
"./org/jfree/chart/swing/CrosshairOverlay.java","org.jfree.chart.swing","CrosshairOverlay.java","79"
"./org/jfree/chart/swing/OverlayChangeEvent.java","org.jfree.chart.swing","OverlayChangeEvent.java","7"
"./org/jfree/chart/swing/MouseWheelHandler.java","org.jfree.chart.swing","MouseWheelHandler.java","17"
"./org/jfree/chart/swing/Overlay.java","org.jfree.chart.swing","Overlay.java","12"
"./org/jfree/chart/swing/ChartMouseEvent.java","org.jfree.chart.swing","ChartMouseEvent.java","10"
"./org/jfree/chart/swing/AbstractOverlay.java","org.jfree.chart.swing","AbstractOverlay.java","17"
"./org/jfree/chart/swing/editor/DefaultChartEditorFactory.java","org.jfree.chart.swing.editor","DefaultChartEditorFactory.java","7"
"./org/jfree/chart/swing/editor/DefaultPolarPlotEditor.java","org.jfree.chart.swing.editor","DefaultPolarPlotEditor.java","18"
"./org/jfree/chart/swing/editor/FontDisplayField.java","org.jfree.chart.swing.editor","FontDisplayField.java","11"
"./org/jfree/chart/swing/editor/DefaultTitleEditor.java","org.jfree.chart.swing.editor","DefaultTitleEditor.java","24"
"./org/jfree/chart/swing/editor/PaintSample.java","org.jfree.chart.swing.editor","PaintSample.java","6"
"./org/jfree/chart/swing/editor/DefaultLogAxisEditor.java","org.jfree.chart.swing.editor","DefaultLogAxisEditor.java","17"
"./org/jfree/chart/swing/editor/ChartEditorManager.java","org.jfree.chart.swing.editor","ChartEditorManager.java","8"
"./org/jfree/chart/swing/editor/DefaultValueAxisEditor.java","org.jfree.chart.swing.editor","DefaultValueAxisEditor.java","37"
"./org/jfree/chart/swing/editor/ChartEditorFactory.java","org.jfree.chart.swing.editor","ChartEditorFactory.java","8"
"./org/jfree/chart/swing/editor/ChartEditor.java","org.jfree.chart.swing.editor","ChartEditor.java","8"
"./org/jfree/chart/swing/editor/FontChooserPanel.java","org.jfree.chart.swing.editor","FontChooserPanel.java","19"
"./org/jfree/chart/swing/editor/DefaultPlotEditor.java","org.jfree.chart.swing.editor","DefaultPlotEditor.java","76"
"./org/jfree/chart/swing/editor/DefaultNumberAxisEditor.java","org.jfree.chart.swing.editor","DefaultNumberAxisEditor.java","16"
"./org/jfree/chart/swing/editor/DefaultChartEditor.java","org.jfree.chart.swing.editor","DefaultChartEditor.java","19"
"./org/jfree/chart/swing/editor/DefaultAxisEditor.java","org.jfree.chart.swing.editor","DefaultAxisEditor.java","35"
"./org/jfree/chart/swing/editor/LCBLayout.java","org.jfree.chart.swing.editor","LCBLayout.java","29"
"./org/jfree/chart/swing/editor/package-info.java","org.jfree.chart.swing.editor","package-info.java","2"
"./org/jfree/chart/swing/editor/StrokeChooserPanel.java","org.jfree.chart.swing.editor","StrokeChooserPanel.java","9"
"./org/jfree/chart/swing/editor/StrokeSample.java","org.jfree.chart.swing.editor","StrokeSample.java","11"
"./org/jfree/chart/swing/package-info.java","org.jfree.chart.swing","package-info.java","2"
"./org/jfree/chart/date/SpreadsheetDate.java","org.jfree.chart.date","SpreadsheetDate.java","64"
"./org/jfree/chart/date/MonthConstants.java","org.jfree.chart.date","MonthConstants.java","19"
"./org/jfree/chart/date/SerialDate.java","org.jfree.chart.date","SerialDate.java","143"
"./org/jfree/chart/date/package-info.java","org.jfree.chart.date","package-info.java","2"
"./org/jfree/chart/labels/IntervalXYItemLabelGenerator.java","org.jfree.chart.labels","IntervalXYItemLabelGenerator.java","62"
"./org/jfree/chart/labels/XYItemLabelGenerator.java","org.jfree.chart.labels","XYItemLabelGenerator.java","9"
"./org/jfree/chart/labels/StandardPieToolTipGenerator.java","org.jfree.chart.labels","StandardPieToolTipGenerator.java","22"
"./org/jfree/chart/labels/IntervalXYToolTipGenerator.java","org.jfree.chart.labels","IntervalXYToolTipGenerator.java","62"
"./org/jfree/chart/labels/BoxAndWhiskerXYToolTipGenerator.java","org.jfree.chart.labels","BoxAndWhiskerXYToolTipGenerator.java","28"
"./org/jfree/chart/labels/AbstractCategoryItemLabelGenerator.java","org.jfree.chart.labels","AbstractCategoryItemLabelGenerator.java","55"
"./org/jfree/chart/labels/XYToolTipGenerator.java","org.jfree.chart.labels","XYToolTipGenerator.java","8"
"./org/jfree/chart/labels/MultipleXYSeriesLabelGenerator.java","org.jfree.chart.labels","MultipleXYSeriesLabelGenerator.java","38"
"./org/jfree/chart/labels/CustomXYToolTipGenerator.java","org.jfree.chart.labels","CustomXYToolTipGenerator.java","22"
"./org/jfree/chart/labels/XYZToolTipGenerator.java","org.jfree.chart.labels","XYZToolTipGenerator.java","8"
"./org/jfree/chart/labels/BoxAndWhiskerToolTipGenerator.java","org.jfree.chart.labels","BoxAndWhiskerToolTipGenerator.java","27"
"./org/jfree/chart/labels/AbstractXYItemLabelGenerator.java","org.jfree.chart.labels","AbstractXYItemLabelGenerator.java","79"
"./org/jfree/chart/labels/ItemLabelAnchor.java","org.jfree.chart.labels","ItemLabelAnchor.java","6"
"./org/jfree/chart/labels/IntervalCategoryItemLabelGenerator.java","org.jfree.chart.labels","IntervalCategoryItemLabelGenerator.java","31"
"./org/jfree/chart/labels/XYSeriesLabelGenerator.java","org.jfree.chart.labels","XYSeriesLabelGenerator.java","11"
"./org/jfree/chart/labels/SymbolicXYItemLabelGenerator.java","org.jfree.chart.labels","SymbolicXYItemLabelGenerator.java","19"
"./org/jfree/chart/labels/BubbleXYItemLabelGenerator.java","org.jfree.chart.labels","BubbleXYItemLabelGenerator.java","52"
"./org/jfree/chart/labels/FlowLabelGenerator.java","org.jfree.chart.labels","FlowLabelGenerator.java","8"
"./org/jfree/chart/labels/StandardCategorySeriesLabelGenerator.java","org.jfree.chart.labels","StandardCategorySeriesLabelGenerator.java","24"
"./org/jfree/chart/labels/PieToolTipGenerator.java","org.jfree.chart.labels","PieToolTipGenerator.java","8"
"./org/jfree/chart/labels/StandardCrosshairLabelGenerator.java","org.jfree.chart.labels","StandardCrosshairLabelGenerator.java","22"
"./org/jfree/chart/labels/StandardXYItemLabelGenerator.java","org.jfree.chart.labels","StandardXYItemLabelGenerator.java","43"
"./org/jfree/chart/labels/StandardFlowLabelGenerator.java","org.jfree.chart.labels","StandardFlowLabelGenerator.java","15"
"./org/jfree/chart/labels/StandardCategoryToolTipGenerator.java","org.jfree.chart.labels","StandardCategoryToolTipGenerator.java","23"
"./org/jfree/chart/labels/StandardXYZToolTipGenerator.java","org.jfree.chart.labels","StandardXYZToolTipGenerator.java","50"
"./org/jfree/chart/labels/StandardPieSectionLabelGenerator.java","org.jfree.chart.labels","StandardPieSectionLabelGenerator.java","32"
"./org/jfree/chart/labels/StandardCategoryItemLabelGenerator.java","org.jfree.chart.labels","StandardCategoryItemLabelGenerator.java","30"
"./org/jfree/chart/labels/PieSectionLabelGenerator.java","org.jfree.chart.labels","PieSectionLabelGenerator.java","11"
"./org/jfree/chart/labels/CrosshairLabelGenerator.java","org.jfree.chart.labels","CrosshairLabelGenerator.java","8"
"./org/jfree/chart/labels/StandardXYToolTipGenerator.java","org.jfree.chart.labels","StandardXYToolTipGenerator.java","40"
"./org/jfree/chart/labels/ItemLabelPosition.java","org.jfree.chart.labels","ItemLabelPosition.java","15"
"./org/jfree/chart/labels/IntervalCategoryToolTipGenerator.java","org.jfree.chart.labels","IntervalCategoryToolTipGenerator.java","34"
"./org/jfree/chart/labels/CategoryToolTipGenerator.java","org.jfree.chart.labels","CategoryToolTipGenerator.java","9"
"./org/jfree/chart/labels/AbstractPieItemLabelGenerator.java","org.jfree.chart.labels","AbstractPieItemLabelGenerator.java","42"
"./org/jfree/chart/labels/StandardXYSeriesLabelGenerator.java","org.jfree.chart.labels","StandardXYSeriesLabelGenerator.java","28"
"./org/jfree/chart/labels/CategorySeriesLabelGenerator.java","org.jfree.chart.labels","CategorySeriesLabelGenerator.java","10"
"./org/jfree/chart/labels/package-info.java","org.jfree.chart.labels","package-info.java","2"
"./org/jfree/chart/labels/HighLowItemLabelGenerator.java","org.jfree.chart.labels","HighLowItemLabelGenerator.java","38"
"./org/jfree/chart/labels/CategoryItemLabelGenerator.java","org.jfree.chart.labels","CategoryItemLabelGenerator.java","11"
"./org/jfree/chart/internal/ShapeUtils.java","org.jfree.chart.internal","ShapeUtils.java","61"
"./org/jfree/chart/internal/ArrayUtils.java","org.jfree.chart.internal","ArrayUtils.java","36"
"./org/jfree/chart/internal/LineUtils.java","org.jfree.chart.internal","LineUtils.java","23"
"./org/jfree/chart/internal/SerialUtils.java","org.jfree.chart.internal","SerialUtils.java","78"
"./org/jfree/chart/internal/CloneUtils.java","org.jfree.chart.internal","CloneUtils.java","27"
"./org/jfree/chart/internal/PaintUtils.java","org.jfree.chart.internal","PaintUtils.java","29"
"./org/jfree/chart/internal/Args.java","org.jfree.chart.internal","Args.java","22"
"./org/jfree/chart/internal/package-info.java","org.jfree.chart.internal","package-info.java","1"
"./org/jfree/chart/internal/HashUtils.java","org.jfree.chart.internal","HashUtils.java","13"
"./org/jfree/chart/ChartHints.java","org.jfree.chart","ChartHints.java","12"
"./org/jfree/chart/ChartElement.java","org.jfree.chart","ChartElement.java","7"
"./org/jfree/chart/ChartElementVisitor.java","org.jfree.chart","ChartElementVisitor.java","7"
"./org/jfree/chart/annotations/XYImageAnnotation.java","org.jfree.chart.annotations","XYImageAnnotation.java","30"
"./org/jfree/chart/annotations/TextAnnotation.java","org.jfree.chart.annotations","TextAnnotation.java","27"
"./org/jfree/chart/annotations/XYTextAnnotation.java","org.jfree.chart.annotations","XYTextAnnotation.java","50"
"./org/jfree/chart/annotations/AbstractAnnotation.java","org.jfree.chart.annotations","AbstractAnnotation.java","36"
"./org/jfree/chart/annotations/XYDrawableAnnotation.java","org.jfree.chart.annotations","XYDrawableAnnotation.java","28"
"./org/jfree/chart/annotations/XYTitleAnnotation.java","org.jfree.chart.annotations","XYTitleAnnotation.java","38"
"./org/jfree/chart/annotations/CategoryLineAnnotation.java","org.jfree.chart.annotations","CategoryLineAnnotation.java","38"
"./org/jfree/chart/annotations/XYDataImageAnnotation.java","org.jfree.chart.annotations","XYDataImageAnnotation.java","38"
"./org/jfree/chart/annotations/XYAnnotation.java","org.jfree.chart.annotations","XYAnnotation.java","8"
"./org/jfree/chart/annotations/XYPolygonAnnotation.java","org.jfree.chart.annotations","XYPolygonAnnotation.java","30"
"./org/jfree/chart/annotations/XYLineAnnotation.java","org.jfree.chart.annotations","XYLineAnnotation.java","44"
"./org/jfree/chart/annotations/CategoryPointerAnnotation.java","org.jfree.chart.annotations","CategoryPointerAnnotation.java","28"
"./org/jfree/chart/annotations/XYShapeAnnotation.java","org.jfree.chart.annotations","XYShapeAnnotation.java","33"
"./org/jfree/chart/annotations/XYPointerAnnotation.java","org.jfree.chart.annotations","XYPointerAnnotation.java","30"
"./org/jfree/chart/annotations/CategoryTextAnnotation.java","org.jfree.chart.annotations","CategoryTextAnnotation.java","17"
"./org/jfree/chart/annotations/AbstractXYAnnotation.java","org.jfree.chart.annotations","AbstractXYAnnotation.java","25"
"./org/jfree/chart/annotations/XYBoxAnnotation.java","org.jfree.chart.annotations","XYBoxAnnotation.java","37"
"./org/jfree/chart/annotations/package-info.java","org.jfree.chart.annotations","package-info.java","2"
"./org/jfree/chart/annotations/Annotation.java","org.jfree.chart.annotations","Annotation.java","10"
"./org/jfree/chart/annotations/CategoryAnnotation.java","org.jfree.chart.annotations","CategoryAnnotation.java","7"
"./org/jfree/chart/annotations/XYAnnotationBoundsInfo.java","org.jfree.chart.annotations","XYAnnotationBoundsInfo.java","8"
"./org/jfree/chart/StandardChartTheme.java","org.jfree.chart","StandardChartTheme.java","157"
"./org/jfree/chart/urls/StandardXYZURLGenerator.java","org.jfree.chart.urls","StandardXYZURLGenerator.java","7"
"./org/jfree/chart/urls/CustomXYURLGenerator.java","org.jfree.chart.urls","CustomXYURLGenerator.java","24"
"./org/jfree/chart/urls/CustomCategoryURLGenerator.java","org.jfree.chart.urls","CustomCategoryURLGenerator.java","23"
"./org/jfree/chart/urls/CategoryURLGenerator.java","org.jfree.chart.urls","CategoryURLGenerator.java","10"
"./org/jfree/chart/urls/CustomPieURLGenerator.java","org.jfree.chart.urls","CustomPieURLGenerator.java","27"
"./org/jfree/chart/urls/XYZURLGenerator.java","org.jfree.chart.urls","XYZURLGenerator.java","10"
"./org/jfree/chart/urls/TimeSeriesURLGenerator.java","org.jfree.chart.urls","TimeSeriesURLGenerator.java","23"
"./org/jfree/chart/urls/PieURLGenerator.java","org.jfree.chart.urls","PieURLGenerator.java","13"
"./org/jfree/chart/urls/XYURLGenerator.java","org.jfree.chart.urls","XYURLGenerator.java","10"
"./org/jfree/chart/urls/StandardCategoryURLGenerator.java","org.jfree.chart.urls","StandardCategoryURLGenerator.java","14"
"./org/jfree/chart/urls/package-info.java","org.jfree.chart.urls","package-info.java","2"
"./org/jfree/chart/urls/StandardPieURLGenerator.java","org.jfree.chart.urls","StandardPieURLGenerator.java","15"
"./org/jfree/chart/urls/StandardXYURLGenerator.java","org.jfree.chart.urls","StandardXYURLGenerator.java","14"
"./org/jfree/chart/encoders/SunJPEGEncoderAdapter.java","org.jfree.chart.encoders","SunJPEGEncoderAdapter.java","16"
"./org/jfree/chart/encoders/SunPNGEncoderAdapter.java","org.jfree.chart.encoders","SunPNGEncoderAdapter.java","12"
"./org/jfree/chart/encoders/ImageEncoderFactory.java","org.jfree.chart.encoders","ImageEncoderFactory.java","39"
"./org/jfree/chart/encoders/EncoderUtil.java","org.jfree.chart.encoders","EncoderUtil.java","51"
"./org/jfree/chart/encoders/ImageFormat.java","org.jfree.chart.encoders","ImageFormat.java","9"
"./org/jfree/chart/encoders/ImageEncoder.java","org.jfree.chart.encoders","ImageEncoder.java","11"
"./org/jfree/chart/encoders/package-info.java","org.jfree.chart.encoders","package-info.java","2"
"./org/jfree/chart/axis/SubCategoryAxis.java","org.jfree.chart.axis","SubCategoryAxis.java","49"
"./org/jfree/chart/axis/DateTickUnitType.java","org.jfree.chart.axis","DateTickUnitType.java","7"
"./org/jfree/chart/axis/ModuloAxis.java","org.jfree.chart.axis","ModuloAxis.java","37"
"./org/jfree/chart/axis/AxisLocation.java","org.jfree.chart.axis","AxisLocation.java","7"
"./org/jfree/chart/axis/LogarithmicAxis.java","org.jfree.chart.axis","LogarithmicAxis.java","142"
"./org/jfree/chart/axis/CategoryAxis.java","org.jfree.chart.axis","CategoryAxis.java","129"
"./org/jfree/chart/axis/CategoryTick.java","org.jfree.chart.axis","CategoryTick.java","14"
"./org/jfree/chart/axis/NumberTickUnit.java","org.jfree.chart.axis","NumberTickUnit.java","27"
"./org/jfree/chart/axis/DateTickMarkPosition.java","org.jfree.chart.axis","DateTickMarkPosition.java","6"
"./org/jfree/chart/axis/TickUnits.java","org.jfree.chart.axis","TickUnits.java","21"
"./org/jfree/chart/axis/PeriodAxis.java","org.jfree.chart.axis","PeriodAxis.java","117"
"./org/jfree/chart/axis/Tick.java","org.jfree.chart.axis","Tick.java","17"
"./org/jfree/chart/axis/Axis.java","org.jfree.chart.axis","Axis.java","174"
"./org/jfree/chart/axis/AxisCollection.java","org.jfree.chart.axis","AxisCollection.java","11"
"./org/jfree/chart/axis/Timeline.java","org.jfree.chart.axis","Timeline.java","25"
"./org/jfree/chart/axis/ExtendedCategoryAxis.java","org.jfree.chart.axis","ExtendedCategoryAxis.java","30"
"./org/jfree/chart/axis/NumberTick.java","org.jfree.chart.axis","NumberTick.java","6"
"./org/jfree/chart/axis/NumberAxis.java","org.jfree.chart.axis","NumberAxis.java","154"
"./org/jfree/chart/axis/DateTickUnit.java","org.jfree.chart.axis","DateTickUnit.java","45"
"./org/jfree/chart/axis/MarkerAxisBand.java","org.jfree.chart.axis","MarkerAxisBand.java","22"
"./org/jfree/chart/axis/QuarterDateFormat.java","org.jfree.chart.axis","QuarterDateFormat.java","23"
"./org/jfree/chart/axis/TickUnitSource.java","org.jfree.chart.axis","TickUnitSource.java","9"
"./org/jfree/chart/axis/MonthDateFormat.java","org.jfree.chart.axis","MonthDateFormat.java","36"
"./org/jfree/chart/axis/TickType.java","org.jfree.chart.axis","TickType.java","6"
"./org/jfree/chart/axis/PeriodAxisLabelInfo.java","org.jfree.chart.axis","PeriodAxisLabelInfo.java","32"
"./org/jfree/chart/axis/TickUnit.java","org.jfree.chart.axis","TickUnit.java","20"
"./org/jfree/chart/axis/StandardTickUnitSource.java","org.jfree.chart.axis","StandardTickUnitSource.java","12"
"./org/jfree/chart/axis/CyclicNumberAxis.java","org.jfree.chart.axis","CyclicNumberAxis.java","105"
"./org/jfree/chart/axis/AxisSpace.java","org.jfree.chart.axis","AxisSpace.java","45"
"./org/jfree/chart/axis/CategoryLabelPosition.java","org.jfree.chart.axis","CategoryLabelPosition.java","18"
"./org/jfree/chart/axis/SymbolAxis.java","org.jfree.chart.axis","SymbolAxis.java","81"
"./org/jfree/chart/axis/CategoryLabelWidthType.java","org.jfree.chart.axis","CategoryLabelWidthType.java","7"
"./org/jfree/chart/axis/AxisLabelLocation.java","org.jfree.chart.axis","AxisLabelLocation.java","6"
"./org/jfree/chart/axis/LogTick.java","org.jfree.chart.axis","LogTick.java","9"
"./org/jfree/chart/axis/LogAxis.java","org.jfree.chart.axis","LogAxis.java","118"
"./org/jfree/chart/axis/CompassFormat.java","org.jfree.chart.axis","CompassFormat.java","24"
"./org/jfree/chart/axis/DateTick.java","org.jfree.chart.axis","DateTick.java","11"
"./org/jfree/chart/axis/DateAxis.java","org.jfree.chart.axis","DateAxis.java","195"
"./org/jfree/chart/axis/CategoryAnchor.java","org.jfree.chart.axis","CategoryAnchor.java","6"
"./org/jfree/chart/axis/CategoryLabelPositions.java","org.jfree.chart.axis","CategoryLabelPositions.java","26"
"./org/jfree/chart/axis/package-info.java","org.jfree.chart.axis","package-info.java","1"
"./org/jfree/chart/axis/ValueTick.java","org.jfree.chart.axis","ValueTick.java","11"
"./org/jfree/chart/axis/ValueAxis.java","org.jfree.chart.axis","ValueAxis.java","191"
"./org/jfree/chart/axis/NumberTickUnitSource.java","org.jfree.chart.axis","NumberTickUnitSource.java","39"
"./org/jfree/chart/axis/AxisState.java","org.jfree.chart.axis","AxisState.java","17"
"./org/jfree/chart/ChartRenderingInfo.java","org.jfree.chart","ChartRenderingInfo.java","32"
"./org/jfree/chart/ChartTransferable.java","org.jfree.chart","ChartTransferable.java","27"
"./org/jfree/chart/api/LengthAdjustmentType.java","org.jfree.chart.api","LengthAdjustmentType.java","7"
"./org/jfree/chart/api/RectangleInsets.java","org.jfree.chart.api","RectangleInsets.java","40"
"./org/jfree/chart/api/RectangleAlignment.java","org.jfree.chart.api","RectangleAlignment.java","8"
"./org/jfree/chart/api/UnitType.java","org.jfree.chart.api","UnitType.java","6"
"./org/jfree/chart/api/Rotation.java","org.jfree.chart.api","Rotation.java","9"
"./org/jfree/chart/api/PublicCloneable.java","org.jfree.chart.api","PublicCloneable.java","8"
"./org/jfree/chart/api/TableOrder.java","org.jfree.chart.api","TableOrder.java","7"
"./org/jfree/chart/api/XYCoordinateType.java","org.jfree.chart.api","XYCoordinateType.java","7"
"./org/jfree/chart/api/SortOrder.java","org.jfree.chart.api","SortOrder.java","6"
"./org/jfree/chart/api/RectangleEdge.java","org.jfree.chart.api","RectangleEdge.java","11"
"./org/jfree/chart/api/RectangleAnchor.java","org.jfree.chart.api","RectangleAnchor.java","11"
"./org/jfree/chart/api/HorizontalAlignment.java","org.jfree.chart.api","HorizontalAlignment.java","6"
"./org/jfree/chart/api/VerticalAlignment.java","org.jfree.chart.api","VerticalAlignment.java","6"
"./org/jfree/chart/api/package-info.java","org.jfree.chart.api","package-info.java","1"
"./org/jfree/chart/api/Layer.java","org.jfree.chart.api","Layer.java","7"
"./org/jfree/chart/ChartColor.java","org.jfree.chart","ChartColor.java","6"
"./org/jfree/chart/text/AttributedStringUtils.java","org.jfree.chart.text","AttributedStringUtils.java","16"
"./org/jfree/chart/text/TextBox.java","org.jfree.chart.text","TextBox.java","30"
"./org/jfree/chart/text/TextAnchor.java","org.jfree.chart.text","TextAnchor.java","15"
"./org/jfree/chart/text/TextLine.java","org.jfree.chart.text","TextLine.java","25"
"./org/jfree/chart/text/TextMeasurer.java","org.jfree.chart.text","TextMeasurer.java","6"
"./org/jfree/chart/text/TextBlockAnchor.java","org.jfree.chart.text","TextBlockAnchor.java","7"
"./org/jfree/chart/text/TextBlock.java","org.jfree.chart.text","TextBlock.java","39"
"./org/jfree/chart/text/G2TextMeasurer.java","org.jfree.chart.text","G2TextMeasurer.java","6"
"./org/jfree/chart/text/format/RelativeDateFormat.java","org.jfree.chart.text.format","RelativeDateFormat.java","72"
"./org/jfree/chart/text/format/HMSNumberFormat.java","org.jfree.chart.text.format","HMSNumberFormat.java","19"
"./org/jfree/chart/text/format/LogFormat.java","org.jfree.chart.text.format","LogFormat.java","39"
"./org/jfree/chart/text/format/HexNumberFormat.java","org.jfree.chart.text.format","HexNumberFormat.java","21"
"./org/jfree/chart/text/format/package-info.java","org.jfree.chart.text.format","package-info.java","3"
"./org/jfree/chart/text/TextUtils.java","org.jfree.chart.text","TextUtils.java","104"
"./org/jfree/chart/text/package-info.java","org.jfree.chart.text","package-info.java","1"
"./org/jfree/chart/text/TextFragment.java","org.jfree.chart.text","TextFragment.java","23"
"./org/jfree/chart/event/ChartChangeEventType.java","org.jfree.chart.event","ChartChangeEventType.java","6"
"./org/jfree/chart/event/AxisChangeEvent.java","org.jfree.chart.event","AxisChangeEvent.java","7"
"./org/jfree/chart/event/ChartChangeListener.java","org.jfree.chart.event","ChartChangeListener.java","8"
"./org/jfree/chart/event/ChartChangeEvent.java","org.jfree.chart.event","ChartChangeEvent.java","7"
"./org/jfree/chart/event/PlotChangeEvent.java","org.jfree.chart.event","PlotChangeEvent.java","7"
"./org/jfree/chart/event/TitleChangeListener.java","org.jfree.chart.event","TitleChangeListener.java","8"
"./org/jfree/chart/event/AxisChangeListener.java","org.jfree.chart.event","AxisChangeListener.java","10"
"./org/jfree/chart/event/ChartProgressListener.java","org.jfree.chart.event","ChartProgressListener.java","8"
"./org/jfree/chart/event/ChartProgressEvent.java","org.jfree.chart.event","ChartProgressEvent.java","7"
"./org/jfree/chart/event/MarkerChangeListener.java","org.jfree.chart.event","MarkerChangeListener.java","8"
"./org/jfree/chart/event/TitleChangeEvent.java","org.jfree.chart.event","TitleChangeEvent.java","7"
"./org/jfree/chart/event/AnnotationChangeListener.java","org.jfree.chart.event","AnnotationChangeListener.java","8"
"./org/jfree/chart/event/RendererChangeEvent.java","org.jfree.chart.event","RendererChangeEvent.java","8"
"./org/jfree/chart/event/AnnotationChangeEvent.java","org.jfree.chart.event","AnnotationChangeEvent.java","7"
"./org/jfree/chart/event/PlotChangeListener.java","org.jfree.chart.event","PlotChangeListener.java","8"
"./org/jfree/chart/event/MarkerChangeEvent.java","org.jfree.chart.event","MarkerChangeEvent.java","7"
"./org/jfree/chart/event/RendererChangeListener.java","org.jfree.chart.event","RendererChangeListener.java","8"
"./org/jfree/chart/event/package-info.java","org.jfree.chart.event","package-info.java","2"
"./org/jfree/chart/event/ChartProgressEventType.java","org.jfree.chart.event","ChartProgressEventType.java","6"
"./org/jfree/chart/ChartTheme.java","org.jfree.chart","ChartTheme.java","6"
"./org/jfree/chart/package-info.java","org.jfree.chart","package-info.java","2"
"./org/jfree/chart/block/AbstractBlock.java","org.jfree.chart.block","AbstractBlock.java","58"
"./org/jfree/chart/block/EntityBlockParams.java","org.jfree.chart.block","EntityBlockParams.java","8"
"./org/jfree/chart/block/BlockResult.java","org.jfree.chart.block","BlockResult.java","7"
"./org/jfree/chart/block/LabelBlock.java","org.jfree.chart.block","LabelBlock.java","30"
"./org/jfree/chart/block/BlockParams.java","org.jfree.chart.block","BlockParams.java","7"
"./org/jfree/chart/block/EntityBlockResult.java","org.jfree.chart.block","EntityBlockResult.java","6"
"./org/jfree/chart/block/LengthConstraintType.java","org.jfree.chart.block","LengthConstraintType.java","6"
"./org/jfree/chart/block/Size2D.java","org.jfree.chart.block","Size2D.java","16"
"./org/jfree/chart/block/FlowArrangement.java","org.jfree.chart.block","FlowArrangement.java","43"
"./org/jfree/chart/block/BorderArrangement.java","org.jfree.chart.block","BorderArrangement.java","84"
"./org/jfree/chart/block/GridArrangement.java","org.jfree.chart.block","GridArrangement.java","49"
"./org/jfree/chart/block/ColumnArrangement.java","org.jfree.chart.block","ColumnArrangement.java","44"
"./org/jfree/chart/block/LineBorder.java","org.jfree.chart.block","LineBorder.java","22"
"./org/jfree/chart/block/ColorBlock.java","org.jfree.chart.block","ColorBlock.java","15"
"./org/jfree/chart/block/BlockContainer.java","org.jfree.chart.block","BlockContainer.java","27"
"./org/jfree/chart/block/BlockFrame.java","org.jfree.chart.block","BlockFrame.java","7"
"./org/jfree/chart/block/CenterArrangement.java","org.jfree.chart.block","CenterArrangement.java","29"
"./org/jfree/chart/block/RectangleConstraint.java","org.jfree.chart.block","RectangleConstraint.java","24"
"./org/jfree/chart/block/EmptyBlock.java","org.jfree.chart.block","EmptyBlock.java","9"
"./org/jfree/chart/block/Arrangement.java","org.jfree.chart.block","Arrangement.java","10"
"./org/jfree/chart/block/BlockBorder.java","org.jfree.chart.block","BlockBorder.java","24"
"./org/jfree/chart/block/Block.java","org.jfree.chart.block","Block.java","10"
"./org/jfree/chart/block/package-info.java","org.jfree.chart.block","package-info.java","1"
"./org/jfree/data/statistics/BoxAndWhiskerXYDataset.java","org.jfree.data.statistics","BoxAndWhiskerXYDataset.java","23"
"./org/jfree/data/statistics/DefaultBoxAndWhiskerCategoryDataset.java","org.jfree.data.statistics","DefaultBoxAndWhiskerCategoryDataset.java","69"
"./org/jfree/data/statistics/SimpleHistogramDataset.java","org.jfree.data.statistics","SimpleHistogramDataset.java","50"
"./org/jfree/data/statistics/SimpleHistogramBin.java","org.jfree.data.statistics","SimpleHistogramBin.java","33"
"./org/jfree/data/statistics/HistogramDataset.java","org.jfree.data.statistics","HistogramDataset.java","63"
"./org/jfree/data/statistics/BoxAndWhiskerItem.java","org.jfree.data.statistics","BoxAndWhiskerItem.java","21"
"./org/jfree/data/statistics/Statistics.java","org.jfree.data.statistics","Statistics.java","53"
"./org/jfree/data/statistics/MultiValueCategoryDataset.java","org.jfree.data.statistics","MultiValueCategoryDataset.java","11"
"./org/jfree/data/statistics/MeanAndStandardDeviation.java","org.jfree.data.statistics","MeanAndStandardDeviation.java","13"
"./org/jfree/data/statistics/BoxAndWhiskerCalculator.java","org.jfree.data.statistics","BoxAndWhiskerCalculator.java","29"
"./org/jfree/data/statistics/BoxAndWhiskerCategoryDataset.java","org.jfree.data.statistics","BoxAndWhiskerCategoryDataset.java","28"
"./org/jfree/data/statistics/DefaultBoxAndWhiskerXYDataset.java","org.jfree.data.statistics","DefaultBoxAndWhiskerXYDataset.java","55"
"./org/jfree/data/statistics/HistogramBin.java","org.jfree.data.statistics","HistogramBin.java","12"
"./org/jfree/data/statistics/HistogramType.java","org.jfree.data.statistics","HistogramType.java","6"
"./org/jfree/data/statistics/Regression.java","org.jfree.data.statistics","Regression.java","43"
"./org/jfree/data/statistics/DefaultMultiValueCategoryDataset.java","org.jfree.data.statistics","DefaultMultiValueCategoryDataset.java","41"
"./org/jfree/data/statistics/StatisticalCategoryDataset.java","org.jfree.data.statistics","StatisticalCategoryDataset.java","11"
"./org/jfree/data/statistics/DefaultStatisticalCategoryDataset.java","org.jfree.data.statistics","DefaultStatisticalCategoryDataset.java","62"
"./org/jfree/data/RangeInfo.java","org.jfree.data","RangeInfo.java","7"
"./org/jfree/data/KeyedValues.java","org.jfree.data","KeyedValues.java","16"
"./org/jfree/data/Values.java","org.jfree.data","Values.java","9"
"./org/jfree/data/KeyedValuesItemKey.java","org.jfree.data","KeyedValuesItemKey.java","11"
"./org/jfree/data/ItemKey.java","org.jfree.data","ItemKey.java","8"
"./org/jfree/data/category/DefaultCategoryDataset.java","org.jfree.data.category","DefaultCategoryDataset.java","32"
"./org/jfree/data/category/DefaultIntervalCategoryDataset.java","org.jfree.data.category","DefaultIntervalCategoryDataset.java","94"
"./org/jfree/data/category/CategoryDataset.java","org.jfree.data.category","CategoryDataset.java","7"
"./org/jfree/data/category/IntervalCategoryDataset.java","org.jfree.data.category","IntervalCategoryDataset.java","11"
"./org/jfree/data/category/CategoryToPieDataset.java","org.jfree.data.category","CategoryToPieDataset.java","43"
"./org/jfree/data/category/CategoryRangeInfo.java","org.jfree.data.category","CategoryRangeInfo.java","7"
"./org/jfree/data/category/SlidingCategoryDataset.java","org.jfree.data.category","SlidingCategoryDataset.java","36"
"./org/jfree/data/general/Dataset.java","org.jfree.data.general","Dataset.java","10"
"./org/jfree/data/general/KeyedValuesDataset.java","org.jfree.data.general","KeyedValuesDataset.java","6"
"./org/jfree/data/general/DefaultHeatMapDataset.java","org.jfree.data.general","DefaultHeatMapDataset.java","36"
"./org/jfree/data/general/DefaultValueDataset.java","org.jfree.data.general","DefaultValueDataset.java","13"
"./org/jfree/data/general/AbstractDataset.java","org.jfree.data.general","AbstractDataset.java","42"
"./org/jfree/data/general/SeriesDataset.java","org.jfree.data.general","SeriesDataset.java","11"
"./org/jfree/data/general/Series.java","org.jfree.data.general","Series.java","39"
"./org/jfree/data/general/DefaultKeyedValueDataset.java","org.jfree.data.general","DefaultKeyedValueDataset.java","22"
"./org/jfree/data/general/DatasetChangeListener.java","org.jfree.data.general","DatasetChangeListener.java","9"
"./org/jfree/data/general/DefaultKeyedValuesDataset.java","org.jfree.data.general","DefaultKeyedValuesDataset.java","7"
"./org/jfree/data/general/KeyedValues2DDataset.java","org.jfree.data.general","KeyedValues2DDataset.java","9"
"./org/jfree/data/general/DefaultKeyedValues2DDataset.java","org.jfree.data.general","DefaultKeyedValues2DDataset.java","8"
"./org/jfree/data/general/DatasetUtils.java","org.jfree.data.general","DatasetUtils.java","440"
"./org/jfree/data/general/DatasetChangeEvent.java","org.jfree.data.general","DatasetChangeEvent.java","7"
"./org/jfree/data/general/WaferMapDataset.java","org.jfree.data.general","WaferMapDataset.java","23"
"./org/jfree/data/general/HeatMapDataset.java","org.jfree.data.general","HeatMapDataset.java","14"
"./org/jfree/data/general/HeatMapUtils.java","org.jfree.data.general","HeatMapUtils.java","15"
"./org/jfree/data/general/AbstractSeriesDataset.java","org.jfree.data.general","AbstractSeriesDataset.java","12"
"./org/jfree/data/general/KeyedValueDataset.java","org.jfree.data.general","KeyedValueDataset.java","6"
"./org/jfree/data/general/SeriesChangeEvent.java","org.jfree.data.general","SeriesChangeEvent.java","6"
"./org/jfree/data/general/SeriesException.java","org.jfree.data.general","SeriesException.java","8"
"./org/jfree/data/general/PieDataset.java","org.jfree.data.general","PieDataset.java","9"
"./org/jfree/data/general/SeriesChangeListener.java","org.jfree.data.general","SeriesChangeListener.java","8"
"./org/jfree/data/general/ValueDataset.java","org.jfree.data.general","ValueDataset.java","7"
"./org/jfree/data/general/DefaultPieDataset.java","org.jfree.data.general","DefaultPieDataset.java","41"
"./org/jfree/data/resources/DataPackageResources_fr.java","org.jfree.data.resources","DataPackageResources_fr.java","6"
"./org/jfree/data/resources/DataPackageResources_es.java","org.jfree.data.resources","DataPackageResources_es.java","6"
"./org/jfree/data/resources/DataPackageResources.java","org.jfree.data.resources","DataPackageResources.java","6"
"./org/jfree/data/resources/DataPackageResources_ru.java","org.jfree.data.resources","DataPackageResources_ru.java","6"
"./org/jfree/data/resources/DataPackageResources_pl.java","org.jfree.data.resources","DataPackageResources_pl.java","6"
"./org/jfree/data/resources/DataPackageResources_de.java","org.jfree.data.resources","DataPackageResources_de.java","6"
"./org/jfree/data/KeyToGroupMap.java","org.jfree.data","KeyToGroupMap.java","41"
"./org/jfree/data/KeyedValues2DItemKey.java","org.jfree.data","KeyedValues2DItemKey.java","12"
"./org/jfree/data/io/CSV.java","org.jfree.data.io","CSV.java","17"
"./org/jfree/data/KeyedObjects2D.java","org.jfree.data","KeyedObjects2D.java","57"
"./org/jfree/data/Values2D.java","org.jfree.data","Values2D.java","7"
"./org/jfree/data/DataUtils.java","org.jfree.data","DataUtils.java","37"
"./org/jfree/data/RangeType.java","org.jfree.data","RangeType.java","6"
"./org/jfree/data/DefaultKeyedValues2D.java","org.jfree.data","DefaultKeyedValues2D.java","58"
"./org/jfree/data/function/NormalDistributionFunction2D.java","org.jfree.data.function","NormalDistributionFunction2D.java","16"
"./org/jfree/data/function/Function2D.java","org.jfree.data.function","Function2D.java","8"
"./org/jfree/data/function/PowerFunction2D.java","org.jfree.data.function","PowerFunction2D.java","15"
"./org/jfree/data/function/LineFunction2D.java","org.jfree.data.function","LineFunction2D.java","14"
"./org/jfree/data/function/PolynomialFunction2D.java","org.jfree.data.function","PolynomialFunction2D.java","12"
"./org/jfree/data/KeyedObject.java","org.jfree.data","KeyedObject.java","14"
"./org/jfree/data/xml/PieDatasetHandler.java","org.jfree.data.xml","PieDatasetHandler.java","13"
"./org/jfree/data/xml/ItemHandler.java","org.jfree.data.xml","ItemHandler.java","12"
"./org/jfree/data/xml/DatasetReader.java","org.jfree.data.xml","DatasetReader.java","14"
"./org/jfree/data/xml/CategorySeriesHandler.java","org.jfree.data.xml","CategorySeriesHandler.java","13"
"./org/jfree/data/xml/KeyHandler.java","org.jfree.data.xml","KeyHandler.java","13"
"./org/jfree/data/xml/CategoryDatasetHandler.java","org.jfree.data.xml","CategoryDatasetHandler.java","13"
"./org/jfree/data/xml/DatasetTags.java","org.jfree.data.xml","DatasetTags.java","7"
"./org/jfree/data/xml/RootHandler.java","org.jfree.data.xml","RootHandler.java","11"
"./org/jfree/data/xml/ValueHandler.java","org.jfree.data.xml","ValueHandler.java","14"
"./org/jfree/data/time/Millisecond.java","org.jfree.data.time","Millisecond.java","41"
"./org/jfree/data/time/TimePeriodAnchor.java","org.jfree.data.time","TimePeriodAnchor.java","6"
"./org/jfree/data/time/TimeTableXYDataset.java","org.jfree.data.time","TimeTableXYDataset.java","61"
"./org/jfree/data/time/DateRange.java","org.jfree.data.time","DateRange.java","16"
"./org/jfree/data/time/Week.java","org.jfree.data.time","Week.java","69"
"./org/jfree/data/time/Minute.java","org.jfree.data.time","Minute.java","40"
"./org/jfree/data/time/TimeSeriesTableModel.java","org.jfree.data.time","TimeSeriesTableModel.java","30"
"./org/jfree/data/time/TimePeriodFormatException.java","org.jfree.data.time","TimePeriodFormatException.java","7"
"./org/jfree/data/time/FixedMillisecond.java","org.jfree.data.time","FixedMillisecond.java","22"
"./org/jfree/data/time/ohlc/OHLCItem.java","org.jfree.data.time.ohlc","OHLCItem.java","11"
"./org/jfree/data/time/ohlc/OHLC.java","org.jfree.data.time.ohlc","OHLC.java","14"
"./org/jfree/data/time/ohlc/OHLCSeries.java","org.jfree.data.time.ohlc","OHLCSeries.java","11"
"./org/jfree/data/time/ohlc/OHLCSeriesCollection.java","org.jfree.data.time.ohlc","OHLCSeriesCollection.java","47"
"./org/jfree/data/time/Day.java","org.jfree.data.time","Day.java","38"
"./org/jfree/data/time/TimeSeriesCollection.java","org.jfree.data.time","TimeSeriesCollection.java","73"
"./org/jfree/data/time/TimePeriod.java","org.jfree.data.time","TimePeriod.java","7"
"./org/jfree/data/time/MovingAverage.java","org.jfree.data.time","MovingAverage.java","39"
"./org/jfree/data/time/TimePeriodValuesCollection.java","org.jfree.data.time","TimePeriodValuesCollection.java","46"
"./org/jfree/data/time/Year.java","org.jfree.data.time","Year.java","34"
"./org/jfree/data/time/TimeSeriesDataItem.java","org.jfree.data.time","TimeSeriesDataItem.java","13"
"./org/jfree/data/time/DynamicTimeSeriesCollection.java","org.jfree.data.time","DynamicTimeSeriesCollection.java","80"
"./org/jfree/data/time/Quarter.java","org.jfree.data.time","Quarter.java","42"
"./org/jfree/data/time/SimpleTimePeriod.java","org.jfree.data.time","SimpleTimePeriod.java","21"
"./org/jfree/data/time/Hour.java","org.jfree.data.time","Hour.java","42"
"./org/jfree/data/time/TimeSeries.java","org.jfree.data.time","TimeSeries.java","172"
"./org/jfree/data/time/TimePeriodValue.java","org.jfree.data.time","TimePeriodValue.java","16"
"./org/jfree/data/time/Second.java","org.jfree.data.time","Second.java","45"
"./org/jfree/data/time/Month.java","org.jfree.data.time","Month.java","50"
"./org/jfree/data/time/TimePeriodValues.java","org.jfree.data.time","TimePeriodValues.java","40"
"./org/jfree/data/time/RegularTimePeriod.java","org.jfree.data.time","RegularTimePeriod.java","46"
"./org/jfree/data/gantt/TaskSeries.java","org.jfree.data.gantt","TaskSeries.java","20"
"./org/jfree/data/gantt/SlidingGanttCategoryDataset.java","org.jfree.data.gantt","SlidingGanttCategoryDataset.java","64"
"./org/jfree/data/gantt/TaskSeriesCollection.java","org.jfree.data.gantt","TaskSeriesCollection.java","56"
"./org/jfree/data/gantt/Task.java","org.jfree.data.gantt","Task.java","18"
"./org/jfree/data/gantt/GanttCategoryDataset.java","org.jfree.data.gantt","GanttCategoryDataset.java","17"
"./org/jfree/data/gantt/XYTaskDataset.java","org.jfree.data.gantt","XYTaskDataset.java","37"
"./org/jfree/data/KeyedObjects.java","org.jfree.data","KeyedObjects.java","40"
"./org/jfree/data/DefaultKeyedValue.java","org.jfree.data","DefaultKeyedValue.java","13"
"./org/jfree/data/json/impl/JSONArray.java","org.jfree.data.json.impl","JSONArray.java","18"
"./org/jfree/data/json/impl/JSONValue.java","org.jfree.data.json.impl","JSONValue.java","35"
"./org/jfree/data/json/impl/JSONStreamAware.java","org.jfree.data.json.impl","JSONStreamAware.java","5"
"./org/jfree/data/json/impl/JSONAware.java","org.jfree.data.json.impl","JSONAware.java","4"
"./org/jfree/data/json/impl/JSONObject.java","org.jfree.data.json.impl","JSONObject.java","17"
"./org/jfree/data/json/impl/package-info.java","org.jfree.data.json.impl","package-info.java","2"
"./org/jfree/data/json/JSONUtils.java","org.jfree.data.json","JSONUtils.java","25"
"./org/jfree/data/json/package-info.java","org.jfree.data.json","package-info.java","2"
"./org/jfree/data/KeyedValue.java","org.jfree.data","KeyedValue.java","6"
"./org/jfree/data/Range.java","org.jfree.data","Range.java","57"
"./org/jfree/data/DefaultKeyedValues.java","org.jfree.data","DefaultKeyedValues.java","49"
"./org/jfree/data/KeyedValues2D.java","org.jfree.data","KeyedValues2D.java","16"
"./org/jfree/data/DomainOrder.java","org.jfree.data","DomainOrder.java","7"
"./org/jfree/data/Value.java","org.jfree.data","Value.java","7"
"./org/jfree/data/DomainInfo.java","org.jfree.data","DomainInfo.java","9"
"./org/jfree/data/KeyedValueComparatorType.java","org.jfree.data","KeyedValueComparatorType.java","6"
"./org/jfree/data/ComparableObjectSeries.java","org.jfree.data","ComparableObjectSeries.java","63"
"./org/jfree/data/KeyedValueComparator.java","org.jfree.data","KeyedValueComparator.java","20"
"./org/jfree/data/ComparableObjectItem.java","org.jfree.data","ComparableObjectItem.java","15"
"./org/jfree/data/UnknownKeyException.java","org.jfree.data","UnknownKeyException.java","6"
"./org/jfree/data/xy/XYIntervalDataItem.java","org.jfree.data.xy","XYIntervalDataItem.java","12"
"./org/jfree/data/xy/IntervalXYDelegate.java","org.jfree.data.xy","IntervalXYDelegate.java","46"
"./org/jfree/data/xy/XIntervalSeries.java","org.jfree.data.xy","XIntervalSeries.java","18"
"./org/jfree/data/xy/Vector.java","org.jfree.data.xy","Vector.java","12"
"./org/jfree/data/xy/XYInterval.java","org.jfree.data.xy","XYInterval.java","14"
"./org/jfree/data/xy/YisSymbolic.java","org.jfree.data.xy","YisSymbolic.java","8"
"./org/jfree/data/xy/VectorXYDataset.java","org.jfree.data.xy","VectorXYDataset.java","11"
"./org/jfree/data/xy/XisSymbolic.java","org.jfree.data.xy","XisSymbolic.java","8"
"./org/jfree/data/xy/AbstractIntervalXYDataset.java","org.jfree.data.xy","AbstractIntervalXYDataset.java","14"
"./org/jfree/data/xy/WindDataset.java","org.jfree.data.xy","WindDataset.java","9"
"./org/jfree/data/xy/DefaultIntervalXYDataset.java","org.jfree.data.xy","DefaultIntervalXYDataset.java","98"
"./org/jfree/data/xy/VectorSeries.java","org.jfree.data.xy","VectorSeries.java","18"
"./org/jfree/data/xy/MatrixSeriesCollection.java","org.jfree.data.xy","MatrixSeriesCollection.java","32"
"./org/jfree/data/xy/TableXYDataset.java","org.jfree.data.xy","TableXYDataset.java","7"
"./org/jfree/data/xy/YIntervalSeriesCollection.java","org.jfree.data.xy","YIntervalSeriesCollection.java","30"
"./org/jfree/data/xy/XYIntervalSeries.java","org.jfree.data.xy","XYIntervalSeries.java","20"
"./org/jfree/data/xy/AbstractXYZDataset.java","org.jfree.data.xy","AbstractXYZDataset.java","8"
"./org/jfree/data/xy/IntervalXYZDataset.java","org.jfree.data.xy","IntervalXYZDataset.java","19"
"./org/jfree/data/xy/XYSeriesCollection.java","org.jfree.data.xy","XYSeriesCollection.java","77"
"./org/jfree/data/xy/XYItemKey.java","org.jfree.data.xy","XYItemKey.java","15"
"./org/jfree/data/xy/DefaultXYDataset.java","org.jfree.data.xy","DefaultXYDataset.java","59"
"./org/jfree/data/xy/OHLCDataset.java","org.jfree.data.xy","OHLCDataset.java","17"
"./org/jfree/data/xy/XYDataset.java","org.jfree.data.xy","XYDataset.java","13"
"./org/jfree/data/xy/XYSeries.java","org.jfree.data.xy","XYSeries.java","126"
"./org/jfree/data/xy/XIntervalDataItem.java","org.jfree.data.xy","XIntervalDataItem.java","10"
"./org/jfree/data/xy/OHLCDataItem.java","org.jfree.data.xy","OHLCDataItem.java","19"
"./org/jfree/data/xy/DefaultWindDataset.java","org.jfree.data.xy","DefaultWindDataset.java","59"
"./org/jfree/data/xy/XYDataItem.java","org.jfree.data.xy","XYDataItem.java","19"
"./org/jfree/data/xy/XIntervalSeriesCollection.java","org.jfree.data.xy","XIntervalSeriesCollection.java","33"
"./org/jfree/data/xy/CategoryTableXYDataset.java","org.jfree.data.xy","CategoryTableXYDataset.java","32"
"./org/jfree/data/xy/XYBarDataset.java","org.jfree.data.xy","XYBarDataset.java","35"
"./org/jfree/data/xy/XYDomainInfo.java","org.jfree.data.xy","XYDomainInfo.java","7"
"./org/jfree/data/xy/XYRangeInfo.java","org.jfree.data.xy","XYRangeInfo.java","7"
"./org/jfree/data/xy/IntervalXYDataset.java","org.jfree.data.xy","IntervalXYDataset.java","26"
"./org/jfree/data/xy/XYDatasetTableModel.java","org.jfree.data.xy","XYDatasetTableModel.java","24"
"./org/jfree/data/xy/DefaultOHLCDataset.java","org.jfree.data.xy","DefaultOHLCDataset.java","26"
"./org/jfree/data/xy/XYCoordinate.java","org.jfree.data.xy","XYCoordinate.java","20"
"./org/jfree/data/xy/YIntervalDataItem.java","org.jfree.data.xy","YIntervalDataItem.java","10"
"./org/jfree/data/xy/VectorSeriesCollection.java","org.jfree.data.xy","VectorSeriesCollection.java","32"
"./org/jfree/data/xy/DefaultXYZDataset.java","org.jfree.data.xy","DefaultXYZDataset.java","67"
"./org/jfree/data/xy/VectorDataItem.java","org.jfree.data.xy","VectorDataItem.java","13"
"./org/jfree/data/xy/NormalizedMatrixSeries.java","org.jfree.data.xy","NormalizedMatrixSeries.java","9"
"./org/jfree/data/xy/MatrixSeries.java","org.jfree.data.xy","MatrixSeries.java","26"
"./org/jfree/data/xy/YInterval.java","org.jfree.data.xy","YInterval.java","12"
"./org/jfree/data/xy/YIntervalSeries.java","org.jfree.data.xy","YIntervalSeries.java","18"
"./org/jfree/data/xy/DefaultHighLowDataset.java","org.jfree.data.xy","DefaultHighLowDataset.java","47"
"./org/jfree/data/xy/DefaultTableXYDataset.java","org.jfree.data.xy","DefaultTableXYDataset.java","62"
"./org/jfree/data/xy/XYIntervalSeriesCollection.java","org.jfree.data.xy","XYIntervalSeriesCollection.java","33"
"./org/jfree/data/xy/AbstractXYDataset.java","org.jfree.data.xy","AbstractXYDataset.java","11"
"./org/jfree/data/xy/XYZDataset.java","org.jfree.data.xy","XYZDataset.java","10"
"./org/jfree/data/xy/YWithXInterval.java","org.jfree.data.xy","YWithXInterval.java","13"
"./org/jfree/data/flow/FlowDataset.java","org.jfree.data.flow","FlowDataset.java","17"
"./org/jfree/data/flow/FlowDatasetUtils.java","org.jfree.data.flow","FlowDatasetUtils.java","36"
"./org/jfree/data/flow/NodeKey.java","org.jfree.data.flow","NodeKey.java","20"
"./org/jfree/data/flow/FlowKey.java","org.jfree.data.flow","FlowKey.java","26"
"./org/jfree/data/flow/DefaultFlowDataset.java","org.jfree.data.flow","DefaultFlowDataset.java","51"
"./org/jfree/data/flow/package-info.java","org.jfree.data.flow","package-info.java","2"
