{
    "fluentMethods": true,
    "relationships": [],
    "fields": [
        {
            "fieldName": "name",
            "fieldType": "String",
            "fieldValidateRules": [
                "required"
            ]
        },
        {
            "fieldName": "timestamp",
            "fieldType": "ZonedDateTime",
            "fieldValidateRules": [
                "required"
            ]
        }
    ],
    "changelogDate": "20180208092342",
    "dto": "mapstruct",
    "service": "serviceImpl",
    "entityTableName": "allergens",
    "jpaMetamodelFiltering": true,
    "pagination": "pagination"
}
