{
    "fluentMethods": true,
    "relationships": [
        {
            "relationshipName": "allergens",
            "otherEntityName": "allergens",
            "relationshipType": "many-to-many",
            "relationshipValidateRules": [
                "required"
            ],
            "otherEntityField": "id",
            "ownerSide": true,
            "otherEntityRelationshipName": "probiotic"
        },
        {
            "relationshipName": "strain",
            "otherEntityName": "strain",
            "relationshipType": "many-to-many",
            "relationshipValidateRules": [
                "required"
            ],
            "otherEntityField": "id",
            "ownerSide": true,
            "otherEntityRelationshipName": "probiotic"
        },
        {
            "relationshipName": "modifiedby",
            "otherEntityName": "user",
            "relationshipType": "many-to-one",
            "relationshipValidateRules": [
                "required"
            ],
            "otherEntityField": "login",
            "ownerSide": true,
            "otherEntityRelationshipName": "probiotic"
        }
    ],
    "fields": [
        {
            "fieldName": "name",
            "fieldType": "String",
            "fieldValidateRules": [
                "required"
            ]
        },
        {
            "fieldName": "timestamp",
            "fieldType": "ZonedDateTime",
            "fieldValidateRules": [
                "required"
            ]
        },
        {
            "fieldName": "have_allergens",
            "fieldType": "Boolean",
            "fieldValidateRules": [
                "required"
            ]
        }
    ],
    "changelogDate": "20180208103154",
    "dto": "mapstruct",
    "service": "serviceImpl",
    "entityTableName": "probiotic",
    "jpaMetamodelFiltering": true,
    "pagination": "pagination"
}
