id;name;jhi_timestamp;modifiedby_id
1;B. animalis subsp. lactis VES002 (L. lactis BB12, DSM15954);2018-01-01;1
2;B. breve SD5206 (DSM 24732);2018-01-01;1
3;B. infantis 35624™;2018-01-01;1
4;B. infantis SD5220 (DSM 24737);2018-01-01;1
5;B. longum (CECT 7894) ;2018-01-01;1
6;B. longum SD5219 (DSM 24736);2018-01-01;1
7;L. acidophilus SD5212 (DSM 24735);2018-01-01;1
8;L. casei subsp. paracasei SD5218 (DSM 24733);2018-01-01;1
9;L. delbrueckii subsp. bulgaricus SD5210 (DSM 24734);2018-01-01;1
10;L. fermentum Lc40 (CECT 5716);2018-01-01;1
11;L. gasseri EB01 (DSM 14869);2018-01-01;1
12;L. plantarum (CECT 7484 y CECT7485);2018-01-01;1
13;L. plantarum 299v (LP299v™);2018-01-01;1
14;L. plantarum SD5209 (DSM 24730);2018-01-01;1
15;L. reuteri (ATCC PTA 6475);2018-01-01;1
16;L. reuteri (DSM 17938);2018-01-01;1
17;L. reuteri Prodentis (ATCC 55730 Y ATCC PTA 5289);2018-01-01;1
18;L. reuteri Protectis (DSM 17938);2018-01-01;1
19;L. reuteri RC-14® (ATCC 55845);2018-01-01;1
20;L. rhamnosus GG (ATCC 53103);2018-01-01;1
21;L. rhamnosus GR-1® (ATCC 55826);2018-01-01;1
22;L. rhamnosus Lcr35®;2018-01-01;1
23;L. rhamnosus PB01 (DSM 14870) ;2018-01-01;1
24;L. rhamnosus VES001 (L. rhamnosus GG, ATCC 53103);2018-01-01;1
25;LAB4 ®:L. acidophilus (CUL-60) L. acidophilus  (CUL -21) B. bifidum (CUL-20) B. animalis subsp. lactis (CUL-34);2018-01-01;1
26;P. acidilactici (CECT 7483);2018-01-01;1
27;P. pentosaceus (CECT 8330);2018-01-01;1
28;S. boulardii (CNCM I-745 = S. cerevisae HANSEN CBS 5926);2018-01-01;1
29;S. boulardii CBS 5926;2018-01-01;1
30;S. thermophilus SD5207 (DSM 24731);2018-01-01;1
