{
    "fluentMethods": true,
    "relationships": [
        {
            "relationshipName": "probiotic",
            "otherEntityName": "probiotic",
            "relationshipType": "many-to-one",
            "relationshipValidateRules": [
                "required"
            ],
            "otherEntityField": "id"
        },
        {
            "relationshipName": "doseform",
            "otherEntityName": "doseform",
            "relationshipType": "many-to-one",
            "relationshipValidateRules": [
                "required"
            ],
            "otherEntityField": "id"
        },
        {
            "relationshipName": "modifiedby",
            "otherEntityName": "user",
            "relationshipType": "many-to-one",
            "relationshipValidateRules": [
                "required"
            ],
            "otherEntityField": "login",
            "ownerSide": true,
            "otherEntityRelationshipName": "dosage"
        }
    ],
    "fields": [
        {
            "fieldName": "timestamp",
            "fieldType": "ZonedDateTime",
            "fieldValidateRules": [
                "required"
            ]
        },
        {
            "fieldName": "age",
            "fieldType": "Age",
            "fieldValues": "Adulto, Pediatrico",
            "fieldValidateRules": [
                "required"
            ]
        },
        {
            "fieldName": "intake",
            "fieldType": "String",
            "fieldValidateRules": [
                "required"
            ]
        },
        {
            "fieldName": "frequency",
            "fieldType": "String",
            "fieldValidateRules": [
                "required"
            ]
        },
        {
            "fieldName": "indication",
            "fieldType": "String"
        },
        {
            "fieldName": "cfu",
            "fieldType": "Long",
            "fieldValidateRules": [
                "required"
            ]
        }
    ],
    "changelogDate": "20180217121930",
    "dto": "mapstruct",
    "service": "serviceImpl",
    "entityTableName": "dosage",
    "jpaMetamodelFiltering": true,
    "pagination": "pagination"
}
