﻿Summons Number,Plate ID,Registration State,Plate Type,Issue Date,Violation Code,Vehicle Body Type,Vehicle Make,Issuing Agency,Street Code1,Street Code2,Street Code3,Vehicle Expiration Date,Violation Location,Violation Precinct,Issuer Precinct,Issuer Code,Issuer Command,Issuer Squad,Violation Time,Time First Observed,Violation County,Violation In Front Of Or Opposite,House Number,Street Name,Intersecting Street,Date First Observed,Law Section,Sub Division,Violation Legal Code,Days Parking In Effect    ,From Hours In Effect,To Hours In Effect,Vehicle Color,Unregistered Vehicle?,Vehicle Year,Meter Number,Feet From Curb,Violation Post Code,c,No Standing or Stopping Violation,Hydrant Violation,Double Parking Violation,Latitude,Longitude,Community Board,Community Council ,Census Tract,BIN,BBL,c
1283294138,GBB9093,NY,PAS,08-04-2013,46,SUBN,AUDI,P,37250,13610,21190,20140831,33,33,33,921043,33,0,0752A,,,F,712,W 175 ST,,0,408,F1,,BBBBBBB,ALL,ALL,GY,0,2013,-,0,,,,,,,,,,,,,
1283294151,62416MB,NY,COM,08-04-2013,46,VAN,FORD,P,37290,40404,40404,20140430,33,33,33,921043,33,0,1240P,,NY,O,201,W 177 ST,,0,408,C,,BBBBBBB,ALL,ALL,WH,0,2012,-,0,,,,,,,,,,,,,
1283294163,78755JZ,NY,COM,08-05-2013,46,P-U,CHEVR,P,37030,31190,13610,20140228,33,33,33,921043,33,0,1243P,,NY,O,520,W 163 ST,,0,408,F7,,BBBBBBB,ALL,ALL,,0,0,-,0,,,,,,,,,,,,,
1283294175,63009MA,NY,COM,08-05-2013,46,VAN,FORD,P,37270,11710,12010,20141031,33,33,33,921043,33,0,0232P,,NY,O,517,W 176 ST,,0,408,F1,,BBBBBBB,ALL,ALL,WH,0,2010,-,0,,,,,,,,,,,,,
1283294187,91648MC,NY,COM,08-08-2013,41,TRLR,GMC,P,37240,12010,31190,0,33,33,33,921043,33,0,1239P,,NY,F,590,W 174 ST,,0,408,E1,,BBBBBBB,ALL,ALL,BR,0,2012,-,0,,,,,,,,,,,,,
1283294217,T60DAR,NJ,PAS,08-11-2013,14,P-U,DODGE,P,37250,10495,12010,0,33,33,33,921043,33,0,0617P,,NY,F,525,W 175 ST,,0,408,F1,,BBBBBBB,ALL,ALL,RD,0,0,-,0,,,,,,,,,,,,,
1283294229,GCR2838,NY,PAS,08-11-2013,14,VAN,,P,37250,12010,31190,20141223,33,33,33,921043,33,0,0741P,,NY,F,551,W 175 ST,,0,408,C,,BBBBBBB,ALL,ALL,GN,0,2011,-,0,,,,,,,,,,,,,
1283983620,XZ764G,NJ,PAS,08-07-2013,24,DELV,FORD,X,63430,0,0,0,88,88,976,101079,976,0,0425A,,K,F,100,N.PORTLAND AVE,BROOKLYN NY 11206,0,408,E5,,BBBBBBB,ALL,ALL,WHITE,0,0,-,0,,,,,,,,,,,,,
1283983631,GBH9379,NY,PAS,08-07-2013,24,SDN,TOYOT,X,63430,0,0,20140722,88,88,976,101079,976,0,0437A,,K,F,100,N.PORTLAND AVE,BROOKLYN NY 11206,0,408,D5,,BBBBBBB,ALL,ALL,WHITE,0,2001,-,0,,,,,,,,,,,,,
1283983667,MCL78B,NJ,PAS,07/18/2013,24,SDN,SUBAR,H,0,0,0,0,79,79,976,101043,976,0,0839A,,K,F,,"760 BROADWAY ,BROOKL",WOODHULL HOSPITAL,0,408,D,,BBBBBBB,ALL,ALL,BLACK,0,2005,-,0,,,,,,,,,,,,,
1283983679,M367CN,NY,PAS,07/18/2013,24,SDN,HYUND,H,0,0,0,20140510,79,79,976,101043,976,0,0845A,,K,F,,760 BROADWAY BROOKLY,WOODHULL HOSPITAL,0,408,D5,,BBBBBBB,ALL,ALL,BLUE,0,2010,-,0,,,,,,,,,,,,,
1283983734,GAR6813,NY,PAS,07/18/2013,24,SDN,TOYOT,H,0,0,0,20141008,79,79,976,101043,976,0,0907A,,K,F,,760 BROADWAY BROOKLY,WOODHULL HOSPITAL,0,408,D5,,BBBBBBB,ALL,ALL,TAN,0,1998,-,0,,,,,,,,,,,,,
1283983771,GEN8674,NY,PAS,07/31/2013,24,SDN,AUDI,X,0,0,0,20150331,79,79,976,101080,976,0,0514P,,K,F,,760 BDWAY BKLYN,NY 11206,0,408,D5,,BBBBBBB,ALL,ALL,GOLD,0,0,-,0,,,,,,,,,,,,,
1283983825,GAC2703,NY,PAS,08-12-2013,24,SDN,NISSA,X,23230,41330,83330,20140713,79,79,976,101080,976,0,0656P,,K,F,760,BWY,,0,408,D5,,BBBBBBB,ALL,ALL,WHITE,0,2012,-,0,,,,,,,,,,,,,
1286036800,40793JY,NY,COM,07-05-2013,14,VAN,CHEVR,P,34190,10410,10510,0,13,13,13,944320,13,0,1145P,,,F,59,W 21 STREET,,0,408,C,,YYYYYYY,1100P,0600A,GREEN,0,1995,-,0,,,,,,,,,,,,,
1286123550,GAD1485,NY,PAS,08-12-2013,20,SDN,VOLKS,T,28930,27530,29830,20140729,76,76,730,337777,T730,0,0546P,,K,O,221,CONGRESS ST,,0,408,D,,BBBBBBB,ALL,ALL,WHITE,0,2012,-,0,,,,,,,,,,,,,
1286246398,GFC5338,NY,PAS,07/26/2013,14,SDN,TOYOT,T,0,40404,40404,20150128,78,78,0,332116,BKTU,0,1142A,,K,O,145,PROSPECT PKWAY,,0,408,C,,YYYYYYY,0800A,1000P,GRAY,0,2010,-,0,,,,,,,,,,,,,
1286246416,815M342,MD,PAS,07/30/2013,20,SUBN,SATUR,T,0,0,0,20141288,88,88,0,332116,BKTP,0,0724A,,K,,,N/S DEKALB AVE,E/O ST JAMES PL,0,408,D,,YYYYYBB,0700A,1000A,GREEN,0,0,-,0,,,,,,,,,,,,,
1286248000,GJA3452,NY,PAS,07/23/2013,14,SDN,KIA,T,73690,40430,48230,20140930,71,71,730,338558,T730,0,0758A,,K,F,576,ROGERS AVE,,0,408,J3,,YYYYYBB,0700A,1000A,WH,0,2013,-,0,,,,,,,,,,,,,
1286282330,YZY6476,NC,PAS,07/29/2013,20,SDN,NISSA,T,32030,75130,50830,20131088,81,81,730,332020,T730,0,0736A,,K,F,702,DECATUR ST,,0,408,E1,,BBBBBBB,ALL,ALL,WHITE,0,0,-,0,,,,,,,,,,,,,
1286282342,WBJ819,LA,PAS,08-07-2013,17,SUBN,HONDA,T,0,0,0,20140488,81,81,730,332020,T730,0,0847A,,K,,,N/S LINDEN ST,60  E/O BROADWAY,0,408,K2,,BBBBBBB,0800A,0600P,TAN,0,0,-,0,,,,,,,,,,,,,
1286289841,GAV9235,NY,PAS,07/20/2013,50,SDN,HONDA,T,0,0,0,20140705,28,28,730,331797,T730,0,1120A,,K,,,N/S WILLOUGHBY AVE,5 E/O VANDERBILT,0,408,L2,,BBBBBBB,ALL,ALL,GY,0,2012,-,0,,,,,,,,,,,,,
1286654920,ZTR66R,NJ,PAS,07/18/2013,50,SDN,N/S,T,0,0,0,0,1,1,0,346004,0SIC,0,1020A,,NY,,,,,0,408,C3,,BBBBBBB,ALL,ALL,GRAY,0,0,-,0,,,,,,,,,,,,,
1286799648,GDE3973,NY,PAS,07/20/2013,40,SDN,TOYOT,T,0,0,0,20141206,1,1,0,331825,MTPU,0,0324P,,NY,,,E/S RIVER TER.,20  N/O WARREN ST,0,408,C,,BBBBBBB,ALL,ALL,TN,0,2003,-,9,,,,,,,,,,,,,
1286807062,P193871,IL,PAS,08-10-2013,40,SDN,SCIO,T,26630,40930,18630,0,71,71,730,338594,T730,0,1018A,,K,O,11,CLARKSON AVE,,0,408,D,,BBBBBBB,ALL,ALL,BK,0,0,-,6,,,,,,,,,,,,,
1286807475,GGL6608,NY,PAS,07/26/2013,40,SDN,NISSA,T,73650,60530,50630,20140930,90,90,730,346108,T730,0,0743A,,K,O,143,ROEBLING ST,,0,408,K2,,BBBBBBB,ALL,ALL,WHT,0,2013,-,1,,,,,,,,,,,,,
1286807633,84301JU,NY,COM,07/19/2013,14,P-U,DODGE,X,63030,74830,67030,20141031,79,79,730,345140,T730,0,0850A,,K,F,737,MYRTLE AVE,,0,408,I4,,BBBBBBB,ALL,ALL,WH,0,2001,-,0,,,,,,,,,,,,,
1286808807,HHG3545,PA,PAS,08-06-2013,20,SDN,TOYOT,T,21130,71330,89930,0,84,84,730,344784,T730,0,0915A,,K,F,43,BRIDGE ST,,0,408,I3,,YYYYBBB,0800A,0600P,GR,0,0,-,0,,,,,,,,,,,,,
1287320491,50097JX,NY,COM,08-07-2013,40,VAN,MERCU,T,23190,27290,20340,20140331,5,5,110,349476,T110,0,1023A,,NY,O,124,HUDSON ST,,0,408,E1,,BBBBBBB,ALL,ALL,RD,0,2003,-,0,,,,,,,,,,,,,
1287320570,GEJ9154,NY,PAS,08-06-2013,51,VAN,TOYOT,X,93230,74830,67030,20150321,79,79,110,349476,T110,0,1120A,,K,O,436,WILLOUGHBY AVE,,0,408,F7,,BBBBBBB,ALL,ALL,GY,0,2013,-,0,,,,,,,,,,,,,
1287517304,6B22924,ID,PAS,07/22/2013,20,SDN,VOLKS,T,36250,10610,10810,0,28,28,108,331847,T108,0,0521P,,NY,F,238,W 124 ST,,0,408,D,,YYYYYYB,0800A,0600P,GY,0,0,-,0,,,,,,,,,,,,,
1287517316,4135TE,ME,PAS,07/22/2013,14,SDN,TOYOT,T,0,0,0,0,26,26,108,331847,T108,0,0251P,,NY,,,E/S CONVENT AVE,200  S O W 135,0,408,D,,YYYYYYY,ALL,ALL,BL,0,0,-,0,,,,,,,,,,,,,
1287518126,WMI,CT,PAS,07/24/2013,31,SUBN,ME/BE,T,34510,13610,10610,0,14,14,108,330898,T108,0,0410P,,,O,142,W 37 ST,,0,408,I3,,YYYYYYB,ALL,ALL,BK,0,0,-,0,,,,,,,,,,,,,
1287603671,P752957,99,999,07/20/2013,85,DELV,VOLVO,T,17330,89740,9530,0,66,66,108,338568,T108,0,0246A,1134P,K,F,5810,BAY PARKWAY,,20130719,408,C,,BBBBBBB,ALL,ALL,,0,0,-,0,,,,,,,,,,,,,
1287603683,P774757,IL,PAS,03/20/2013,85,TRLR,VOLVO,T,17330,89740,9530,0,66,66,108,338568,T108,0,0300A,0950P,K,O,5810,BAY PARKWAY,,20130719,408,K5,,BBBBBBB,ALL,ALL,WHITE,0,0,-,0,,,,,,,,,,,,,
1288135920,GFM8884,NY,OMS,07/24/2013,19,SUBN,ME/BE,X,0,40404,40404,20140930,84,84,0,881709,KINA,0,0105P,,K,F,209,JORLEMON ST,,0,408,F1,,BBBBBBB,ALL,ALL,BLU,0,2013,-,0,,,,,,,,,,,,,
1288259270,43517LA,NY,PAS,08-02-2013,18,SDN,CADIL,P,73720,26640,26670,20140331,46,46,401,906480,401,0,0450P,,NY,F,1135,WEBSTER AVE,,0,408,F4,,BBBBBBB,ALL,ALL,WHT,0,2004,-,0,,,,,,,,,,,,,
1288360800,HYM4303,PA,PAS,08-06-2013,41,SDN,MITSU,P,29090,13113,13113,0,25,25,805,948345,805,0,0618P,,,O,50,PALADINO,,0,408,D5,,BBBBBBB,ALL,ALL,GRAY,0,0,-,0,,,,,,,,,,,,,
1289971754,XDB4574,VA,PAS,08-01-2013,40,VAN,TOYOT,P,13610,34750,34770,20140731,,0,0,930825,0,0,0730P,,NY,F,1619,BROADWAY,,0,408,I4,,BBBBBBB,ALL,ALL,RED,0,2007,-,0,,,,,,,,,,,,,
1290136210,GGW7930,NY,PAS,07/25/2013,74,SUBN,MAZDA,P,56600,52400,28280,20150609,120,120,120,942302,120,0,0845A,,R,O,29,YORK AVE,,0,408,D,,BBBBBBB,ALL,ALL,TAN,0,2002,-,0,,,,,,,,,,,,,
1290834349,429J6JM,NY,COM,07/23/2013,46,DELV,INTER,P,0,40404,40404,0,107,107,107,947582,107,0,1037A,,Q,F,67-21,UTOPIA PWKY,,0,408,F1,,BBBBBBB,ALL,ALL,BR,0,1996,-,0,,,,,,,,,,,,,
1290834362,GBC9079,NY,PAS,07/27/2013,98,SDN,MERCU,P,14490,24590,24690,20140726,107,107,107,947582,107,0,0927A,,,O,170-10,69 AVE,,0,408,F2,,BBBBBBB,ALL,ALL,GY,0,2012,-,0,,,,,,,,,,,,,
1290834374,42587JW,NY,COM,07/30/2013,46,DELV,FORD,P,65590,25270,25340,20141219,107,107,107,947582,107,0,1119A,,Q,O,189-17,UNION TPK,,0,408,F7,,BBBBBBB,ALL,ALL,YELL,0,0,-,0,,,,,,,,,,,,,
1290834386,SES174,NB,PAS,08/15/2013,19,SDN,NISSA,P,49690,25040,24990,0,107,107,107,947582,107,0,1050A,,Q,F,179-09,HILLSIDE AVE,,0,408,K6,,BBBBBBB,ALL,ALL,BK,0,0,-,0,,,,,,,,,,,,,
1291204167,JCE3366,PA,PAS,07/24/2013,74,SUBN,FORD,P,14980,70030,73110,0,81,81,803,946127,803,0,1015A,,K,F,326,BAINBRIDGE ST,,0,408,D5,,BBBBBBB,ALL,ALL,GREY,0,0,-,0,,,,,,,,,,,,,
1291521665,YANKYJAM,NY,PAS,07-02-2013,46,SDN,BMW,F,5430,9130,9180,20130510,72,72,114,916652,1114,0,0742P,,K,,5113,4TH AVE,,0,408,C,,BBBBBBB,ALL,ALL,BLK,0,0,-,0,,,,,,,,,,,,,
1291686332,47SB13,NY,999,07/26/2013,51,MCY,HARLE,P,50830,19230,80430,0,73,73,73,924450,73,0,0459A,,,F,303,THOMAS BOYLAND ST,,0,408,K6,,BBBBBBB,ALL,ALL,SILVE,0,0,-,0,,,,,,,,,,,,,
1291896399,G24BLB,NJ,PAS,07/19/2013,40,SDN,INFIN,P,41900,49655,39693,20151020,120,120,446,907618,446,0,1135A,,R,O,257,OSGOOD AVE,,0,408,K6,,BBBBBBB,ALL,ALL,BK,0,2011,-,0,,,,,,,,,,,,,
1291898384,GER8956,NY,SRF,07/26/2013,14,SDN,CHEVR,P,53000,17150,18510,20140930,120,120,496,933167,496,0,0637P,,R,F,265,VICTORY BLVD,,0,408,J6,,BBBBBBB,ALL,ALL,GRAY,0,2012,-,0,,,,,,,,,,,,,
1291905236,85796MC,NY,COM,07/26/2013,17,DELV,ISUZU,P,33990,50300,22550,20140228,120,120,446,903295,446,0,0105P,1255P,NY,F,9,HYATT ST,,0,408,J2,,BBBBBBB,ALL,ALL,WH,0,2013,-,0,,,,,,,,,,,,,
1292755052,GBB7685,NY,PAS,07/14/2013,19,SDN,LEXUS,X,59990,16190,16295,20140831,112,112,0,429825,QNR0,0,0600P,,Q,F,118-20,QUEENS BLVD,,0,408,C3,,BBBBBBB,ALL,ALL,WHITE,0,2013,-,0,,,,,,,,,,,,,
6020309034,GEW4836,99,PAS,07/18/2013,94,SDN,ACURA,X,0,0,0,20150424,,0,0,331702,T108,0,,,,,,,,0,408,5,0,YYYYYYY,ALL,ALL,GY,0,0,,0,0,,,,,,,,,,,,
1292755064,904YDS,CT,PAS,07/14/2013,19,SDN,VOLVO,X,54580,57790,8790,0,109,109,0,429825,QNR0,0,0610P,,Q,F,36-26,MAIN ST,,0,408,C,,BBBBBBB,ALL,ALL,WHITE,0,0,-,0,,,,,,,,,,,,,
1292756792,GDX8921,99,PAS,07/15/2013,19,SDN,HONDA,X,28790,18740,18840,20150418,115,115,0,0,N4CT,0,1053A,1052A,,F,94-07,ASTORIA BLVD,,20130715,408,C3,,BBBBBBB,ALL,ALL,SILVE,0,2003,-,0,,,,,,,,,,,,,
1292757050,S206498,IL,PAS,07/24/2013,19,,BMW,X,0,40404,40404,0,105,105,0,0,0,0,1014A,,Q,F,,80FT KEW GARDENS ROA,,0,408,J6,,BBBBBBB,ALL,ALL,BLACK,0,0,-,0,,,,,,,,,,,,,
1293030739,GHG2484,NY,PAS,08-11-2013,46,,FORD,P,26440,20570,20630,20150530,105,105,105,940472,105,0,0130A,,Q,F,112-32,212 ST,,0,408,J6,,BBBBBBB,ALL,ALL,BK,0,2013,-,0,,,,,,,,,,,,,
1293090530,GES3519,NY,PAS,07-07-2013,40,SDN,HONDA,F,70630,42730,13430,20150320,75,75,332,920198,5332,0,0312P,,K,F,169,PINE ST,,0,408,E2,,BBBBBBB,ALL,ALL,BLACK,0,1997,-,0,,,,,,,,,,,,,
1293094389,GDS9810,NJ,PAS,06/20/2013,31,SDN,BMW,P,24890,17990,18010,20141015,17,17,0,919860,0,0,0532P,,NY,O,570,LEXINGTON AVE,,0,408,C,,BBBBBBB,ALL,ALL,SILVE,0,2007,-,0,,,,,,,,,,,,,
1293100924,64195MC,NY,COM,06/20/2013,46,VAN,WHITE,F,81330,20530,64330,20140930,84,84,226,919877,E226,0,0344P,,K,F,409,STATE ST,,0,408,F1,,BBBBBBB,ALL,ALL,WHITE,0,1998,-,0,,,,,,,,,,,,,
