{
  "swagger" : "2.0",
  "info" : {
    "version" : "2.0",
    "x-WM-USE_PROXY_FOR_WEB" : true,
    "x-WM-USE_PROXY_FOR_MOBILE" : true,
    "x-WM-API_ID" : "caee1582-879f-4d18-b56a-d68896ee1431",
    "x-WM-SERVICE_ID" : "googleapis",
    "x-WM-SERVICE_TYPE" : "RestService"
  },
  "host" : "maps.googleapis.com",
  "basePath" : "/maps",
  "tags" : [ {
    "name" : "RestServiceVirtualController",
    "description" : "Rest service swagger documentation"
  } ],
  "schemes" : [ "http" ],
  "paths" : {
    "/api/directions/xml" : {
      "get" : {
        "tags" : [ "RestServiceVirtualController" ],
        "operationId" : "googleapis_RestServiceVirtualController-invoke",
        "consumes" : [ "application/json" ],
        "produces" : [ "application/xml" ],
        "parameters" : [ {
          "name" : "origin",
          "in" : "query",
          "description" : "origin",
          "required" : false,
          "type" : "string",
          "format" : "string",
          "x-WM-EDITABLE" : false
        }, {
          "name" : "destination",
          "in" : "query",
          "description" : "destination",
          "required" : false,
          "type" : "string",
          "format" : "string",
          "x-WM-EDITABLE" : false
        }, {
          "name" : "sensor",
          "in" : "query",
          "description" : "sensor",
          "required" : false,
          "type" : "string",
          "format" : "string",
          "x-WM-EDITABLE" : false
        } ],
        "responses" : {
          "200" : {
            "description" : "Success",
            "schema" : {
              "$ref" : "#/definitions/RootResponse"
            }
          }
        },
        "x-WM-METHOD_NAME" : "invoke",
        "x-WM-ACCESS_SPECIFIER" : "APP_ONLY"
      },
      "x-WM-BASE_PATH" : "/api/directions/xml",
      "x-WM-TAG" : "RestServiceVirtualController",
      "x-WM-RELATIVE_PATH" : "",
      "x-WM-COMPLETE_PATH" : "${rest.googleapis.scheme}://${rest.googleapis.host}${rest.googleapis.basepath}/api/directions/xml"
    }
  },
  "definitions" : {
    "southwest" : {
      "required" : [ "lat", "lng" ],
      "properties" : {
        "lng" : {
          "type" : "string"
        },
        "lat" : {
          "type" : "string"
        }
      },
      "x-WM-FULLY_QUALIFIED_NAME" : "googleapis.southwest",
      "x-WM-TAGS" : [ "RestServiceVirtualController" ]
    },
    "distance" : {
      "required" : [ "text", "value" ],
      "properties" : {
        "text" : {
          "type" : "string"
        },
        "value" : {
          "type" : "string"
        }
      },
      "x-WM-FULLY_QUALIFIED_NAME" : "googleapis.distance",
      "x-WM-TAGS" : [ "RestServiceVirtualController" ]
    },
    "geocoded_waypointEntryItem" : {
      "required" : [ "geocoder_status", "place_id", "type" ],
      "properties" : {
        "geocoder_status" : {
          "type" : "string"
        },
        "type" : {
          "type" : "array",
          "items" : {
            "type" : "string"
          },
          "x-WM-IS_LIST" : true
        },
        "place_id" : {
          "type" : "string"
        }
      },
      "x-WM-FULLY_QUALIFIED_NAME" : "googleapis.geocoded_waypointEntryItem",
      "x-WM-TAGS" : [ "RestServiceVirtualController" ]
    },
    "stepEntryItem" : {
      "required" : [ "distance", "duration", "end_location", "html_instructions", "maneuver", "polyline", "start_location", "travel_mode" ],
      "properties" : {
        "duration" : {
          "$ref" : "#/definitions/duration"
        },
        "start_location" : {
          "$ref" : "#/definitions/start_location"
        },
        "travel_mode" : {
          "type" : "string"
        },
        "distance" : {
          "$ref" : "#/definitions/distance"
        },
        "html_instructions" : {
          "type" : "string"
        },
        "end_location" : {
          "$ref" : "#/definitions/end_location"
        },
        "polyline" : {
          "$ref" : "#/definitions/polyline"
        },
        "maneuver" : {
          "type" : "string"
        }
      },
      "x-WM-FULLY_QUALIFIED_NAME" : "googleapis.stepEntryItem",
      "x-WM-TAGS" : [ "RestServiceVirtualController" ]
    },
    "northeast" : {
      "required" : [ "lat", "lng" ],
      "properties" : {
        "lng" : {
          "type" : "string"
        },
        "lat" : {
          "type" : "string"
        }
      },
      "x-WM-FULLY_QUALIFIED_NAME" : "googleapis.northeast",
      "x-WM-TAGS" : [ "RestServiceVirtualController" ]
    },
    "leg" : {
      "required" : [ "distance", "duration", "end_address", "end_location", "start_address", "start_location", "step" ],
      "properties" : {
        "duration" : {
          "$ref" : "#/definitions/duration"
        },
        "start_location" : {
          "$ref" : "#/definitions/start_location"
        },
        "distance" : {
          "$ref" : "#/definitions/distance"
        },
        "start_address" : {
          "type" : "string"
        },
        "end_location" : {
          "$ref" : "#/definitions/end_location"
        },
        "step" : {
          "type" : "array",
          "items" : {
            "$ref" : "#/definitions/stepEntryItem"
          },
          "x-WM-IS_LIST" : true
        },
        "end_address" : {
          "type" : "string"
        }
      },
      "x-WM-FULLY_QUALIFIED_NAME" : "googleapis.leg",
      "x-WM-TAGS" : [ "RestServiceVirtualController" ]
    },
    "duration" : {
      "required" : [ "text", "value" ],
      "properties" : {
        "text" : {
          "type" : "string"
        },
        "value" : {
          "type" : "string"
        }
      },
      "x-WM-FULLY_QUALIFIED_NAME" : "googleapis.duration",
      "x-WM-TAGS" : [ "RestServiceVirtualController" ]
    },
    "start_location" : {
      "required" : [ "lat", "lng" ],
      "properties" : {
        "lng" : {
          "type" : "string"
        },
        "lat" : {
          "type" : "string"
        }
      },
      "x-WM-FULLY_QUALIFIED_NAME" : "googleapis.start_location",
      "x-WM-TAGS" : [ "RestServiceVirtualController" ]
    },
    "route" : {
      "required" : [ "bounds", "copyrights", "leg", "overview_polyline", "summary" ],
      "properties" : {
        "summary" : {
          "type" : "string"
        },
        "copyrights" : {
          "type" : "string"
        },
        "bounds" : {
          "$ref" : "#/definitions/bounds"
        },
        "overview_polyline" : {
          "$ref" : "#/definitions/overview_polyline"
        },
        "leg" : {
          "$ref" : "#/definitions/leg"
        }
      },
      "x-WM-FULLY_QUALIFIED_NAME" : "googleapis.route",
      "x-WM-TAGS" : [ "RestServiceVirtualController" ]
    },
    "bounds" : {
      "required" : [ "northeast", "southwest" ],
      "properties" : {
        "southwest" : {
          "$ref" : "#/definitions/southwest"
        },
        "northeast" : {
          "$ref" : "#/definitions/northeast"
        }
      },
      "x-WM-FULLY_QUALIFIED_NAME" : "googleapis.bounds",
      "x-WM-TAGS" : [ "RestServiceVirtualController" ]
    },
    "end_location" : {
      "required" : [ "lat", "lng" ],
      "properties" : {
        "lng" : {
          "type" : "string"
        },
        "lat" : {
          "type" : "string"
        }
      },
      "x-WM-FULLY_QUALIFIED_NAME" : "googleapis.end_location",
      "x-WM-TAGS" : [ "RestServiceVirtualController" ]
    },
    "overview_polyline" : {
      "required" : [ "points" ],
      "properties" : {
        "points" : {
          "type" : "string"
        }
      },
      "x-WM-FULLY_QUALIFIED_NAME" : "googleapis.overview_polyline",
      "x-WM-TAGS" : [ "RestServiceVirtualController" ]
    },
    "polyline" : {
      "required" : [ "points" ],
      "properties" : {
        "points" : {
          "type" : "string"
        }
      },
      "x-WM-FULLY_QUALIFIED_NAME" : "googleapis.polyline",
      "x-WM-TAGS" : [ "RestServiceVirtualController" ]
    },
    "RootResponse" : {
      "required" : [ "geocoded_waypoint", "route", "status" ],
      "properties" : {
        "route" : {
          "$ref" : "#/definitions/route"
        },
        "geocoded_waypoint" : {
          "type" : "array",
          "items" : {
            "$ref" : "#/definitions/geocoded_waypointEntryItem"
          },
          "x-WM-IS_LIST" : true
        },
        "status" : {
          "type" : "string"
        }
      },
      "x-WM-FULLY_QUALIFIED_NAME" : "googleapis.RootResponse",
      "x-WM-TAGS" : [ "RestServiceVirtualController" ]
    }
  }
}