{
  "extends": [
    "config:base",
    ":automergePatch",
    "regexManagers:dockerfileVersions"
  ],
  "labels": [ "dependencies" ],
  "prHourlyLimit": 5,
  "rebaseWhen": "never",
  "postUpdateOptions": ["gomodTidy","gomodMassage","gomodUpdateImportPaths"]
}
