{
    "default": [
        {
            "type": "reject"
        }
    ],
    "transports": {
        "docker": {
            "registry.gitlab.com/ucsdlibrary/development/silverblue-custom-images": [
                {
                    "type": "sigstoreSigned",
                    "signedIdentity": {
                        "type": "matchRepository"
                    },
                    "fulcio": {
                        "caPath": "/etc/pki/fulcio_v1.crt.pem",
                        "oidcIssuer": "https://gitlab.com",
                        "subjectEmail": "https://gitlab.com/ucsdlibrary/development/silverblue-custom-images//.gitlab-ci.yml@refs/heads/trunk"
                    },
                    "rekorPublicKeyPath": "/etc/pki/rekor.pub"
                }
            ],
            "registry.access.redhat.com": [
                {
                    "type": "signedBy",
                    "keyType": "GPGKeys",
                    "keyPath": "/etc/pki/rpm-gpg/RPM-GPG-KEY-redhat-release"
                }
            ],
            "registry.redhat.io": [
                {
                    "type": "signedBy",
                    "keyType": "GPGKeys",
                    "keyPath": "/etc/pki/rpm-gpg/RPM-GPG-KEY-redhat-release"
                }
            ],
            "": [
                {
                    "type": "insecureAcceptAnything"
                }
            ]
        },
        "docker-daemon": {
            "": [
                {
                    "type": "insecureAcceptAnything"
                }
            ]
        }
    }
}
