{
  "mms_id": "991020477189706535",
  "record_format": "marc21",
  "linked_record_id": {},
  "title": "Blueness",
  "author": "Schroedinger, Kerstin",
  "network_number": [
    "(CU-S)b119116777-01ucs_sdi"
  ],
  "holdings": {
    "link": "https://api-na.hosted.exlibrisgroup.com/almaws/v1/bibs/991020477189706535/holdings"
  },
  "created_by": "import",
  "created_date": "2021-07-06Z",
  "last_modified_by": "exl_api",
  "last_modified_date": "2024-04-26Z",
  "suppress_from_publishing": "false",
  "suppress_from_external_search": "false",
  "suppress_from_metadoor": "false",
  "rank": "32",
  "sync_with_oclc": "NONE",
  "sync_with_libraries_australia": "NONE",
  "originating_system": "ILS",
  "originating_system_id": "b119116777-01ucs_sdi",
  "cataloging_level": {
    "value": "00",
    "desc": "Default Level"
  },
  "brief_level": {
    "value": "10",
    "desc": "10"
  },
  "anies": [
    "<?xml version=\"1.0\" encoding=\"UTF-16\"?><record><leader>00344nam a2200133 a 4500</leader><controlfield tag=\"001\">991020477189706535</controlfield><controlfield tag=\"005\">20240425141052.0</controlfield><controlfield tag=\"008\">210706                             eng  </controlfield><datafield ind1=\" \" ind2=\" \" tag=\"035\"><subfield code=\"a\">(CU-S)b119116777-01ucs_sdi</subfield></datafield><datafield ind1=\" \" ind2=\" \" tag=\"100\"><subfield code=\"a\">Schroedinger, Kerstin</subfield></datafield><datafield ind1=\" \" ind2=\"0\" tag=\"245\"><subfield code=\"a\">Blueness</subfield></datafield><datafield ind1=\" \" ind2=\" \" tag=\"730\"><subfield code=\"a\">Bläue</subfield></datafield><datafield ind1=\" \" ind2=\" \" tag=\"950\"><subfield code=\"a\">Cutover Migration</subfield><subfield code=\"9\">local</subfield></datafield><datafield ind1=\" \" ind2=\" \" tag=\"996\"><subfield code=\"a\">.b119116777</subfield><subfield code=\"9\">local</subfield></datafield></record>"
  ]
}