{
  "extends": [
    "config:recommended",
    "gitlab>ucsdlibrary/development/gitlab-ci-tools:renovate-alpine-docker",
    "gitlab>ucsdlibrary/development/gitlab-ci-tools:renovate-major-minor-grouping"
  ],
  "gitlabci": {
     "fileMatch": ["^ci/.*\\.ya?ml$"]
   },
  "labels": [ "dependencies" ],
  "prHourlyLimit": 5,
  "rebaseWhen": "never"
}
