{
  "distinguishedName": "CN=aemployee,OU=Users,OU=University Library,DC=AD,DC=UCSD,DC=EDU",
  "samAccountName": "aemployee",
  "employeeID": "10373686",
  "uid": "1028506",
  "userPrincipalName": "aemployee@UCSD.EDU",
  "firstName": "A",
  "lastName": "Employee",
  "displayName": "Employee, A",
  "email": "aemployee@ucsd.edu",
  "title": "A minion",
  "department": "A department",
  "company": "University Library",
  "manager": "CN=bigboss1,OU=Users,OU=University Library,DC=AD,DC=UCSD,DC=EDU",
  "description": "University Library",
  "ldapChanged": "20181127172427.0Z",
  "memberOf": [],
  "emailAddresses": []
}
