{
  "extends": [
    "schedule:weekly"
  ],
  "description": "Assign grouped MRs for minor/patch updates",
  "timezone": "America/Los_Angeles",
  "osvVulnerabilityAlerts": true,
  "packageRules": [
    {
      "groupName": "ruby non-major dependencies",
      "groupSlug": "ruby-minor-patch",
      "matchManagers": [
        "bundler"
      ],
      "matchUpdateTypes": [
        "minor",
        "patch"
      ]
    },
    {
      "groupName": "docker non-major dependencies",
      "groupSlug": "docker-minor-patch",
      "matchDatasources": [
        "docker"
      ],
      "matchUpdateTypes": [
        "minor",
        "patch"
      ]
    },
    {
      "groupName": "golang non-major dependencies",
      "groupSlug": "golang-minor-patch",
      "matchDatasources": [
        "go"
      ],
      "matchUpdateTypes": [
        "minor",
        "patch"
      ]
    },
    {
      "groupName": "npm non-major dependencies",
      "groupSlug": "npm-minor-patch",
      "matchDatasources": [
        "npm"
      ],
      "matchUpdateTypes": [
        "minor",
        "patch"
      ]
    },
    {
      "groupName": "helm non-major dependencies",
      "groupSlug": "helm-minor-patch",
      "matchDatasources": [
        "helm"
      ],
      "matchUpdateTypes": [
        "minor",
        "patch"
      ]
    }
  ]
}
