{
  "user": "atriton@ucsd.edu",
  "title": "Information about waves",
  "objects": [
    {
      "title": "Data from: Wave-tide interaction for a strongly modulated wave field",
      "fileUri": "https://library.ucsd.edu/dc/object/bb9805722j/TBD",
      "seeAlso": [
        {
          "label": "Digital Collections Source URI",
          "uri": "https://library.ucsd.edu/dc/object/bb9805722j"
        },
        {
          "label": "DOI",
          "uri": "https://doi.org/10.6075/J0WD40R1"
        }
      ],
      "additionalMetadata": {
        "citation": "Ho, Allison; Merrifield, Sophia; Pizzo, Nick (2022). Data from: Wave-tide interaction for a strongly modulated wave field. UC San Diego Library Digital Collections. https://doi.org/10.6075/J0WD40R1",
        "technical-details": "MATLAB R2021a"
      }
    }
  ]
}
