{
  "$id": "https://gitlab.com/ucsdlibrary/development/educational-dataset-schema/-/raw/trunk/educational-dataset-schema.json",
  "$schema": "https://json-schema.org/draft/2020-12/schema",
  "description": "A set of metadata properties to facilitate data exchange into the UC San Diego Educational Dataset Repository",
  "type": "object",
  "properties": {
    "user": {
      "type": "string",
      "description": "The email address/username of the user that created the package"
    },
    "title": {
      "type": "string",
      "description": "The title to assign to this package"
    },
    "objects": {
      "type": "array",
      "description": "An array of all objects associated with this package",
      "items": {
        "type": "object",
        "properties": {
          "title": {
            "type": "string",
            "description": "The title of this dataset"
          },
          "fileUri": {
            "type": "string",
            "format": "uri",
            "description": "The URI which resolves to the file representation of this dataset"
          },
          "seeAlso": {
            "type": "array",
            "description": "An array of URIs containing additional metadata or information about the resource that may be of value to users",
            "items": {
              "type": "object",
              "properties": {
                "label": {
                  "type": "string",
                  "description": "A label for the URI"
                },
                "uri": {
                  "type": "string",
                  "format": "uri",
                  "description": "The URI containing additional information"
                }
              },
              "required": [
                "label",
                "uri"
              ]
            }
          },
          "additionalMetadata": {
            "type": "object",
            "description": "Additional metadata about this dataset beyond the required fields"
          }
        },
        "required": [
          "title",
          "fileUri"
        ]
      }
    }
  },
  "required": [
    "user",
    "title",
    "objects"
  ]
}
