<?xml version="1.0" encoding="utf-8"?>
<!-- Generator: Adobe Illustrator 24.2.3, SVG Export Plug-In . SVG Version: 6.00 Build 0)  -->
<svg version="1.1" id="Layer_1" xmlns="http://www.w3.org/2000/svg" xmlns:xlink="http://www.w3.org/1999/xlink" x="0px" y="0px"
	 viewBox="0 0 358.8 374.7" style="enable-background:new 0 0 358.8 374.7;" xml:space="preserve">
<style type="text/css">
	.st0{opacity:0.5;fill:#173D7A;}
	.st1{fill:#FF6C17;}
	.st2{fill:#FFFFFF;}
	.st3{fill:#5793CE;}
	.st4{fill:#173D7A;}
	.st5{fill:#396CAA;}
	.st6{fill:#D4ECFF;}
	.st7{fill:#5858FB;}
	.st8{fill:#DD4D05;}
	.st9{fill:#092E63;}
	.st10{fill:#F9BF30;}
	.st11{fill:#FDD762;}
	.st12{fill:#E8A200;}
	.st13{opacity:0.4;}
	.st14{opacity:0.2;fill:#FFFFFF;}
	.st15{opacity:0.7;fill:#FFFFFF;}
	.st16{opacity:0.5;fill:#092E63;}
	.st17{fill:url(#SVGID_1_);}
	.st18{fill:url(#SVGID_2_);}
	.st19{fill:url(#SVGID_3_);}
	.st20{opacity:0.3;fill:#06033E;}
</style>
<g>
	<g>
		<ellipse class="st0" cx="106.8" cy="134" rx="20.2" ry="10.6"/>
		<path class="st1" d="M129.8,124.9V119h-1.2c-1.1-1.7-2.9-3.3-5.5-4.7c-9-4.7-23.5-4.7-32.5,0c-2.6,1.4-4.4,3-5.5,4.7h-1.2v5.8h0
			c0,3.1,2.2,6.2,6.7,8.6c9,4.7,23.5,4.7,32.5,0C127.5,131.1,129.8,128,129.8,124.9z"/>
		<path class="st1" d="M123,127.6c-9,4.7-23.5,4.7-32.5,0c-9-4.7-9-12.4,0-17.1c9-4.7,23.5-4.7,32.5,0S132,122.9,123,127.6z"/>
		<path class="st2" d="M123,127.6c-9,4.7-23.5,4.7-32.5,0c-4.3-2.3-6.5-5.2-6.7-8.2c-0.2,3.2,2,6.5,6.7,8.9c9,4.7,23.5,4.7,32.5,0
			c4.7-2.5,6.9-5.7,6.7-8.9C129.6,122.4,127.3,125.3,123,127.6z"/>
	</g>
	<g>
		<path class="st2" d="M95.8,123c-0.4-0.2-0.6-0.5-0.6-0.8l0-7.9c0-0.6,0.9-1.1,2.1-1.1c1.1,0,2.1,0.5,2.1,1.1l0,6.5l20.8-2.3
			c1.1-0.1,2.2,0.3,2.4,0.8c0.2,0.6-0.5,1.2-1.6,1.3l-23.3,2.6c-0.6,0.1-1.2,0-1.7-0.2C95.9,123.1,95.8,123.1,95.8,123z"/>
	</g>
</g>
<g>
	<g>
		<path class="st0" d="M294.6,180.7l-77.3-44.8c-4.2-2.4-11.5-2.1-16.4,0.7L38.5,230c-4.9,2.8-5.4,7-1.2,9.5l77.3,44.8
			c4.2,2.4,11.5,2.1,16.4-0.7l162.3-93.4C298.2,187.4,298.8,183.1,294.6,180.7z"/>
		<path class="st3" d="M112.4,267.7L31.9,221c-2.6-1.5-3.9-3.6-3.8-5.7l0,0l0-11.7l4.5,5.2c0.3-0.2,0.6-0.4,0.9-0.6l164.7-94.8
			c6.5-3.8,16.4-4.2,22.1-0.9l79.4,46c1.6-1.8,5-5.5,5-5.5l0,11.4l0,0c0.1,2.6-1.7,5.3-5.4,7.4l-164.7,94.8
			C127.9,270.5,118,270.9,112.4,267.7z"/>
		<path class="st4" d="M68.9,239.1l4.6,2.7c0.6,0.4,1.1,0,1.1-0.8l0,0c0-0.8-0.5-1.8-1.1-2.1l-4.6-2.7c-0.6-0.4-1.1,0-1.1,0.8v0
			C67.8,237.8,68.3,238.7,68.9,239.1z"/>
		<path class="st5" d="M198.2,113.5c6.5-3.8,16.4-4.2,22.1-0.9l79.4,46c1.6-1.8,5-5.5,5-5.5l0,11.4l0,0c0.1,2.6-1.7,5.3-5.4,7.4
			l-164.7,94.8c-3.4,2-7.7,3-11.9,3.1l0.2-112.9L198.2,113.5z"/>
		<path class="st6" d="M300.8,147.5l-80.5-46.6c-5.7-3.3-15.5-2.9-22.1,0.9L33.5,196.6c-6.5,3.8-7.3,9.5-1.6,12.7l80.5,46.6
			c5.7,3.3,15.5,2.9,22.1-0.9l164.7-94.8C305.7,156.5,306.4,150.8,300.8,147.5z"/>
		<path class="st2" d="M112.4,257.2l-80.5-46.6c-2.9-1.7-4.1-4-3.7-6.4c0.1,1.9,1.4,3.8,3.8,5.2l80.5,46.6
			c5.7,3.3,15.5,2.9,22.1-0.9l164.7-94.8c3.2-1.8,5-4.1,5.3-6.3c0.2,2.6-1.6,5.4-5.4,7.6l-164.7,94.8
			C127.9,260,118,260.4,112.4,257.2z"/>
		<path class="st4" d="M294.6,149.4l-77.3-44.8c-4.2-2.4-11.5-2.1-16.4,0.7L38.5,198.6c-4.9,2.8-5.4,7-1.2,9.5l77.3,44.8
			c4.2,2.4,11.5,2.1,16.4-0.7l162.3-93.4C298.2,156,298.8,151.8,294.6,149.4z"/>
	</g>
	<g>
		<polygon class="st6" points="134.1,229.6 79.5,198.1 83,196.1 137.6,227.6 		"/>
		<polygon class="st6" points="96.2,220.5 68.5,204.5 72,202.5 99.6,218.4 		"/>
		<polygon class="st7" points="109.6,228.2 100.6,223 104.1,221 113,226.2 		"/>
		<polygon class="st2" points="123.1,236 114.1,230.8 117.6,228.8 126.6,234 		"/>
		<polygon class="st2" points="96.5,214.3 74,201.3 77.5,199.3 99.9,212.3 		"/>
		<polygon class="st6" points="123.8,230.1 101.4,217.1 104.9,215.1 127.3,228.1 		"/>
		<g>
			<path class="st7" d="M107.2,202.4c-1.1,0.6-2.9,0.6-4.1,0c-1.1-0.6-1.1-1.7,0-2.3c1.1-0.6,2.9-0.6,4.1,0
				C108.4,200.7,108.4,201.7,107.2,202.4z"/>
			<path class="st2" d="M113.3,205.9c-1.1,0.6-2.9,0.6-4.1,0c-1.1-0.6-1.1-1.7,0-2.3c1.1-0.6,2.9-0.6,4.1,0
				C114.4,204.2,114.4,205.3,113.3,205.9z"/>
			<path class="st6" d="M119.4,209.4c-1.1,0.6-2.9,0.6-4.1,0c-1.1-0.6-1.1-1.7,0-2.3c1.1-0.6,2.9-0.6,4.1,0
				C120.5,207.7,120.5,208.8,119.4,209.4z"/>
			<path class="st7" d="M125.5,212.9c-1.1,0.6-2.9,0.6-4.1,0c-1.1-0.6-1.1-1.7,0-2.3c1.1-0.6,2.9-0.6,4.1,0
				C126.6,211.2,126.6,212.3,125.5,212.9z"/>
			<path class="st2" d="M131.5,216.4c-1.1,0.6-2.9,0.6-4.1,0c-1.1-0.6-1.1-1.7,0-2.3c1.1-0.6,2.9-0.6,4.1,0
				C132.6,214.7,132.6,215.8,131.5,216.4z"/>
		</g>
	</g>
	<g>
		<polygon class="st7" points="253.6,149.7 244.4,144.4 248,142.3 257.2,147.6 		"/>
		<polygon class="st2" points="266.4,157.1 257.2,151.8 260.8,149.7 270,155 		"/>
		<polygon class="st2" points="212.5,125.8 203.4,120.5 206.9,118.4 216.1,123.7 		"/>
		<polygon class="st2" points="251.5,155.1 238.7,147.7 242.3,145.6 255.1,153 		"/>
		<polygon class="st6" points="260.7,160.4 255.1,157.1 258.7,155.1 264.3,158.3 		"/>
	</g>
</g>
<g>
	<g>
		<polygon class="st0" points="297.4,135.7 281.8,126.7 297.4,117.7 313,126.7 		"/>
		<polygon class="st8" points="313,115.3 297.4,124.3 297.4,106.3 313,97.4 		"/>
		<polygon class="st1" points="297.4,106.3 281.8,97.4 297.4,88.4 313,97.4 		"/>
		<polygon class="st1" points="297.4,124.3 281.8,115.3 281.8,97.4 297.4,106.3 		"/>
	</g>
	<polygon class="st2" points="291.8,114.6 287.4,112.1 287.4,107.1 291.8,109.6 	"/>
</g>
<g>
	<g>
		<polygon class="st0" points="20.9,192.2 4.7,182.9 20.9,173.6 37.1,182.9 		"/>
		<polygon class="st4" points="37.1,171 20.9,180.4 20.9,161.7 37.1,152.3 		"/>
		<polygon class="st6" points="20.9,161.7 4.7,152.3 20.9,143 37.1,152.3 		"/>
		<polygon class="st3" points="20.9,180.4 4.7,171 4.7,152.3 20.9,161.7 		"/>
	</g>
	<polygon class="st2" points="15.1,170.3 10.6,167.7 10.6,162.4 15.1,165.1 	"/>
</g>
<ellipse class="st9" cx="176.5" cy="181.4" rx="37.5" ry="21.6"/>
<g>
	<g>
		<path class="st10" d="M211.4,167.6h-1.6c-1.8-3.6-5.2-6.9-10-9.8c-15.5-9-40.8-9-56.3,0c-4.9,2.8-8.2,6.2-10,9.8h-1.6v6.5l0,0
			c0,5.9,3.9,11.8,11.7,16.3c15.5,9,40.8,9,56.3,0c7.8-4.5,11.7-10.4,11.7-16.3l0,0V167.6z"/>
		<path class="st11" d="M162.9,151.7c-7.2,0.9-14,3-19.5,6.2c-4.9,2.8-8.2,6.2-10,9.8h-1.6v6.5c0,5.9,3.9,11.8,11.7,16.3
			c5.6,3.2,12.4,5.3,19.5,6.2V151.7z"/>
		<path class="st12" d="M199.8,190.3c7.7-4.5,11.6-10.3,11.6-16.2v-6.5h-1.6c-1.5-3-4.2-5.9-8-8.5h-1.9V190.3z"/>
		<g class="st13">
			<path class="st12" d="M209.3,166.9c-0.5-0.8-1.1-1.7-1.7-2.5v19.5c0.7-0.8,1.2-1.7,1.7-2.5V166.9z"/>
			<path class="st12" d="M143.4,157.9c-2.2,1.2-4,2.6-5.6,4v24.4c0.5,0.5,1.1,1,1.7,1.5v-26.5h3.3V190c0.2,0.1,0.4,0.2,0.6,0.4
				c0.4,0.2,0.8,0.4,1.1,0.6v-29.7h3.3v31.2c0.6,0.2,1.1,0.5,1.7,0.7v-31.9h3.3v33.1c0.6,0.2,1.1,0.3,1.7,0.5v-33.6h3.3v34.4
				c0.6,0.1,1.1,0.2,1.7,0.3v-34.7h3.3v35.2c0.6,0.1,1.1,0.1,1.7,0.2v-35.4h3.3V197c0.6,0,1.2,0.1,1.7,0.1v-35.7h3.3v35.8
				c0.6,0,1.2,0,1.7-0.1v-35.7h3.3v35.5c0.6-0.1,1.2-0.1,1.7-0.2v-35.3h3.3v34.9c0.6-0.1,1.2-0.2,1.7-0.3v-34.6h3.3v33.8
				c0.6-0.1,1.2-0.3,1.7-0.5v-33.3h3.3v32.3c0.6-0.2,1.2-0.4,1.7-0.7v-31.6h3.3v30.2c0.6-0.3,1.2-0.6,1.7-0.9v-29.2h3.3v27.2
				c0.6-0.4,1.2-0.9,1.7-1.3v-25.8h0.3c-1.4-1.2-3.1-2.4-4.9-3.5c-3.6-2.1-7.8-3.7-12.2-4.8h-31.9
				C151.2,154.2,147,155.8,143.4,157.9z"/>
			<path class="st12" d="M134.6,165.6c-0.5,0.7-0.9,1.3-1.2,2h-0.5v11.9c0.4,1.1,1,2.1,1.7,3.1V165.6z"/>
		</g>
		<ellipse class="st11" cx="171.6" cy="167.6" rx="39.8" ry="23"/>
		<path class="st14" d="M180.5,171.5c11.4-6.6,14.5-16.2,9-24.4c-14.9-4.4-33.6-2.9-46.1,4.3c-11.4,6.6-14.5,16.2-9,24.4
			C149.3,180.2,168,178.8,180.5,171.5z"/>
		<path class="st15" d="M199.7,183.9c-15.5,9-40.8,9-56.3,0c-7.5-4.3-11.4-10-11.6-15.7c-0.3,6.1,3.6,12.2,11.6,16.8
			c15.5,9,40.8,9,56.3,0c8-4.6,11.9-10.8,11.6-16.8C211.1,173.9,207.2,179.5,199.7,183.9z"/>
		<ellipse class="st12" cx="171.6" cy="167.6" rx="28.3" ry="16.3"/>
		<path class="st10" d="M151.6,157.6c11-6.4,28.9-6.4,40,0c5.2,3,7.9,6.9,8.2,10.8c0.3-4.4-2.4-8.9-8.2-12.3c-11-6.4-28.9-6.4-40,0
			c-5.8,3.4-8.6,7.9-8.2,12.3C143.6,164.4,146.4,160.6,151.6,157.6z"/>
		<path class="st10" d="M185.4,159.9l-2.2,0.6l0.6,0.2l-2.1,1.2c-1.7-0.9-3.6-1.3-5.4-1.3c-1.9,0-3.6,0.5-5.2,1.4
			c-0.6,0.4-1.2,0.8-1.6,1.1c-0.4,0.4-0.7,0.8-0.8,1.2s-0.3,0.8-0.3,1.2c0,0.4,0,0.8,0,1.3l0.3,2c0.1,0.6,0.1,1,0.1,1.4
			c0,0.4-0.2,0.7-0.5,1.1c-0.3,0.4-0.7,0.7-1.3,1.1c-1,0.6-1.9,0.6-2.7,0.2c-0.6-0.3-0.7-0.8-0.5-1.3c0.3-0.5,1.1-1.2,2.4-1.9V168
			l-1.9,0.7l-2.7-1.1c-1.6,1-2.7,2-3.2,2.9l-0.3-0.3v1.5l0,0c0,1,0.8,2,2.3,3l-1.1,0.6l-1.4-0.7v1.5l1.3,0.7l2.5-1.5
			c1.6,0.7,3.3,1.1,5.1,1c1.8-0.1,3.4-0.5,4.8-1.3c0.7-0.4,1.3-0.8,1.7-1.3c0.4-0.4,0.8-0.9,1-1.4c0.2-0.5,0.3-0.9,0.4-1.4
			c0-0.4,0-0.9,0-1.5l-0.2-1.9c0-0.4-0.1-0.7-0.1-0.8c0-0.2,0-0.4,0.1-0.7c0.1-0.3,0.2-0.6,0.4-0.8c0.2-0.2,0.5-0.5,0.9-0.7
			c0.4-0.2,0.9-0.4,1.4-0.5c0.5-0.1,1,0,1.4,0.2c0.2,0.1,0.4,0.2,0.4,0.3c0.1,0.1,0.1,0.2,0.1,0.3l-2.2,0.5v1.5l4.5,2
			c0.4-0.2,0.7-0.4,1-0.7c0.3-0.2,0.6-0.4,0.9-0.7c0.3-0.3,0.6-0.6,0.8-0.8c0.2-0.3,0.3-0.6,0.4-0.9c0-0.2,0.1-0.3,0.1-0.4l0,0v0
			c0,0,0,0,0,0v-1.5l-0.6,0.1c0,0,0,0,0,0c-0.3-0.4-0.7-0.7-1.2-1l2.4-1.4V159.9z"/>
		<g>
			<path class="st11" d="M158,174.5l2.5-1.4c-1.7-1.1-2.5-2.2-2.3-3.3c0.2-1.1,1.3-2.3,3.5-3.7l4.6,1.9c-1.3,0.8-2.1,1.4-2.4,1.9
				c-0.3,0.5-0.1,0.9,0.5,1.3c0.8,0.5,1.7,0.4,2.7-0.2c0.6-0.3,1-0.7,1.3-1.1c0.3-0.4,0.4-0.8,0.5-1.1c0-0.4,0-0.8-0.1-1.4l-0.3-2
				c-0.1-0.5-0.1-0.9,0-1.3c0-0.4,0.1-0.7,0.3-1.2c0.2-0.4,0.4-0.8,0.8-1.2c0.4-0.4,0.9-0.8,1.6-1.1c1.6-0.9,3.4-1.4,5.2-1.4
				c1.9,0,3.7,0.4,5.4,1.3l2.4-1.4l1.3,0.8l-2.4,1.4c0.5,0.3,0.9,0.7,1.2,1c0.3,0.4,0.5,0.7,0.5,1c0.1,0.3,0.1,0.6,0,1
				c-0.1,0.3-0.2,0.6-0.4,0.9c-0.2,0.3-0.4,0.5-0.8,0.8c-0.3,0.3-0.6,0.5-0.9,0.7c-0.3,0.2-0.6,0.4-1,0.7l-4.5-2
				c0.3-0.2,0.6-0.4,0.8-0.5c0.2-0.1,0.4-0.3,0.7-0.5c0.2-0.2,0.4-0.3,0.5-0.4c0.1-0.1,0.2-0.3,0.2-0.4c0-0.1,0-0.3-0.1-0.4
				c-0.1-0.1-0.2-0.2-0.4-0.3c-0.4-0.2-0.9-0.3-1.4-0.2c-0.5,0.1-1,0.2-1.4,0.5c-0.4,0.2-0.7,0.5-0.9,0.7c-0.2,0.2-0.4,0.5-0.4,0.8
				c-0.1,0.3-0.1,0.6-0.1,0.7c0,0.2,0,0.5,0.1,0.8l0.2,1.9c0,0.5,0.1,1,0,1.5c0,0.4-0.2,0.9-0.4,1.4c-0.2,0.5-0.5,0.9-1,1.4
				c-0.4,0.4-1,0.9-1.7,1.3c-1.4,0.8-3,1.2-4.8,1.3c-1.8,0.1-3.5-0.3-5.1-1l-2.5,1.5L158,174.5z"/>
		</g>
	</g>
</g>
<g>
	<g>
		<path class="st10" d="M214.2,155.9h-1.6c-1.8-3.6-5.2-6.9-10-9.8c-15.5-9-40.8-9-56.3,0c-4.9,2.8-8.2,6.2-10,9.8h-1.6v6.5l0,0
			c0,5.9,3.9,11.8,11.7,16.3c15.5,9,40.8,9,56.3,0c7.8-4.5,11.7-10.4,11.7-16.3l0,0V155.9z"/>
		<path class="st11" d="M165.8,140c-7.2,0.9-14,3-19.5,6.2c-4.9,2.8-8.2,6.2-10,9.8h-1.6v6.5c0,5.9,3.9,11.8,11.7,16.3
			c5.6,3.2,12.4,5.3,19.5,6.2V140z"/>
		<path class="st12" d="M202.7,178.6c7.7-4.5,11.6-10.3,11.6-16.2v-6.5h-1.6c-1.5-3-4.2-5.9-8-8.5h-1.9V178.6z"/>
		<g class="st13">
			<path class="st12" d="M212.2,155.1c-0.5-0.8-1.1-1.7-1.7-2.5v19.5c0.7-0.8,1.2-1.7,1.7-2.5V155.1z"/>
			<path class="st12" d="M146.2,146.2c-2.2,1.2-4,2.6-5.6,4v24.4c0.5,0.5,1.1,1,1.7,1.5v-26.5h3.3v28.7c0.2,0.1,0.4,0.2,0.6,0.4
				c0.4,0.2,0.8,0.4,1.1,0.6v-29.7h3.3v31.2c0.6,0.2,1.1,0.5,1.7,0.7v-31.9h3.3v33.1c0.6,0.2,1.1,0.3,1.7,0.5v-33.6h3.3V184
				c0.6,0.1,1.1,0.2,1.7,0.3v-34.7h3.3v35.2c0.6,0.1,1.1,0.1,1.7,0.2v-35.4h3.3v35.7c0.6,0,1.2,0.1,1.7,0.1v-35.7h3.3v35.8
				c0.6,0,1.2,0,1.7-0.1v-35.7h3.3v35.5c0.6-0.1,1.2-0.1,1.7-0.2v-35.3h3.3v34.9c0.6-0.1,1.2-0.2,1.7-0.3v-34.6h3.3v33.8
				c0.6-0.1,1.2-0.3,1.7-0.5v-33.3h3.3v32.3c0.6-0.2,1.2-0.4,1.7-0.7v-31.6h3.3v30.2c0.6-0.3,1.2-0.6,1.7-0.9v-29.2h3.3v27.2
				c0.6-0.4,1.2-0.9,1.7-1.3v-25.8h0.3c-1.4-1.2-3.1-2.4-4.9-3.5c-3.6-2.1-7.8-3.7-12.2-4.8h-31.9
				C154,142.5,149.9,144.1,146.2,146.2z"/>
			<path class="st12" d="M137.4,153.9c-0.5,0.7-0.9,1.3-1.2,2h-0.5v11.9c0.4,1.1,1,2.1,1.7,3.1V153.9z"/>
		</g>
		<ellipse class="st11" cx="174.4" cy="155.9" rx="39.8" ry="23"/>
		<path class="st14" d="M183.3,159.8c11.4-6.6,14.5-16.2,9-24.4c-14.9-4.4-33.6-2.9-46.1,4.3c-11.4,6.6-14.5,16.2-9,24.4
			C152.1,168.5,170.8,167,183.3,159.8z"/>
		<path class="st15" d="M202.5,172.2c-15.5,9-40.8,9-56.3,0c-7.5-4.3-11.4-10-11.6-15.7c-0.3,6.1,3.6,12.2,11.6,16.8
			c15.5,9,40.8,9,56.3,0c8-4.6,11.9-10.8,11.6-16.8C213.9,162.2,210.1,167.8,202.5,172.2z"/>
		<ellipse class="st12" cx="174.4" cy="155.9" rx="28.3" ry="16.3"/>
		<path class="st10" d="M154.4,145.9c11-6.4,28.9-6.4,40,0c5.2,3,7.9,6.9,8.2,10.8c0.3-4.4-2.4-8.9-8.2-12.3c-11-6.4-28.9-6.4-40,0
			c-5.8,3.4-8.6,7.9-8.2,12.3C146.5,152.7,149.2,148.9,154.4,145.9z"/>
		<path class="st10" d="M188.3,148.2l-2.2,0.6l0.6,0.2l-2.1,1.2c-1.7-0.9-3.6-1.3-5.4-1.3c-1.9,0-3.6,0.5-5.2,1.4
			c-0.6,0.4-1.2,0.8-1.6,1.1c-0.4,0.4-0.7,0.8-0.8,1.2c-0.2,0.4-0.3,0.8-0.3,1.2c0,0.4,0,0.8,0,1.3l0.3,2c0.1,0.6,0.1,1,0.1,1.4
			c0,0.4-0.2,0.7-0.5,1.1c-0.3,0.4-0.7,0.7-1.3,1.1c-1,0.6-1.9,0.6-2.7,0.2c-0.6-0.3-0.7-0.8-0.5-1.3c0.3-0.5,1.1-1.2,2.4-1.9v-1.5
			l-1.9,0.7l-2.7-1.1c-1.6,1-2.7,2-3.2,2.9l-0.3-0.3v1.5l0,0c0,1,0.8,2,2.3,3l-1.1,0.6l-1.4-0.7v1.5l1.3,0.7l2.5-1.5
			c1.6,0.7,3.3,1.1,5.1,1c1.8-0.1,3.4-0.5,4.8-1.3c0.7-0.4,1.3-0.8,1.7-1.3c0.4-0.4,0.8-0.9,1-1.4c0.2-0.5,0.3-0.9,0.4-1.4
			c0-0.4,0-0.9,0-1.5l-0.2-1.9c0-0.4-0.1-0.7-0.1-0.8c0-0.2,0-0.4,0.1-0.7c0.1-0.3,0.2-0.6,0.4-0.8c0.2-0.2,0.5-0.5,0.9-0.7
			c0.4-0.2,0.9-0.4,1.4-0.5c0.5-0.1,1,0,1.4,0.2c0.2,0.1,0.4,0.2,0.4,0.3c0.1,0.1,0.1,0.2,0.1,0.2l-2.2,0.5v1.5l4.5,2
			c0.4-0.2,0.7-0.5,1-0.7c0.3-0.2,0.6-0.4,0.9-0.7c0.3-0.3,0.6-0.6,0.8-0.8c0.2-0.3,0.3-0.6,0.4-0.9c0-0.2,0.1-0.3,0.1-0.4l0,0v0
			c0,0,0,0,0,0l0-1.5l-0.6,0.1c0,0,0,0,0,0c-0.3-0.4-0.7-0.7-1.2-1l2.4-1.4V148.2z"/>
		<g>
			<path class="st11" d="M160.9,162.8l2.5-1.4c-1.7-1.1-2.5-2.2-2.3-3.3c0.2-1.1,1.3-2.3,3.5-3.7l4.6,1.9c-1.3,0.8-2.1,1.4-2.4,1.9
				c-0.3,0.5-0.1,0.9,0.5,1.3c0.8,0.5,1.7,0.4,2.7-0.2c0.6-0.3,1-0.7,1.3-1.1c0.3-0.4,0.4-0.8,0.5-1.1c0-0.4,0-0.8-0.1-1.4l-0.3-2
				c-0.1-0.5-0.1-0.9,0-1.3c0-0.4,0.1-0.7,0.3-1.2s0.4-0.8,0.8-1.2c0.4-0.4,0.9-0.8,1.6-1.1c1.6-0.9,3.4-1.4,5.2-1.4
				c1.9,0,3.7,0.4,5.4,1.3l2.4-1.4l1.3,0.8l-2.4,1.4c0.5,0.3,0.9,0.7,1.2,1c0.3,0.4,0.5,0.7,0.5,1c0.1,0.3,0.1,0.6,0,1
				c-0.1,0.3-0.2,0.6-0.4,0.9c-0.2,0.3-0.4,0.5-0.8,0.8c-0.3,0.3-0.6,0.5-0.9,0.7c-0.3,0.2-0.6,0.4-1,0.7l-4.5-2
				c0.3-0.2,0.6-0.4,0.8-0.5c0.2-0.1,0.4-0.3,0.7-0.5s0.4-0.3,0.5-0.4c0.1-0.1,0.2-0.3,0.2-0.4c0-0.1,0-0.3-0.1-0.4
				c-0.1-0.1-0.2-0.2-0.4-0.3c-0.4-0.2-0.9-0.3-1.4-0.2c-0.5,0.1-1,0.2-1.4,0.5c-0.4,0.2-0.7,0.5-0.9,0.7c-0.2,0.2-0.4,0.5-0.4,0.8
				c-0.1,0.3-0.1,0.6-0.1,0.7c0,0.2,0,0.5,0.1,0.8l0.2,1.9c0,0.5,0.1,1,0,1.5c0,0.4-0.2,0.9-0.4,1.4s-0.5,0.9-1,1.4
				c-0.4,0.4-1,0.9-1.7,1.3c-1.4,0.8-3,1.2-4.8,1.3c-1.8,0.1-3.5-0.3-5.1-1l-2.5,1.5L160.9,162.8z"/>
		</g>
	</g>
</g>
<path class="st16" d="M198.2,101.8l-26.8,15.4l33.2,19.2l38.5-22.2l-22.9-13.2C214.6,97.6,204.7,98,198.2,101.8z"/>
<g>
	<g>
		<g>
			<path class="st4" d="M249.7,89.2l-6.6-3.8l24.3-14c1.1-0.7,1.1-1.7,0-2.4l-24.8-14.3c-1.1-0.7-3-0.7-4.2,0l-24.3,14l-6.6-3.8
				l24.3-14c4.8-2.8,12.5-2.8,17.3,0L274,65.2c4.8,2.8,4.8,7.2,0,10L249.7,89.2z"/>
		</g>
		<g>
			<path class="st6" d="M260.3,90.9c0-3.5-2.1-7.6-4.8-9.1l-44-25.4c-1.2-0.7-2.3-0.7-3.1-0.3l0,0L156,86.6l50.8,38.3l51.7-30
				c0.2-0.1,0.3-0.2,0.5-0.3l0,0l0,0C259.8,94,260.3,92.7,260.3,90.9z"/>
			<path class="st5" d="M206.7,124.9l51.7-30c0.2-0.1,0.3-0.2,0.5-0.3l0,0l0,0c0.9-0.7,1.4-1.9,1.4-3.7c0-1.7-0.5-3.5-1.3-5.1
				l-59,34L206.7,124.9z"/>
			<path class="st4" d="M203.4,124.8l-44-25.4c-2.6-1.5-4.8-5.6-4.8-9.1l0,0c0-3.5,2.1-5.1,4.8-3.6l44,25.4c2.6,1.5,4.8,5.6,4.8,9.1
				l0,0C208.2,124.7,206.1,126.3,203.4,124.8z"/>
			<path class="st2" d="M204,111.8l-44-25.4c-1.2-0.7-2.3-0.7-3.2-0.2c0.8-0.2,1.7-0.1,2.6,0.5l44,25.4c2.6,1.5,4.8,5.6,4.8,9.1v0
				c0,1.9-0.6,3.2-1.6,3.8c1.3-0.4,2.1-1.9,2.1-4.1v0C208.7,117.4,206.6,113.3,204,111.8z"/>
		</g>
		<path class="st7" d="M196.9,116.2l-5.3-3c-0.5-0.3-1-1.1-1-1.8l0,0c0-0.7,0.4-1,1-0.7l5.3,3c0.5,0.3,1,1.1,1,1.8l0,0
			C197.8,116.2,197.4,116.5,196.9,116.2z"/>
	</g>
	<g>
		<path class="st3" d="M202.8,80.1c1.6-0.9,1.6-2.4,0-3.4s-4.2-0.9-5.8,0.1c-1.6,0.9-1.6,2.4,0,3.4
			C198.6,81.1,201.2,81.1,202.8,80.1z"/>
		<path class="st2" d="M211.7,85.1c1.6-0.9,1.6-2.4,0-3.4c-1.6-0.9-4.2-0.9-5.8,0.1c-1.6,0.9-1.6,2.4,0,3.4
			C207.5,86.1,210.1,86,211.7,85.1z"/>
		<path class="st2" d="M220.5,90.1c1.6-0.9,1.6-2.4,0-3.4c-1.6-0.9-4.2-0.9-5.8,0.1c-1.6,0.9-1.6,2.4,0,3.4
			C216.3,91.1,218.9,91,220.5,90.1z"/>
	</g>
</g>
<g>
	<path class="st0" d="M184.9,323.8l-30.3-17.5c-1.9-1.1-1.6-2.9,0.5-4.2l29.2-16.9c2.1-1.2,5.4-1.4,7.3-0.3l30.3,17.5
		c1.9,1.1,1.6,2.9-0.5,4.2l-29.2,16.9C190,324.8,186.8,324.9,184.9,323.8z"/>
	<path class="st5" d="M223.2,294L223.2,294v-10.4l-23.4,0l-8.1-4.7c-1.9-1.1-5.1-0.9-7.3,0.3l-7.6,4.4l-23.5,0v10.7
		c-0.1,0.7,0.4,1.4,1.2,1.9l30.3,17.5c1.9,1.1,5.1,0.9,7.3-0.3l29.2-16.9C222.7,295.8,223.3,294.9,223.2,294z"/>
	<path class="st5" d="M188.3,278.2c-1.4,0-2.8,0.4-3.9,1l-7.6,4.4l-23.5,0v10.7c-0.1,0.7,0.4,1.4,1.2,1.9l30.3,17.5
		c0.9,0.5,2.1,0.7,3.4,0.7V278.2z"/>
	<path class="st3" d="M156.1,283.5l-2.7,0v10.7c-0.1,0.7,0.4,1.4,1.2,1.9l1.4,0.8V283.5z"/>
	<path class="st3" d="M185.4,313.9c1.6,0.7,3.9,0.6,5.8-0.1v-12.2h-5.8V313.9z"/>
	<path class="st6" d="M184.9,303l-30.3-17.5c-1.9-1.1-1.6-2.9,0.5-4.2l29.2-16.9c2.1-1.2,5.4-1.4,7.3-0.3l30.3,17.5
		c1.9,1.1,1.6,2.9-0.5,4.2l-29.2,16.9C190,303.9,186.8,304.1,184.9,303z"/>
	<path class="st2" d="M221.4,283.8l-29.2,16.9c-2.1,1.2-5.4,1.4-7.3,0.3l-30.3-17.5c-0.4-0.2-0.7-0.5-0.9-0.8
		c-0.6,1-0.3,2.1,0.9,2.9l30.3,17.5c1.9,1.1,5.1,0.9,7.3-0.3l29.2-16.9c1.7-1,2.2-2.3,1.4-3.4C222.6,282.9,222.1,283.4,221.4,283.8z
		"/>
	<g>
		<path class="st6" d="M212,296.8c0,0.8-0.5,1.7-1.2,2.1c-0.7,0.4-1.2,0.1-1.2-0.7s0.5-1.7,1.2-2.1C211.5,295.7,212,296,212,296.8z"
			/>
		<path class="st6" d="M216,294.5c0,0.8-0.5,1.7-1.2,2.1c-0.7,0.4-1.2,0.1-1.2-0.7c0-0.8,0.5-1.7,1.2-2.1
			C215.4,293.4,216,293.7,216,294.5z"/>
		<path class="st6" d="M219.9,292.2c0,0.8-0.5,1.7-1.2,2.1c-0.7,0.4-1.2,0.1-1.2-0.7s0.5-1.7,1.2-2.1
			C219.4,291.1,219.9,291.5,219.9,292.2z"/>
	</g>
	<g>
		<path class="st3" d="M186.7,292.2l-14.2-8.2c-0.9-0.5-0.8-1.4,0.2-2l13.7-7.9c1-0.6,2.5-0.6,3.4-0.1l14.2,8.2
			c0.9,0.5,0.8,1.4-0.2,2l-13.7,7.9C189.1,292.6,187.6,292.7,186.7,292.2z"/>
		<path class="st6" d="M188.1,285.3l-2-1.1c-0.1-0.1-0.1-0.2,0-0.3l1.9-1.1c0.1-0.1,0.3-0.1,0.5,0l2,1.1c0.1,0.1,0.1,0.2,0,0.3
			l-1.9,1.1C188.4,285.4,188.2,285.4,188.1,285.3z"/>
		<path class="st5" d="M172.5,284L172.5,284c0.1,0,0.2-0.1,0.2-0.1l13.7-7.9c1-0.6,2.5-0.6,3.4-0.1L204,284c0.8-0.6,0.8-1.4,0-1.8
			l-14.2-8.2c-0.9-0.5-2.4-0.4-3.4,0.1l-13.7,7.9C171.8,282.6,171.7,283.5,172.5,284z"/>
	</g>
</g>
<g>
	<g>
		<g>
			<g>
				<path class="st0" d="M293.1,333.8l-46.6-26.9c-1.7-1-1.5-2.7,0.5-3.8l49.4-28.6c2-1.1,5-1.3,6.7-0.3l46.6,26.9
					c1.7,1,1.5,2.7-0.5,3.8l-49.4,28.6C297.8,334.7,294.8,334.8,293.1,333.8z"/>
				<g>
					
						<linearGradient id="SVGID_1_" gradientUnits="userSpaceOnUse" x1="45.1641" y1="1353.3695" x2="45.1641" y2="1241.9365" gradientTransform="matrix(0.866 0.5 0 1.1547 286.7254 -1316.5021)">
						<stop  offset="0" style="stop-color:#2D0979"/>
						<stop  offset="1" style="stop-color:#5B04F7"/>
					</linearGradient>
					<path class="st17" d="M350.8,283.2l-49.9-28.8c-1.9-1.1-3.5-4.1-3.5-6.7V128.4c0-2.6,1.6-3.8,3.5-2.7l49.9,28.8
						c1.9,1.1,3.5,4.1,3.5,6.7v119.3C354.3,283.1,352.7,284.3,350.8,283.2z"/>
					<path class="st5" d="M350.8,154.5l-49.9-28.8c-0.9-0.5-1.7-0.5-2.3-0.2l0,0l-56.9,32.8l2.7,9.9l51.9,147.8l56.7-32.7
						c0,0,0,0,0,0l0.1-0.1l0,0c0.7-0.4,1.2-1.4,1.2-2.8V161.2C354.3,158.7,352.7,155.7,350.8,154.5z"/>
					<path class="st6" d="M350.8,154.5l-49.9-28.8c-0.9-0.5-1.7-0.5-2.3-0.2l0,0l-56.9,32.8l2.7,9.9l14.3,40.6l2.7,1.6l91.9-53.1
						C352.7,156.2,351.8,155.1,350.8,154.5z"/>
					<path class="st3" d="M293.9,316L244,287.2c-1.9-1.1-3.5-4.1-3.5-6.7V161.2c0-2.6,1.6-3.8,3.5-2.7l49.9,28.8
						c1.9,1.1,3.5,4.1,3.5,6.7v119.3C297.4,315.9,295.8,317.1,293.9,316z"/>
					
						<linearGradient id="SVGID_2_" gradientUnits="userSpaceOnUse" x1="-51.4424" y1="1361.0569" x2="4.5537" y2="1348.3682" gradientTransform="matrix(0.866 0.5 0 1.1547 286.7254 -1316.5021)">
						<stop  offset="0" style="stop-color:#3919BB"/>
						<stop  offset="1" style="stop-color:#6507FA"/>
					</linearGradient>
					<path class="st18" d="M290.8,308.8l-43.6-25.2c-1.7-1-3.1-3.6-3.1-5.9V167c0-2.3,1.4-3.3,3.1-2.3l43.6,25.2
						c1.7,1,3.1,3.6,3.1,5.9v110.8C293.8,308.8,292.4,309.8,290.8,308.8z"/>
					
						<linearGradient id="SVGID_3_" gradientUnits="userSpaceOnUse" x1="-51.4424" y1="1361.0569" x2="4.5537" y2="1348.3682" gradientTransform="matrix(0.866 0.5 0 1.1547 286.7254 -1316.5021)">
						<stop  offset="0" style="stop-color:#3919BB"/>
						<stop  offset="1" style="stop-color:#6507FA"/>
					</linearGradient>
					<path class="st19" d="M290.8,308.8l-43.6-25.2c-1.7-1-3.1-3.6-3.1-5.9V167c0-2.3,1.4-3.3,3.1-2.3l43.6,25.2
						c1.7,1,3.1,3.6,3.1,5.9v110.8C293.8,308.8,292.4,309.8,290.8,308.8z"/>
					<path class="st4" d="M290.8,308.8l-43.6-25.2c-1.7-1-3.1-3.6-3.1-5.9V167c0-2.3,1.4-3.3,3.1-2.3l43.6,25.2
						c1.7,1,3.1,3.6,3.1,5.9v110.8C293.8,308.8,292.4,309.8,290.8,308.8z"/>
					<path class="st5" d="M292.2,308l-43.6-25.2c-1.7-1-3.1-3.6-3.1-5.9V166.2c0-0.8,0.2-1.4,0.4-1.8c-1.1,0-1.9,1-1.9,2.7v110.8
						c0,2.3,1.4,4.9,3.1,5.9l43.6,25.2c1.1,0.6,2.1,0.4,2.6-0.5C293,308.4,292.6,308.2,292.2,308z"/>
				</g>
			</g>
		</g>
		<g>
			<g>
				<path class="st4" d="M290.8,258l-16.2-9.4l-25.8,14.9l45.1,26v-25.7C293.8,261.6,292.4,258.9,290.8,258z"/>
				<path class="st4" d="M290.8,235.3l-16.2-9.4l-25.8,14.9l45.1,26v-25.7C293.8,238.9,292.4,236.2,290.8,235.3z"/>
				<path class="st4" d="M290.8,212.6l-16.2-9.4l-25.8,14.9l45.1,26v-25.7C293.8,216.2,292.4,213.5,290.8,212.6z"/>
				<path class="st4" d="M290.8,189.8l-16.2-9.4l-25.8,14.9l45.1,26v-25.7C293.8,193.5,292.4,190.8,290.8,189.8z"/>
				<path class="st4" d="M290.8,189.8l-35.9-20.7l-6.2,3.6l45.1,26v-3C293.8,193.5,292.4,190.8,290.8,189.8z"/>
			</g>
			<polygon class="st3" points="293.8,198.7 248.7,172.7 248.7,187.1 293.8,213.1 			"/>
			<polygon class="st3" points="293.8,221.5 248.7,195.4 248.7,209.8 293.8,235.8 			"/>
			<polygon class="st3" points="293.8,244.2 248.7,218.1 248.7,232.5 293.8,258.5 			"/>
			<polygon class="st3" points="293.8,266.9 248.7,240.8 248.7,255.2 293.8,281.2 			"/>
			<polygon class="st3" points="293.8,289.6 248.7,263.5 248.7,277.9 293.8,303.9 			"/>
		</g>
		<g>
			<path class="st4" d="M289.8,208l-34-19.6c-1-0.6-1.7-2-1.7-3.3v-3.8c0-1.3,0.8-1.9,1.7-1.3l34,19.6c1,0.6,1.7,2,1.7,3.3v3.8
				C291.6,208,290.8,208.5,289.8,208z"/>
			<path class="st20" d="M257.6,187.6c-1-0.6-1.7-2-1.7-3.3v-3.8c0-0.2,0-0.4,0.1-0.6l0,0c-1-0.6-1.7,0-1.7,1.3v3.8
				c0,1.3,0.8,2.8,1.7,3.3l34,19.6c0.8,0.5,1.5,0.1,1.7-0.8L257.6,187.6z"/>
			<path class="st2" d="M279.2,197.5l-20.4-11.8c-0.3-0.2-0.6-0.7-0.6-1.2l0,0c0-0.4,0.3-0.7,0.6-0.5l20.4,11.8
				c0.3,0.2,0.6,0.7,0.6,1.2l0,0C279.8,197.4,279.5,197.6,279.2,197.5z"/>
		</g>
		<g>
			<path class="st4" d="M289.8,230.6l-34-19.6c-1-0.6-1.7-2-1.7-3.3v-3.8c0-1.3,0.8-1.9,1.7-1.3l34,19.6c1,0.6,1.7,2,1.7,3.3v3.8
				C291.6,230.5,290.8,231.1,289.8,230.6z"/>
			<path class="st20" d="M257.6,210.2c-1-0.6-1.7-2-1.7-3.3V203c0-0.2,0-0.4,0.1-0.6l0,0c-1-0.6-1.7,0-1.7,1.3v3.8
				c0,1.3,0.8,2.8,1.7,3.3l34,19.6c0.8,0.5,1.5,0.1,1.7-0.8L257.6,210.2z"/>
			<path class="st2" d="M279.2,220l-20.4-11.8c-0.3-0.2-0.6-0.7-0.6-1.2l0,0c0-0.4,0.3-0.7,0.6-0.5l20.4,11.8
				c0.3,0.2,0.6,0.7,0.6,1.2l0,0C279.8,220,279.5,220.2,279.2,220z"/>
		</g>
		<g>
			<path class="st4" d="M289.8,253.3l-34-19.6c-1-0.6-1.7-2-1.7-3.3v-3.8c0-1.3,0.8-1.9,1.7-1.3l34,19.6c1,0.6,1.7,2,1.7,3.3v3.8
				C291.6,253.3,290.8,253.9,289.8,253.3z"/>
			<path class="st20" d="M257.6,233c-1-0.6-1.7-2-1.7-3.3v-3.8c0-0.2,0-0.4,0.1-0.6l0,0c-1-0.6-1.7,0-1.7,1.3v3.8
				c0,1.3,0.8,2.8,1.7,3.3l34,19.6c0.8,0.5,1.5,0.1,1.7-0.8L257.6,233z"/>
			<path class="st6" d="M279.2,242.8L258.7,231c-0.3-0.2-0.6-0.7-0.6-1.2l0,0c0-0.4,0.3-0.7,0.6-0.5l20.4,11.8
				c0.3,0.2,0.6,0.7,0.6,1.2l0,0C279.8,242.8,279.5,243,279.2,242.8z"/>
		</g>
		<g>
			<path class="st4" d="M289.8,276.3l-34-19.6c-1-0.6-1.7-2-1.7-3.3v-3.8c0-1.3,0.8-1.9,1.7-1.3l34,19.6c1,0.6,1.7,2,1.7,3.3v3.8
				C291.6,276.3,290.8,276.9,289.8,276.3z"/>
			<path class="st20" d="M257.6,256c-1-0.6-1.7-2-1.7-3.3v-3.8c0-0.2,0-0.4,0.1-0.6l0,0c-1-0.6-1.7,0-1.7,1.3v3.8
				c0,1.3,0.8,2.8,1.7,3.3l34,19.6c0.8,0.5,1.5,0.1,1.7-0.8L257.6,256z"/>
			<path class="st7" d="M279.2,265.8L258.7,254c-0.3-0.2-0.6-0.7-0.6-1.2l0,0c0-0.4,0.3-0.7,0.6-0.5l20.4,11.8
				c0.3,0.2,0.6,0.7,0.6,1.2l0,0C279.8,265.8,279.5,266,279.2,265.8z"/>
		</g>
		<g>
			<path class="st4" d="M289.8,298.8l-34-19.6c-1-0.6-1.7-2-1.7-3.3v-3.8c0-1.3,0.8-1.9,1.7-1.3l34,19.6c1,0.6,1.7,2,1.7,3.3v3.8
				C291.6,298.8,290.8,299.4,289.8,298.8z"/>
			<path class="st20" d="M257.6,278.5c-1-0.6-1.7-2-1.7-3.3v-3.8c0-0.2,0-0.4,0.1-0.6l0,0c-1-0.6-1.7,0-1.7,1.3v3.8
				c0,1.3,0.8,2.8,1.7,3.3l34,19.6c0.8,0.5,1.5,0.1,1.7-0.8L257.6,278.5z"/>
			<path class="st6" d="M279.2,288.3l-20.4-11.8c-0.3-0.2-0.6-0.7-0.6-1.2l0,0c0-0.4,0.3-0.7,0.6-0.5l20.4,11.8
				c0.3,0.2,0.6,0.7,0.6,1.2l0,0C279.8,288.3,279.5,288.5,279.2,288.3z"/>
		</g>
		<polygon class="st0" points="248.7,172.7 252.3,174.8 252.3,189.1 248.7,187.1 		"/>
		<polygon class="st0" points="248.7,195.4 252.3,197.5 252.3,211.8 248.7,209.8 		"/>
		<polygon class="st0" points="248.7,218.1 252.3,220.2 252.3,234.5 248.7,232.5 		"/>
		<polygon class="st0" points="248.7,240.8 252.3,242.9 252.3,257.2 248.7,255.2 		"/>
		<polygon class="st0" points="248.7,263.5 252.3,265.6 252.3,279.9 248.7,277.9 		"/>
	</g>
	<path class="st6" d="M283.2,198.9c0,0.5-0.3,0.6-0.7,0.4c-0.4-0.2-0.7-0.8-0.7-1.2c0-0.5,0.3-0.6,0.7-0.4
		C282.9,197.9,283.2,198.4,283.2,198.9z"/>
	<path class="st7" d="M286.3,200.6c0,0.5-0.3,0.6-0.7,0.4c-0.4-0.2-0.7-0.8-0.7-1.2s0.3-0.6,0.7-0.4
		C285.9,199.6,286.3,200.2,286.3,200.6z"/>
	<path class="st6" d="M289.3,202.4c0,0.5-0.3,0.6-0.7,0.4c-0.4-0.2-0.7-0.8-0.7-1.2s0.3-0.6,0.7-0.4
		C289,201.4,289.3,201.9,289.3,202.4z"/>
	<path class="st7" d="M283.2,221.6c0,0.5-0.3,0.6-0.7,0.4c-0.4-0.2-0.7-0.8-0.7-1.2s0.3-0.6,0.7-0.4
		C282.9,220.5,283.2,221.1,283.2,221.6z"/>
	<path class="st6" d="M286.3,223.3c0,0.5-0.3,0.6-0.7,0.4c-0.4-0.2-0.7-0.8-0.7-1.2s0.3-0.6,0.7-0.4
		C285.9,222.3,286.3,222.9,286.3,223.3z"/>
	<path class="st2" d="M289.3,225.1c0,0.5-0.3,0.6-0.7,0.4c-0.4-0.2-0.7-0.8-0.7-1.2s0.3-0.6,0.7-0.4
		C289,224.1,289.3,224.6,289.3,225.1z"/>
	<path class="st2" d="M283.2,244.4c0,0.5-0.3,0.6-0.7,0.4c-0.4-0.2-0.7-0.8-0.7-1.2s0.3-0.6,0.7-0.4
		C282.9,243.4,283.2,244,283.2,244.4z"/>
	<path class="st7" d="M286.3,246.2c0,0.5-0.3,0.6-0.7,0.4c-0.4-0.2-0.7-0.8-0.7-1.2s0.3-0.6,0.7-0.4
		C285.9,245.2,286.3,245.7,286.3,246.2z"/>
	<path class="st2" d="M289.3,247.9c0,0.5-0.3,0.6-0.7,0.4c-0.4-0.2-0.7-0.8-0.7-1.2s0.3-0.6,0.7-0.4
		C289,246.9,289.3,247.5,289.3,247.9z"/>
	<path class="st2" d="M283.2,267c0,0.5-0.3,0.6-0.7,0.4c-0.4-0.2-0.7-0.8-0.7-1.2s0.3-0.6,0.7-0.4
		C282.9,265.9,283.2,266.5,283.2,267z"/>
	<path class="st6" d="M286.3,268.7c0,0.5-0.3,0.6-0.7,0.4c-0.4-0.2-0.7-0.8-0.7-1.2c0-0.5,0.3-0.6,0.7-0.4
		C285.9,267.7,286.3,268.3,286.3,268.7z"/>
	<path class="st6" d="M289.3,270.5c0,0.5-0.3,0.6-0.7,0.4c-0.4-0.2-0.7-0.8-0.7-1.2c0-0.5,0.3-0.6,0.7-0.4
		C289,269.5,289.3,270,289.3,270.5z"/>
	<path class="st2" d="M283.2,289.8c0,0.5-0.3,0.6-0.7,0.4c-0.4-0.2-0.7-0.8-0.7-1.2c0-0.5,0.3-0.6,0.7-0.4
		C282.9,288.8,283.2,289.3,283.2,289.8z"/>
	<path class="st7" d="M286.3,291.6c0,0.5-0.3,0.6-0.7,0.4c-0.4-0.2-0.7-0.8-0.7-1.2c0-0.5,0.3-0.6,0.7-0.4
		C285.9,290.5,286.3,291.1,286.3,291.6z"/>
	<path class="st6" d="M289.3,293.3c0,0.5-0.3,0.6-0.7,0.4c-0.4-0.2-0.7-0.8-0.7-1.2c0-0.5,0.3-0.6,0.7-0.4
		C289,292.3,289.3,292.9,289.3,293.3z"/>
	<g>
		<path class="st4" d="M304.9,299.9V198.3l0.2-0.1l42.5-24.5v101.6l-0.2,0.1L304.9,299.9z M305.7,198.8v99.7l41-23.7v-99.7
			L305.7,198.8z"/>
	</g>
	<g>
		<path class="st4" d="M336.5,219.4l-19,11c-1.3,0.7-2.3,0-2.3-1.8v-10.6c0-1.7,1-3.7,2.3-4.4l19-11c1.3-0.7,2.3,0,2.3,1.8v10.6
			C338.9,216.7,337.8,218.6,336.5,219.4z"/>
		<path class="st3" d="M337,202.4c0.1,0.3,0.2,0.6,0.2,1.1v10.6c0,1.7-1,3.7-2.3,4.4l-19,11c-0.2,0.1-0.3,0.2-0.5,0.2
			c0.3,0.9,1.2,1.3,2.1,0.7l19-11c1.3-0.7,2.3-2.7,2.3-4.4v-10.6C338.9,202.9,338.1,202.1,337,202.4z"/>
		<g>
			<g>
				<path class="st2" d="M333.1,213c0.4-0.2,0.6,0,0.6,0.4v2.4c0,0.4-0.3,0.9-0.6,1.1c-0.4,0.2-0.6,0-0.6-0.4v-2.4
					C332.4,213.7,332.7,213.2,333.1,213z"/>
				<path class="st6" d="M330.3,214.9c0.4-0.2,0.6,0,0.6,0.4v2.1c0,0.4-0.3,0.9-0.6,1.1c-0.4,0.2-0.6,0-0.6-0.4V216
					C329.7,215.6,330,215.1,330.3,214.9z"/>
				<path class="st1" d="M327.6,214.1c0.4-0.2,0.6,0,0.6,0.4v4.5c0,0.4-0.3,0.9-0.6,1.1c-0.4,0.2-0.6,0-0.6-0.4v-4.5
					C327,214.8,327.3,214.3,327.6,214.1z"/>
				<path class="st6" d="M324.9,213.1c0.4-0.2,0.6,0,0.6,0.4v7c0,0.4-0.3,0.9-0.6,1.1c-0.4,0.2-0.6,0-0.6-0.4v-7
					C324.2,213.8,324.5,213.3,324.9,213.1z"/>
				<path class="st6" d="M322.1,215.4c0.4-0.2,0.6,0,0.6,0.4v6.3c0,0.4-0.3,0.9-0.6,1.1c-0.4,0.2-0.6,0-0.6-0.4v-6.3
					C321.5,216.1,321.8,215.7,322.1,215.4z"/>
				<path class="st2" d="M319.4,219.9c0.4-0.2,0.6,0,0.6,0.4v3.4c0,0.4-0.3,0.9-0.6,1.1c-0.4,0.2-0.6,0-0.6-0.4V221
					C318.8,220.6,319.1,220.1,319.4,219.9z"/>
			</g>
			<path class="st1" d="M332.4,211.8c0,0.4,0.3,0.6,0.6,0.4c0.3-0.2,0.6-0.7,0.6-1.1c0-0.4-0.3-0.6-0.6-0.4
				C332.7,210.9,332.4,211.4,332.4,211.8z"/>
			<path class="st2" d="M332.4,209.5c0,0.4,0.3,0.6,0.6,0.4c0.3-0.2,0.6-0.7,0.6-1.1c0-0.4-0.3-0.6-0.6-0.4
				C332.7,208.7,332.4,209.1,332.4,209.5z"/>
		</g>
	</g>
</g>
</svg>
