{
    "technologyStack": [{  
        "id": 1,  
        "title": "Backend Engineering",  
        "desc" : "We use Java and JavaScript based frameworks for server-side development. We use relational as well as NoSQL databases for faster processing of complex set of data.",
        "imageUrls": ["/assets/images/technologies/1.png",
            "/assets/images/technologies/2.png",
            "/assets/images/technologies/3.png",
            "/assets/images/technologies/5.png",
            "/assets/images/technologies/6.png",
            "/assets/images/technologies/7.png",
            "/assets/images/technologies/8.png",
            "/assets/images/technologies/9.png"
                ] 
    }, {  
        "id": 2,  
        "title": "Backend Engineering",  
        "desc" : "We use Java and JavaScript based frameworks for server-side development. We use relational as well as NoSQL databases for faster processing of complex set of data.",
        "imageUrls": ["/assets/images/technologies/1.png",
            "/assets/images/technologies/2.png",
            "/assets/images/technologies/3.png",
            "/assets/images/technologies/5.png",
            "/assets/images/technologies/6.png",
            "/assets/images/technologies/7.png",
            "/assets/images/technologies/8.png",
            "/assets/images/technologies/9.png"
        ] 
    }]  
    }