req_amount,ap_reply,ap_limit,as_reply,as_limit,accepted
150001,false,0,silent,0,false
150001,true,0,high,0,true
150001,true,0,low,0,true
150001,true,0,silent,0,true
149999,false,0,silent,0,false
149999,true,0,high,0,true
149999,true,0,low,0,true
149999,true,0,silent,0,true
300000,false,0,silent,0,false
300000,true,0,high,0,true
300000,true,0,low,0,true
300000,true,0,silent,0,true
1500000,false,0,silent,0,false
1500000,true,0,high,0,true
1500000,true,0,low,0,true
1500000,true,0,silent,0,true
150000,false,0,silent,0,false
150000,true,0,high,0,true
150000,true,0,low,0,true
150000,true,0,silent,0,true
1501,false,0,high,0,false
1501,silent,0,low,0,true
1501,true,0,low,0,true
1501,false,0,low,0,true
1499,false,0,high,0,false
1499,silent,0,low,0,true
1499,true,0,low,0,true
1499,false,0,low,0,true
3000,false,0,high,0,false
3000,silent,0,low,0,true
3000,true,0,low,0,true
3000,false,0,low,0,true
15000,false,0,high,0,false
15000,true,0,high,0,true
15000,true,0,low,0,true
15000,true,0,silent,0,true
1500,false,0,high,0,false
1500,silent,0,low,0,true
1500,true,0,low,0,true
1500,false,0,low,0,true
