format	3
recorder	GAmera2 v2.0-SNAPSHOT (2012.06.15 05:54:43)
timestamp	2012/06/15 13:32:36.463 CEST
maxOrder	1
missingAreInvalid	false
attributeRanges	1	4	1	5	1	1	4	2	1	1	1	1	1	1	1	1	1	1	1	1	1	1	1	1	1	1	1	1	1	1	2	2	2
locationCounts	0	0	0	2	0	0	1	0	0	0	1	0	2	0	0	2	0	0	1	0	0	0	0	0	9	1	2	1	1	9	2	2	2
operatorNames	ISV	EAA	EEU	ERR	ELL	ECC	ECN	EMD	EMF	AFP	ASF	AIS	AIE	AWR	AJC	ASI	APM	APA	XMF	XMC	XMT	XTF	XER	XEE	AEL	EIU	EIN	EAP	EAN	CFA	CDE	CCO	CDC
analyzeWallNanos	1631430281
executorClassName	es.uca.webservices.gamera.exec.BPELExecutor
cleanupWallNanos	1415974974
prepareWallNanos	25967860343
comparisons	55
N	1	4	1	1	5	0	0	0	0	0	5	746440083	746440083	746440083	746440083	746440083	5552416886
N	1	4	1	2	5	1	1	1	1	1	5	1412755557	1412755557	1412755557	1412755557	1412755557	8960596352
N	1	4	1	3	5	1	1	1	1	1	5	1349147716	1349147716	1349147716	1349147716	1349147716	9050432685
N	1	4	1	4	5	1	1	1	0	0	5	1363175554	1363175554	1363175554	1363175554	1363175554	7655309618
N	1	4	1	5	5	0	0	0	1	1	5	368788096	368788096	368788096	368788096	368788096	4274177748
N	1	4	2	1	5	1	0	0	0	0	5	352559459	352559459	352559459	352559459	352559459	2768289516
N	1	4	2	2	5	1	0	0	0	0	5	361213558	361213558	361213558	361213558	361213558	2845438343
N	1	4	2	3	5	1	0	0	0	0	5	376888662	376888662	376888662	376888662	376888662	2859718107
N	1	4	2	4	5	1	0	0	0	0	5	348657206	348657206	348657206	348657206	348657206	2687382388
N	1	4	2	5	5	1	1	1	0	0	5	365179609	365179609	365179609	365179609	365179609	4161964901
N	1	7	1	1	5	0	0	0	0	0	5	362093312	362093312	362093312	362093312	362093312	2677613938
N	1	7	1	2	5	0	0	0	0	0	5	358072795	358072795	358072795	358072795	358072795	2706321777
N	1	7	1	3	5	0	0	0	0	0	5	333129267	333129267	333129267	333129267	333129267	2642515413
N	1	7	1	4	5	1	1	1	0	0	5	1069458741	1069458741	1069458741	1069458741	1069458741	4806584817
N	1	11	1	1	5	1	1	1	0	0	5	1070304266	1070304266	1070304266	1070304266	1070304266	4815049979
N	1	13	1	1	5	0	1	1	0	0	5	342790710	342790710	342790710	342790710	342790710	4142396776
N	1	13	2	1	5	0	0	0	1	1	5	328362214	328362214	328362214	328362214	328362214	4016391841
N	1	16	1	1	5	1	1	1	1	1	5	1060048392	1060048392	1060048392	1060048392	1060048392	6127117365
N	1	16	2	1	5	1	1	1	0	0	5	1063625846	1063625846	1063625846	1063625846	1063625846	4675103820
N	1	19	1	1	5	0	0	0	0	0	5	332914987	332914987	332914987	332914987	332914987	2655563716
N	1	25	1	1	5	0	0	0	0	0	5	327829523	327829523	327829523	327829523	327829523	2574444470
N	1	25	2	1	5	1	1	1	1	1	5	1061286912	1061286912	1061286912	1061286912	1061286912	6118448152
N	1	25	3	1	5	1	1	1	0	0	5	1062235362	1062235362	1062235362	1062235362	1062235362	4632436926
N	1	25	4	1	5	1	1	1	0	0	5	1067800274	1067800274	1067800274	1067800274	1067800274	4693615415
N	1	25	5	1	5	1	1	1	0	0	5	335473546	335473546	335473546	335473546	335473546	3973776105
N	1	25	6	1	5	1	0	0	0	0	5	341668772	341668772	341668772	341668772	341668772	2532376356
N	1	25	7	1	5	0	1	1	0	0	5	334423954	334423954	334423954	334423954	334423954	3980897074
N	1	25	8	1	5	0	0	0	1	1	5	342453714	342453714	342453714	342453714	342453714	4028898980
N	1	25	9	1	5	1	1	1	1	1	5	328955994	328955994	328955994	328955994	328955994	2574492630
N	1	26	1	1	5	1	1	1	0	0	5	1070403093	1070403093	1070403093	1070403093	1070403093	4801679150
N	1	27	1	1	5	1	1	1	1	1	5	1066199796	1066199796	1066199796	1066199796	1066199796	6263666600
N	1	27	2	1	5	1	1	1	0	0	5	336079098	336079098	336079098	336079098	336079098	4002495460
N	1	28	1	1	5	0	0	0	0	0	5	328837312	328837312	328837312	328837312	328837312	2513389861
N	1	29	1	1	5	1	1	1	0	0	5	1072751437	1072751437	1072751437	1072751437	1072751437	4680756276
N	1	30	1	1	5	0	0	0	0	0	5	332299391	332299391	332299391	332299391	332299391	2520660215
N	1	30	2	1	5	1	1	1	1	1	5	1060306453	1060306453	1060306453	1060306453	1060306453	6121280278
N	1	30	3	1	5	1	1	1	0	0	5	1056815559	1056815559	1056815559	1056815559	1056815559	4598338355
N	1	30	4	1	5	1	1	1	0	0	5	1056782074	1056782074	1056782074	1056782074	1056782074	4568811841
N	1	30	5	1	5	1	1	1	0	0	5	339613766	339613766	339613766	339613766	339613766	3969258638
N	1	30	6	1	5	1	0	0	0	0	5	327576629	327576629	327576629	327576629	327576629	3247921030
N	1	30	7	1	5	0	1	1	0	0	5	331080818	331080818	331080818	331080818	331080818	3901761389
N	1	30	8	1	5	0	0	0	1	1	5	334073351	334073351	334073351	334073351	334073351	3889150169
N	1	30	9	1	5	1	1	1	1	1	5	324799792	324799792	324799792	324799792	324799792	2422547239
N	1	31	1	1	5	0	0	0	1	1	5	330893314	330893314	330893314	330893314	330893314	3943733643
N	1	31	1	2	5	1	1	1	0	0	5	1069430176	1069430176	1069430176	1069430176	1069430176	4663683257
N	1	31	2	1	5	0	1	1	0	0	5	324283007	324283007	324283007	324283007	324283007	4001329516
N	1	31	2	2	5	1	0	0	0	0	5	340835582	340835582	340835582	340835582	340835582	2549676626
N	1	32	1	1	5	0	0	0	1	1	5	332847414	332847414	332847414	332847414	332847414	3951445608
N	1	32	1	2	5	1	1	1	0	0	5	1076573724	1076573724	1076573724	1076573724	1076573724	4655845417
N	1	32	2	1	5	0	1	1	0	0	5	336719093	336719093	336719093	336719093	336719093	3956420610
N	1	32	2	2	5	1	0	0	0	0	5	340264289	340264289	340264289	340264289	340264289	2459116777
N	1	33	1	1	5	0	0	0	1	1	5	336111237	336111237	336111237	336111237	336111237	4037663410
N	1	33	1	2	5	1	1	1	0	0	5	1065486371	1065486371	1065486371	1065486371	1065486371	4593742114
N	1	33	2	1	5	0	1	1	0	0	5	330069000	330069000	330069000	330069000	330069000	3866958977
N	1	33	2	2	5	1	0	0	0	0	5	333439278	333439278	333439278	333439278	333439278	2500099526
