% -*- latex -*-

\begin{tikzpicture}
  \matrix (m) [matrix of nodes, ampersand replacement=\&, nodes={draw,
    text width=3.5em, text centered, minimum height=4.5em,anchor=center}] {
    |[fill=green!10]|Nodo BPEL \&
    |[fill=green!10]|Nodo BPEL \& |[fill=structure!10]|Árbol AST XPath \& |[fill=structure!10]|Nodo AST XPath \&
    |[fill=green!10]|Nodo BPEL \& |[fill=structure!10]|Posición \\
  };

  \draw[dotted, ultra thick] (m.west) -- +(-1em, 0);
  \draw[dotted, ultra thick] (m.east) -- +( 1em, 0);
  \draw[decorate,decoration={brace,amplitude=.5em}]
    (m-1-1.north west) -- node[midway,above,yshift=.5em] {op\textsubscript{1}} (m-1-1.north east);
  \draw[decorate,decoration={brace,amplitude=.5em}]
    (m-1-2.north west) -- node[midway,above,yshift=.5em] {op\textsubscript{2}} (m-1-4.north east);
  \draw[decorate,decoration={brace,amplitude=.5em}]
    (m-1-5.north west) -- node[midway,above,yshift=.5em] {op\textsubscript{3}} (m-1-6.north east);
\end{tikzpicture}
