ISV 0 1
EAA 0 4
EEU 0 1
ERR 2 5
ELL 0 1
ECC 13 1
ECN 1 4
EMD 0 2
EMF 0 2
ACI 0 1
AFP 0 1
ASF 4 1
AIS 0 1
AIE 2 1
AWR 0 1
AJC 0 1
ASI 12 1
APM 0 1
APA 0 1
XMF 0 1
XMC 0 1
XMT 0 1
XTF 0 1
XER 0 1
XEE 0 1
AEL 17 1
