<?xml version="1.0" encoding="UTF-8" standalone="no"?>
<!DOCTYPE svg PUBLIC "-//W3C//DTD SVG 1.1//EN" "http://www.w3.org/Graphics/SVG/1.1/DTD/svg11.dtd">
<!-- Generated by Microsoft Visio, SVG Export timestamp_inserter_blk.svg Page-1 -->
<svg xmlns="http://www.w3.org/2000/svg" xmlns:xlink="http://www.w3.org/1999/xlink" xmlns:ev="http://www.w3.org/2001/xml-events"
		xmlns:v="http://schemas.microsoft.com/visio/2003/SVGExtensions/" width="10.7663in" height="5.90793in"
		viewBox="0 0 775.175 425.371" xml:space="preserve" color-interpolation-filters="sRGB" class="st9">
	<v:documentProperties v:langID="2057">
		<v:userDefs>
			<v:ud v:nameU="msvSubprocessMaster" v:prompt="" v:val="VT4(Rectangle)"/>
			<v:ud v:nameU="msvNoAutoConnect" v:val="VT0(1):26"/>
		</v:userDefs>
	</v:documentProperties>

	<style type="text/css">
	<![CDATA[
		.st1 {fill:#4672c4;stroke:#c7c8c8;stroke-width:0.25}
		.st2 {fill:#feffff;font-family:Calibri;font-size:1.33333em}
		.st3 {marker-end:url(#mrkr13-12);marker-start:url(#mrkr13-10);stroke:#4672c4;stroke-linecap:round;stroke-linejoin:round;stroke-width:0.999999}
		.st4 {fill:#4672c4;fill-opacity:1;stroke:#4672c4;stroke-opacity:1;stroke-width:0.28409061919554}
		.st5 {fill:none;stroke:none;stroke-width:0.25}
		.st6 {fill:#4672c4;font-family:Calibri;font-size:1.33333em;font-weight:bold}
		.st7 {marker-start:url(#mrkr13-10);stroke:#4672c4;stroke-linecap:round;stroke-linejoin:round;stroke-width:0.999999}
		.st8 {font-size:1em}
		.st9 {fill:none;fill-rule:evenodd;font-size:12px;overflow:visible;stroke-linecap:square;stroke-miterlimit:3}
	]]>
	</style>

	<defs id="Markers">
		<g id="lend13">
			<path d="M 3 1 L 0 0 L 3 -1 L 3 1 " style="stroke:none"/>
		</g>
		<marker id="mrkr13-10" class="st4" v:arrowType="13" v:arrowSize="2" v:setback="0" refX="0" orient="auto"
				markerUnits="strokeWidth" overflow="visible">
			<use xlink:href="#lend13" transform="scale(3.5200035919233) "/>
		</marker>
		<marker id="mrkr13-12" class="st4" v:arrowType="13" v:arrowSize="2" v:setback="0" refX="-0" orient="auto"
				markerUnits="strokeWidth" overflow="visible">
			<use xlink:href="#lend13" transform="scale(-3.5200035919233,-3.5200035919233) "/>
		</marker>
	</defs>
	<g v:mID="0" v:index="1" v:groupContext="foregroundPage">
		<v:userDefs>
			<v:ud v:nameU="msvThemeOrder" v:val="VT0(0):26"/>
		</v:userDefs>
		<title>Page-1</title>
		<v:pageProperties v:drawingScale="0.0393701" v:pageScale="0.0393701" v:drawingUnits="24" v:shadowOffsetX="8.50393"
				v:shadowOffsetY="-8.50393"/>
		<g id="shape1-1" v:mID="1" v:groupContext="shape" transform="translate(276.911,-140.948)">
			<title>Sheet.1</title>
			<desc>Timestamp_Inserter</desc>
			<v:userDefs/>
			<v:textBlock v:margins="rect(3.99999,3.99999,3.99999,3.99999)" v:tabSpace="42.5196"/>
			<v:textRect cx="113.386" cy="342.6" width="226.78" height="165.543"/>
			<rect x="0" y="259.828" width="226.772" height="165.543" class="st1"/>
			<text x="47.5" y="347.4" class="st2" v:langID="1033"><v:paragraph v:horizAlign="1"/><v:tabList/>Timestamp_Inserter</text>		</g>
		<g id="shape2-4" v:mID="2" v:groupContext="shape" transform="translate(739.128,39.51) rotate(90)">
			<title>Sheet.2</title>
			<path d="M0 425.37 L10.2 425.37 L10.56 425.37 L68.81 425.37 L79.37 425.37" class="st3"/>
		</g>
		<g id="shape3-13" v:mID="3" v:groupContext="shape" transform="translate(893.619,39.51) rotate(90)">
			<title>Sheet.3</title>
			<path d="M0 425.37 L10.2 425.37 L10.56 425.37 L68.81 425.37 L79.37 425.37" class="st3"/>
		</g>
		<g id="shape4-20" v:mID="4" v:groupContext="shape" transform="translate(221.636,-387.278)">
			<title>Sheet.4</title>
			<desc>continuous_mode</desc>
			<v:userDefs/>
			<v:textBlock v:margins="rect(3.99999,3.99999,3.99999,3.99999)" v:tabSpace="42.5196"/>
			<v:textRect cx="92.8346" cy="415.449" width="185.67" height="19.8425"/>
			<rect x="0" y="405.528" width="185.669" height="19.8425" class="st5"/>
			<text x="32.67" y="420.25" class="st6" v:langID="1033"><v:paragraph v:horizAlign="1"/><v:tabList/>continuous_mode</text>		</g>
		<g id="shape5-23" v:mID="5" v:groupContext="shape" transform="translate(364.785,-387.278)">
			<title>Sheet.5</title>
			<desc>timestamp_pending</desc>
			<v:userDefs/>
			<v:textBlock v:margins="rect(3.99999,3.99999,3.99999,3.99999)" v:tabSpace="42.5196"/>
			<v:textRect cx="102.756" cy="415.449" width="205.52" height="19.8425"/>
			<rect x="0" y="405.528" width="205.512" height="19.8425" class="st5"/>
			<text x="35.83" y="420.25" class="st6" v:langID="1033"><v:paragraph v:horizAlign="1"/><v:tabList/>timestamp_pending</text>		</g>
		<g id="shape6-26" v:mID="6" v:groupContext="shape" transform="translate(812.829,284.423) rotate(90)">
			<title>Sheet.6</title>
			<path d="M0 425.37 L10.2 425.37 L10.56 425.37 L79.37 425.37" class="st7"/>
		</g>
		<g id="shape7-31" v:mID="7" v:groupContext="shape" transform="translate(285.415,-27.2789)">
			<title>Sheet.7</title>
			<desc>TIME (seconds and fractional)</desc>
			<v:userDefs/>
			<v:textBlock v:margins="rect(3.99999,3.99999,3.99999,3.99999)" v:tabSpace="42.5196"/>
			<v:textRect cx="102.756" cy="415.449" width="205.52" height="19.8425"/>
			<rect x="0" y="405.528" width="205.512" height="19.8425" class="st5"/>
			<text x="85.77" y="410.65" class="st6" v:langID="1033"><v:paragraph v:horizAlign="1"/><v:tabList/>TIME<v:newlineChar/><tspan
						x="23.06" dy="1.2em" class="st8">(</tspan>seconds and fractional)</text>		</g>
		<g id="shape8-35" v:mID="8" v:groupContext="shape" transform="translate(276.911,629.286) rotate(180)">
			<title>Sheet.8</title>
			<path d="M0 425.37 L10.2 425.37 L10.56 425.37 L242.36 425.37" class="st7"/>
		</g>
		<g id="shape9-40" v:mID="9" v:groupContext="shape" transform="translate(18.25,-227.122)">
			<title>Sheet.9</title>
			<desc>samples input (protocol-less)</desc>
			<v:userDefs/>
			<v:textBlock v:margins="rect(3.99999,3.99999,3.99999,3.99999)" v:tabSpace="42.5196"/>
			<v:textRect cx="113.386" cy="415.449" width="226.78" height="19.8425"/>
			<rect x="0" y="405.528" width="226.772" height="19.8425" class="st5"/>
			<text x="17.09" y="420.25" class="st6" v:langID="1033"><v:paragraph v:horizAlign="1"/><v:tabList/>samples input (protocol-less)</text>		</g>
		<g id="shape10-43" v:mID="10" v:groupContext="shape" transform="translate(746.044,629.286) rotate(180)">
			<title>Sheet.10</title>
			<path d="M0 425.37 L10.2 425.37 L10.56 425.37 L242.36 425.37" class="st7"/>
		</g>
		<g id="shape11-48" v:mID="11" v:groupContext="shape" transform="translate(507.934,-225.704)">
			<title>Sheet.11</title>
			<desc>samples output (protocol-less)</desc>
			<v:userDefs/>
			<v:textBlock v:margins="rect(3.99999,3.99999,3.99999,3.99999)" v:tabSpace="42.5196"/>
			<v:textRect cx="113.386" cy="415.449" width="226.78" height="19.8425"/>
			<rect x="0" y="405.528" width="226.772" height="19.8425" class="st5"/>
			<text x="11.98" y="420.25" class="st6" v:langID="1033"><v:paragraph v:horizAlign="1"/><v:tabList/>samples output (protocol-less)</text>		</g>
	</g>
</svg>
