<?xml version="1.0" encoding="UTF-8"?>
<!DOCTYPE svg PUBLIC "-//W3C//DTD SVG 1.1//EN" "http://www.w3.org/Graphics/SVG/1.1/DTD/svg11.dtd">
<svg version="1.2" width="231.06mm" height="36.74mm" viewBox="1000 20773 23106 3674" preserveAspectRatio="xMidYMid" fill-rule="evenodd" stroke-width="28.222" stroke-linejoin="round" xmlns="http://www.w3.org/2000/svg" xmlns:ooo="http://xml.openoffice.org/svg/export" xmlns:xlink="http://www.w3.org/1999/xlink" xmlns:presentation="http://sun.com/xmlns/staroffice/presentation" xmlns:smil="http://www.w3.org/2001/SMIL20/" xmlns:anim="urn:oasis:names:tc:opendocument:xmlns:animation:1.0" xml:space="preserve">
 <defs class="ClipPathGroup">
  <clipPath id="presentation_clip_path" clipPathUnits="userSpaceOnUse">
   <rect x="1000" y="20773" width="23106" height="3674"/>
  </clipPath>
  <clipPath id="presentation_clip_path_shrink" clipPathUnits="userSpaceOnUse">
   <rect x="1023" y="20776" width="23060" height="3667"/>
  </clipPath>
 </defs>
 <defs>
  <font id="EmbeddedFont_1" horiz-adv-x="2048">
   <font-face font-family="Liberation Mono embedded" units-per-em="2048" font-weight="normal" font-style="normal" ascent="1693" descent="609"/>
   <missing-glyph horiz-adv-x="2048" d="M 0,0 L 2047,0 2047,2047 0,2047 0,0 Z"/>
   <glyph unicode="." horiz-adv-x="266" d="M 496,0 L 496,299 731,299 731,0 496,0 Z"/>
  </font>
 </defs>
 <defs>
  <font id="EmbeddedFont_2" horiz-adv-x="2048">
   <font-face font-family="Liberation Serif embedded" units-per-em="2048" font-weight="normal" font-style="normal" ascent="1799" descent="423"/>
   <missing-glyph horiz-adv-x="2048" d="M 0,0 L 2047,0 2047,2047 0,2047 0,0 Z"/>
   <glyph unicode="2" horiz-adv-x="848" d="M 911,0 L 90,0 90,147 C 157,210 219,266 276,316 332,365 383,412 428,455 473,498 512,539 546,578 579,617 607,658 630,701 652,744 669,790 680,839 691,888 696,944 696,1006 696,1093 676,1159 637,1204 598,1249 533,1272 444,1272 424,1272 404,1271 385,1268 365,1265 346,1261 328,1256 310,1251 293,1245 278,1239 262,1232 248,1226 236,1219 L 201,1055 135,1055 135,1313 C 186,1325 236,1335 285,1344 334,1352 387,1356 444,1356 591,1356 701,1326 775,1265 848,1204 885,1117 885,1006 885,951 878,901 864,854 849,807 829,763 802,720 775,677 743,634 704,593 665,551 621,508 572,463 523,418 469,371 410,321 351,270 288,215 221,154 L 911,154 911,0 Z"/>
   <glyph unicode="1" horiz-adv-x="742" d="M 627,80 L 901,53 901,0 180,0 180,53 455,80 455,1174 184,1077 184,1130 575,1352 627,1352 627,80 Z"/>
  </font>
 </defs>
 <defs>
  <font id="EmbeddedFont_3" horiz-adv-x="2048">
   <font-face font-family="Liberation Serif embedded" units-per-em="2048" font-weight="normal" font-style="italic" ascent="1799" descent="423"/>
   <missing-glyph horiz-adv-x="2048" d="M 0,0 L 2047,0 2047,2047 0,2047 0,0 Z"/>
   <glyph unicode="z" horiz-adv-x="794" d="M -23,0 L -14,45 550,860 401,860 C 383,860 365,859 346,858 327,856 309,854 292,851 275,848 260,844 247,840 234,835 223,830 215,825 L 160,690 113,690 158,940 770,940 762,891 200,80 397,80 C 434,80 471,84 506,93 541,101 571,112 594,127 L 670,274 717,274 645,0 -23,0 Z"/>
   <glyph unicode="x" horiz-adv-x="927" d="M 248,236 C 227,215 209,197 196,182 182,167 171,153 163,142 155,130 150,119 147,110 144,101 142,92 142,84 142,73 146,65 154,59 161,53 171,48 184,45 L 176,0 -9,0 C -13,3 -17,9 -20,17 -23,24 -25,33 -25,43 -25,52 -22,63 -18,74 -12,85 -5,97 6,111 17,125 31,141 48,159 65,177 87,198 112,221 L 385,475 213,870 106,895 114,940 362,940 507,582 631,700 C 674,741 704,773 721,796 738,819 747,839 747,856 747,861 745,866 742,870 738,874 733,878 727,881 721,884 715,886 708,889 701,891 694,893 688,895 L 696,940 873,940 C 879,935 884,930 888,923 892,916 894,907 894,897 894,858 848,794 756,707 L 542,506 734,66 850,45 842,0 586,0 419,400 248,236 Z"/>
   <glyph unicode="n" horiz-adv-x="901" d="M 755,748 C 755,778 747,802 731,821 715,840 690,849 655,849 627,849 598,843 569,830 540,817 511,800 484,779 457,758 431,735 408,709 385,682 365,656 349,630 L 239,0 73,0 226,871 108,896 116,941 394,941 367,749 C 392,782 419,811 447,838 474,865 503,887 533,906 562,925 593,939 624,950 655,960 686,965 718,965 749,965 777,961 802,953 827,945 848,932 866,915 883,898 897,876 907,849 916,822 921,791 921,754 921,746 920,735 919,722 917,708 915,693 912,677 909,661 907,645 904,628 901,611 899,595 896,580 L 808,69 939,45 931,0 630,0 732,582 C 735,597 737,612 740,628 743,644 745,660 748,675 750,690 752,704 753,717 754,730 755,740 755,748 Z"/>
   <glyph unicode="Z" horiz-adv-x="1165" d="M 42,94 L 907,1255 707,1255 C 620,1255 547,1253 489,1249 431,1245 389,1240 364,1235 L 296,1024 227,1024 283,1341 1156,1341 1140,1255 267,84 507,84 C 550,84 594,85 637,88 680,90 721,93 758,97 795,100 828,104 856,108 884,111 904,114 917,117 L 1021,373 1091,373 998,0 25,0 42,94 Z"/>
   <glyph unicode="S" horiz-adv-x="1006" d="M 76,371 L 141,371 142,180 C 153,164 168,149 187,135 206,120 227,108 252,97 277,86 304,77 333,71 362,64 392,61 423,61 480,61 529,68 572,82 614,95 649,115 678,141 707,166 728,197 743,233 757,269 764,310 764,355 764,391 756,422 740,449 724,476 703,500 676,521 649,542 619,562 586,580 552,598 517,616 482,635 447,653 412,673 379,694 345,715 315,739 288,767 261,794 240,826 224,862 208,898 200,940 200,989 200,1050 211,1104 233,1150 254,1196 285,1234 326,1265 366,1295 415,1318 473,1333 530,1348 595,1356 667,1356 733,1356 792,1353 845,1346 897,1339 946,1329 991,1318 L 942,1039 877,1039 872,1210 C 851,1227 821,1242 783,1254 745,1266 701,1272 652,1272 603,1272 562,1266 527,1253 492,1240 463,1223 441,1201 418,1178 402,1152 391,1122 380,1092 375,1060 375,1025 375,992 383,963 400,938 416,913 437,890 464,870 490,849 520,830 554,813 588,795 623,777 658,758 693,739 727,719 761,698 795,677 825,652 852,625 878,598 899,566 916,531 932,495 940,453 940,406 940,340 929,281 908,228 886,175 853,131 810,94 767,57 712,29 647,10 582,-10 505,-20 417,-20 333,-20 258,-11 191,6 124,23 68,45 24,73 L 76,371 Z"/>
   <glyph unicode="R" horiz-adv-x="1244" d="M 444,588 L 354,80 533,53 523,0 -11,0 -1,53 161,80 370,1262 202,1288 212,1341 744,1341 C 822,1341 889,1333 946,1318 1002,1303 1048,1281 1085,1253 1122,1224 1149,1190 1167,1150 1184,1110 1193,1065 1193,1016 1193,961 1185,911 1170,868 1154,824 1131,786 1101,753 1071,720 1034,693 991,670 948,647 898,629 843,616 L 1070,80 1217,53 1207,0 899,0 653,588 444,588 Z M 616,678 C 675,678 729,685 776,700 823,714 862,735 895,763 927,791 952,826 969,867 986,908 995,956 995,1010 995,1091 971,1151 923,1191 875,1231 804,1251 709,1251 L 561,1251 460,678 616,678 Z"/>
   <glyph unicode="N" horiz-adv-x="1482" d="M 1170,1262 L 994,1288 1004,1341 1461,1341 1451,1288 1275,1262 1052,0 955,0 474,1206 275,80 451,53 441,0 -15,0 -5,53 170,80 379,1262 211,1288 221,1341 609,1341 1008,336 1170,1262 Z"/>
   <glyph unicode="M" horiz-adv-x="1826" d="M 721,0 L 686,0 455,1153 266,80 442,53 432,0 -24,0 -14,53 161,80 370,1262 202,1288 212,1341 594,1341 800,318 1398,1341 1800,1341 1790,1288 1614,1262 1405,80 1573,53 1563,0 1019,0 1029,53 1213,80 1402,1153 721,0 Z"/>
  </font>
 </defs>
 <defs>
  <font id="EmbeddedFont_4" horiz-adv-x="2048">
   <font-face font-family="OpenSymbol embedded" units-per-em="2048" font-weight="normal" font-style="normal" ascent="1402" descent="423"/>
   <missing-glyph horiz-adv-x="2048" d="M 0,0 L 2047,0 2047,2047 0,2047 0,0 Z"/>
   <glyph unicode="≫" horiz-adv-x="1853" d="M 885,0 L 885,111 1845,594 885,1073 885,1184 2068,592 885,0 Z M 223,0 L 223,111 1184,594 223,1073 223,1184 1407,592 223,0 Z"/>
   <glyph unicode="−" horiz-adv-x="1191" d="M 221,543 L 221,641 1405,641 1405,543 221,543 Z"/>
   <glyph unicode="↓" horiz-adv-x="1191" d="M 1343,578 L 760,51 178,578 317,727 668,410 C 661,437 657,455 657,463 L 657,1333 862,1333 866,547 C 866,488 861,443 852,410 L 1202,727 1343,578 Z"/>
   <glyph unicode="]" horiz-adv-x="398" d="M 428,-403 L 74,-403 74,-330 330,-330 330,1553 74,1553 74,1622 428,1622 428,-403 Z"/>
   <glyph unicode="[" horiz-adv-x="372" d="M 150,-403 L 150,1622 504,1622 504,1552 248,1552 248,-332 504,-332 504,-403 150,-403 Z"/>
   <glyph unicode="+" horiz-adv-x="980" d="M 512,115 L 512,516 115,516 115,684 512,684 512,1083 682,1083 682,684 1081,684 1081,516 682,516 682,115 512,115 Z"/>
  </font>
 </defs>
 <defs class="TextShapeIndex">
  <g ooo:slide="id1" ooo:id-list="id3 id4 id5 id6 id7 id8 id9 id10 id11 id12 id13 id14 id15 id16 id17 id18 id19 id20 id21 id22 id23 id24 id25 id26 id27 id28 id29 id30 id31 id32 id33 id34 id35 id36 id37 id38 id39 id40 id41 id42 id43 id44 id45 id46 id47 id48 id49 id50 id51 id52 id53 id54 id55 id56 id57 id58 id59 id60 id61 id62 id63 id64 id65 id66 id67 id68 id69 id70 id71 id72 id73 id74 id75 id76 id77 id78 id79 id80"/>
 </defs>
 <defs class="EmbeddedBulletChars">
  <g id="bullet-char-template(57356)" transform="scale(0.00048828125,-0.00048828125)">
   <path d="M 580,1141 L 1163,571 580,0 -4,571 580,1141 Z"/>
  </g>
  <g id="bullet-char-template(57354)" transform="scale(0.00048828125,-0.00048828125)">
   <path d="M 8,1128 L 1137,1128 1137,0 8,0 8,1128 Z"/>
  </g>
  <g id="bullet-char-template(10146)" transform="scale(0.00048828125,-0.00048828125)">
   <path d="M 174,0 L 602,739 174,1481 1456,739 174,0 Z M 1358,739 L 309,1346 659,739 1358,739 Z"/>
  </g>
  <g id="bullet-char-template(10132)" transform="scale(0.00048828125,-0.00048828125)">
   <path d="M 2015,739 L 1276,0 717,0 1260,543 174,543 174,936 1260,936 717,1481 1274,1481 2015,739 Z"/>
  </g>
  <g id="bullet-char-template(10007)" transform="scale(0.00048828125,-0.00048828125)">
   <path d="M 0,-2 C -7,14 -16,27 -25,37 L 356,567 C 262,823 215,952 215,954 215,979 228,992 255,992 264,992 276,990 289,987 310,991 331,999 354,1012 L 381,999 492,748 772,1049 836,1024 860,1049 C 881,1039 901,1025 922,1006 886,937 835,863 770,784 769,783 710,716 594,584 L 774,223 C 774,196 753,168 711,139 L 727,119 C 717,90 699,76 672,76 641,76 570,178 457,381 L 164,-76 C 142,-110 111,-127 72,-127 30,-127 9,-110 8,-76 1,-67 -2,-52 -2,-32 -2,-23 -1,-13 0,-2 Z"/>
  </g>
  <g id="bullet-char-template(10004)" transform="scale(0.00048828125,-0.00048828125)">
   <path d="M 285,-33 C 182,-33 111,30 74,156 52,228 41,333 41,471 41,549 55,616 82,672 116,743 169,778 240,778 293,778 328,747 346,684 L 369,508 C 377,444 397,411 428,410 L 1163,1116 C 1174,1127 1196,1133 1229,1133 1271,1133 1292,1118 1292,1087 L 1292,965 C 1292,929 1282,901 1262,881 L 442,47 C 390,-6 338,-33 285,-33 Z"/>
  </g>
  <g id="bullet-char-template(9679)" transform="scale(0.00048828125,-0.00048828125)">
   <path d="M 813,0 C 632,0 489,54 383,161 276,268 223,411 223,592 223,773 276,916 383,1023 489,1130 632,1184 813,1184 992,1184 1136,1130 1245,1023 1353,916 1407,772 1407,592 1407,412 1353,268 1245,161 1136,54 992,0 813,0 Z"/>
  </g>
  <g id="bullet-char-template(8226)" transform="scale(0.00048828125,-0.00048828125)">
   <path d="M 346,457 C 273,457 209,483 155,535 101,586 74,649 74,723 74,796 101,859 155,911 209,963 273,989 346,989 419,989 480,963 531,910 582,859 608,796 608,723 608,648 583,586 532,535 482,483 420,457 346,457 Z"/>
  </g>
  <g id="bullet-char-template(8211)" transform="scale(0.00048828125,-0.00048828125)">
   <path d="M -4,459 L 1135,459 1135,606 -4,606 -4,459 Z"/>
  </g>
  <g id="bullet-char-template(61548)" transform="scale(0.00048828125,-0.00048828125)">
   <path d="M 173,740 C 173,903 231,1043 346,1159 462,1274 601,1332 765,1332 928,1332 1067,1274 1183,1159 1299,1043 1357,903 1357,740 1357,577 1299,437 1183,322 1067,206 928,148 765,148 601,148 462,206 346,322 231,437 173,577 173,740 Z"/>
  </g>
 </defs>
 <defs class="TextEmbeddedBitmaps"/>
 <g class="SlideGroup">
  <g>
   <g id="container-id1">
    <g id="id1" class="Slide" clip-path="url(#presentation_clip_path)">
     <g class="Page">
      <g class="com.sun.star.drawing.LineShape">
       <g id="id3">
        <rect class="BoundingBox" stroke="none" fill="none" x="1932" y="21117" width="1019" height="353"/>
        <path fill="none" stroke="rgb(0,0,0)" stroke-width="35" stroke-linejoin="round" d="M 1950,21293 L 2445,21293"/>
        <path fill="rgb(0,0,0)" stroke="none" d="M 2950,21293 L 2422,21117 2422,21469 2950,21293 Z"/>
       </g>
      </g>
      <g class="OLE2">
       <g id="id4">
        <rect class="BoundingBox" stroke="none" fill="none" x="1000" y="21053" width="992" height="481"/>
        <defs>
         <clipPath id="clip_path_1" clipPathUnits="userSpaceOnUse">
          <path d="M 1005,21061 L 1984,21061 1984,21537 1005,21537 1005,21061 Z"/>
         </clipPath>
        </defs>
        <g clip-path="url(#clip_path_1)">
         <text class="TextShape"><tspan class="TextParagraph" font-family="Liberation Serif, serif" font-size="422px" font-style="italic" font-weight="400"><tspan class="TextPosition" x="1132" y="21423"><tspan fill="rgb(0,0,0)" stroke="none">x</tspan></tspan></tspan></text>
         <text class="TextShape"><tspan class="TextParagraph" font-family="OpenSymbol" font-size="422px" font-weight="400"><tspan class="TextPosition" x="1370" y="21423"><tspan fill="rgb(0,0,0)" stroke="none">[</tspan></tspan></tspan></text>
         <text class="TextShape"><tspan class="TextParagraph" font-family="Liberation Serif, serif" font-size="422px" font-style="italic" font-weight="400"><tspan class="TextPosition" x="1529" y="21423"><tspan fill="rgb(0,0,0)" stroke="none">n</tspan></tspan></tspan></text>
         <text class="TextShape"><tspan class="TextParagraph" font-family="OpenSymbol" font-size="422px" font-weight="400"><tspan class="TextPosition" x="1767" y="21423"><tspan fill="rgb(0,0,0)" stroke="none">]</tspan></tspan></tspan></text>
        </g>
       </g>
      </g>
      <g class="Group">
       <g class="com.sun.star.drawing.LineShape">
        <g id="id5">
         <rect class="BoundingBox" stroke="none" fill="none" x="3856" y="21131" width="1219" height="353"/>
         <path fill="none" stroke="rgb(0,0,0)" stroke-width="35" stroke-linejoin="round" d="M 3874,21307 L 4569,21307"/>
         <path fill="rgb(0,0,0)" stroke="none" d="M 5074,21307 L 4546,21131 4546,21483 5074,21307 Z"/>
        </g>
       </g>
       <g class="com.sun.star.drawing.CustomShape">
        <g id="id6">
         <rect class="BoundingBox" stroke="none" fill="none" x="2982" y="20860" width="843" height="842"/>
         <path fill="none" stroke="rgb(0,0,0)" stroke-width="40" stroke-linejoin="round" d="M 3402,20880 C 3629,20880 3802,21053 3802,21280 3802,21507 3629,21680 3402,21680 3175,21680 3002,21507 3002,21280 3002,21053 3175,20880 3402,20880 Z"/>
        </g>
       </g>
       <g class="OLE2">
        <g id="id7">
         <rect class="BoundingBox" stroke="none" fill="none" x="3185" y="21191" width="491" height="234"/>
         <defs>
          <clipPath id="clip_path_2" clipPathUnits="userSpaceOnUse">
           <path d="M 3175,21193 L 3678,21193 3678,21431 3175,21431 3175,21193 Z"/>
          </clipPath>
         </defs>
         <g clip-path="url(#clip_path_2)">
          <text class="TextShape"><tspan class="TextParagraph" font-family="OpenSymbol" font-size="422px" font-weight="400"><tspan class="TextPosition" x="3291" y="21429"><tspan fill="rgb(0,0,0)" stroke="none">+</tspan></tspan></tspan></text>
         </g>
        </g>
       </g>
       <g class="com.sun.star.drawing.LineShape">
        <g id="id8">
         <rect class="BoundingBox" stroke="none" fill="none" x="3226" y="21744" width="353" height="948"/>
         <path fill="none" stroke="rgb(0,0,0)" stroke-width="35" stroke-linejoin="round" d="M 3402,22673 L 3402,22249"/>
         <path fill="rgb(0,0,0)" stroke="none" d="M 3402,21744 L 3226,22272 3578,22272 3402,21744 Z"/>
        </g>
       </g>
       <g class="Group">
        <g class="com.sun.star.drawing.CustomShape">
         <g id="id9">
          <rect class="BoundingBox" stroke="none" fill="none" x="3690" y="22187" width="1041" height="1041"/>
          <path fill="none" stroke="rgb(0,0,0)" stroke-width="40" stroke-linejoin="round" d="M 4210,23207 L 3710,23207 3710,22207 4710,22207 4710,23207 4210,23207 Z"/>
         </g>
        </g>
        <g class="OLE2">
         <g id="id10">
          <rect class="BoundingBox" stroke="none" fill="none" x="3804" y="22445" width="813" height="525"/>
          <defs>
           <clipPath id="clip_path_3" clipPathUnits="userSpaceOnUse">
            <path d="M 3810,22437 L 4603,22437 4603,22966 3810,22966 3810,22437 Z"/>
           </clipPath>
          </defs>
          <g clip-path="url(#clip_path_3)">
           <text class="TextShape"><tspan class="TextParagraph" font-family="Liberation Serif, serif" font-size="422px" font-style="italic" font-weight="400"><tspan class="TextPosition" x="3911" y="22868"><tspan fill="rgb(0,0,0)" stroke="none">Z</tspan></tspan></tspan></text>
           <text class="TextShape"><tspan class="TextParagraph" font-family="OpenSymbol" font-size="253px" font-weight="400"><tspan class="TextPosition" x="4178" y="22683"><tspan fill="rgb(0,0,0)" stroke="none">−</tspan></tspan></tspan></text>
           <text class="TextShape"><tspan class="TextParagraph" font-family="Liberation Serif, serif" font-size="253px" font-weight="400"><tspan class="TextPosition" x="4392" y="22683"><tspan fill="rgb(0,0,0)" stroke="none">1</tspan></tspan></tspan></text>
          </g>
         </g>
        </g>
       </g>
       <g class="com.sun.star.drawing.LineShape">
        <g id="id11">
         <rect class="BoundingBox" stroke="none" fill="none" x="4039" y="21137" width="353" height="1047"/>
         <path fill="none" stroke="rgb(0,0,0)" stroke-width="35" stroke-linejoin="round" d="M 4215,22165 L 4215,21466"/>
         <path fill="rgb(0,0,0)" stroke="none" d="M 4183,21485 L 4151,21476 4119,21460 4090,21438 4068,21409 4052,21377 4043,21345 4039,21313 4043,21281 4052,21248 4068,21216 4090,21188 4119,21166 4151,21150 4183,21140 4216,21137 4247,21140 4280,21150 4311,21166 4340,21188 4362,21216 4378,21248 4387,21281 4391,21313 4387,21345 4378,21377 4362,21409 4340,21438 4311,21460 4280,21476 4247,21485 4216,21489 4183,21485 Z"/>
        </g>
       </g>
       <g class="com.sun.star.drawing.LineShape">
        <g id="id12">
         <rect class="BoundingBox" stroke="none" fill="none" x="3375" y="22650" width="285" height="41"/>
         <path fill="none" stroke="rgb(0,0,0)" stroke-width="40" stroke-linejoin="round" d="M 3395,22670 L 3639,22670"/>
        </g>
       </g>
      </g>
      <g class="com.sun.star.drawing.CustomShape">
       <g id="id13">
        <rect class="BoundingBox" stroke="none" fill="none" x="11086" y="20773" width="1041" height="1041"/>
        <path fill="none" stroke="rgb(0,0,0)" stroke-width="40" stroke-linejoin="round" d="M 11606,21793 L 11106,21793 11106,20793 12106,20793 12106,21793 11606,21793 Z"/>
       </g>
      </g>
      <g class="OLE2">
       <g id="id14">
        <rect class="BoundingBox" stroke="none" fill="none" x="11181" y="21060" width="851" height="467"/>
        <defs>
         <clipPath id="clip_path_4" clipPathUnits="userSpaceOnUse">
          <path d="M 11192,21061 L 12038,21061 12038,21537 11192,21537 11192,21061 Z"/>
         </clipPath>
        </defs>
        <g clip-path="url(#clip_path_4)">
         <text class="TextShape"><tspan class="TextParagraph" font-family="Liberation Serif, serif" font-size="422px" font-style="italic" font-weight="400"><tspan class="TextPosition" x="11314" y="21430"><tspan fill="rgb(0,0,0)" stroke="none">R</tspan></tspan></tspan></text>
         <text class="TextShape"><tspan class="TextParagraph" font-family="OpenSymbol" font-size="422px" font-weight="400"><tspan class="TextPosition" x="11608" y="21430"><tspan fill="rgb(0,0,0)" stroke="none">↓</tspan></tspan></tspan></text>
        </g>
       </g>
      </g>
      <g class="com.sun.star.drawing.TextShape">
       <g id="id15">
        <rect class="BoundingBox" stroke="none" fill="none" x="6961" y="20950" width="1202" height="688"/>
        <text class="TextShape"><tspan class="TextParagraph" font-family="Liberation Mono, monospace" font-size="388px" font-weight="400"><tspan class="TextPosition" x="7211" y="21397"><tspan fill="rgb(0,0,0)" stroke="none">...</tspan></tspan></tspan></text>
       </g>
      </g>
      <g class="com.sun.star.drawing.TextShape">
       <g id="id16">
        <rect class="BoundingBox" stroke="none" fill="none" x="17128" y="20950" width="1202" height="688"/>
        <text class="TextShape"><tspan class="TextParagraph" font-family="Liberation Mono, monospace" font-size="388px" font-weight="400"><tspan class="TextPosition" x="17378" y="21397"><tspan fill="rgb(0,0,0)" stroke="none">...</tspan></tspan></tspan></text>
       </g>
      </g>
      <g class="com.sun.star.drawing.LineShape">
       <g id="id17">
        <rect class="BoundingBox" stroke="none" fill="none" x="7932" y="21117" width="919" height="353"/>
        <path fill="none" stroke="rgb(0,0,0)" stroke-width="35" stroke-linejoin="round" d="M 7950,21293 L 8345,21293"/>
        <path fill="rgb(0,0,0)" stroke="none" d="M 8850,21293 L 8322,21117 8322,21469 8850,21293 Z"/>
       </g>
      </g>
      <g class="Group">
       <g class="com.sun.star.drawing.LineShape">
        <g id="id18">
         <rect class="BoundingBox" stroke="none" fill="none" x="6011" y="21131" width="1219" height="353"/>
         <path fill="none" stroke="rgb(0,0,0)" stroke-width="35" stroke-linejoin="round" d="M 6029,21307 L 6724,21307"/>
         <path fill="rgb(0,0,0)" stroke="none" d="M 7229,21307 L 6701,21131 6701,21483 7229,21307 Z"/>
        </g>
       </g>
       <g class="com.sun.star.drawing.CustomShape">
        <g id="id19">
         <rect class="BoundingBox" stroke="none" fill="none" x="5137" y="20860" width="842" height="843"/>
         <path fill="none" stroke="rgb(0,0,0)" stroke-width="40" stroke-linejoin="round" d="M 5557,20880 C 5784,20880 5957,21053 5957,21280 5957,21507 5784,21680 5557,21680 5330,21680 5157,21507 5157,21280 5157,21053 5330,20880 5557,20880 Z"/>
        </g>
       </g>
       <g class="OLE2">
        <g id="id20">
         <rect class="BoundingBox" stroke="none" fill="none" x="5340" y="21191" width="491" height="234"/>
         <defs>
          <clipPath id="clip_path_5" clipPathUnits="userSpaceOnUse">
           <path d="M 5345,21193 L 5821,21193 5821,21431 5345,21431 5345,21193 Z"/>
          </clipPath>
         </defs>
         <g clip-path="url(#clip_path_5)">
          <text class="TextShape"><tspan class="TextParagraph" font-family="OpenSymbol" font-size="422px" font-weight="400"><tspan class="TextPosition" x="5446" y="21429"><tspan fill="rgb(0,0,0)" stroke="none">+</tspan></tspan></tspan></text>
         </g>
        </g>
       </g>
       <g class="com.sun.star.drawing.LineShape">
        <g id="id21">
         <rect class="BoundingBox" stroke="none" fill="none" x="5381" y="21744" width="353" height="948"/>
         <path fill="none" stroke="rgb(0,0,0)" stroke-width="35" stroke-linejoin="round" d="M 5557,22673 L 5557,22249"/>
         <path fill="rgb(0,0,0)" stroke="none" d="M 5557,21744 L 5381,22272 5733,22272 5557,21744 Z"/>
        </g>
       </g>
       <g class="Group">
        <g class="com.sun.star.drawing.CustomShape">
         <g id="id22">
          <rect class="BoundingBox" stroke="none" fill="none" x="5845" y="22187" width="1041" height="1041"/>
          <path fill="none" stroke="rgb(0,0,0)" stroke-width="40" stroke-linejoin="round" d="M 6365,23207 L 5865,23207 5865,22207 6865,22207 6865,23207 6365,23207 Z"/>
         </g>
        </g>
        <g class="OLE2">
         <g id="id23">
          <rect class="BoundingBox" stroke="none" fill="none" x="5959" y="22445" width="813" height="525"/>
          <defs>
           <clipPath id="clip_path_6" clipPathUnits="userSpaceOnUse">
            <path d="M 5954,22437 L 6774,22437 6774,22966 5954,22966 5954,22437 Z"/>
           </clipPath>
          </defs>
          <g clip-path="url(#clip_path_6)">
           <text class="TextShape"><tspan class="TextParagraph" font-family="Liberation Serif, serif" font-size="422px" font-style="italic" font-weight="400"><tspan class="TextPosition" x="6066" y="22868"><tspan fill="rgb(0,0,0)" stroke="none">Z</tspan></tspan></tspan></text>
           <text class="TextShape"><tspan class="TextParagraph" font-family="OpenSymbol" font-size="253px" font-weight="400"><tspan class="TextPosition" x="6332" y="22683"><tspan fill="rgb(0,0,0)" stroke="none">−</tspan></tspan></tspan></text>
           <text class="TextShape"><tspan class="TextParagraph" font-family="Liberation Serif, serif" font-size="253px" font-weight="400"><tspan class="TextPosition" x="6546" y="22683"><tspan fill="rgb(0,0,0)" stroke="none">1</tspan></tspan></tspan></text>
          </g>
         </g>
        </g>
       </g>
       <g class="com.sun.star.drawing.LineShape">
        <g id="id24">
         <rect class="BoundingBox" stroke="none" fill="none" x="6194" y="21137" width="353" height="1047"/>
         <path fill="none" stroke="rgb(0,0,0)" stroke-width="35" stroke-linejoin="round" d="M 6370,22165 L 6370,21466"/>
         <path fill="rgb(0,0,0)" stroke="none" d="M 6338,21485 L 6306,21476 6274,21460 6245,21438 6223,21409 6207,21377 6198,21345 6194,21313 6198,21281 6207,21248 6223,21216 6245,21188 6274,21166 6306,21150 6338,21140 6371,21137 6402,21140 6435,21150 6466,21166 6495,21188 6517,21216 6533,21248 6542,21281 6546,21313 6542,21345 6533,21377 6517,21409 6495,21438 6466,21460 6435,21476 6402,21485 6371,21489 6338,21485 Z"/>
        </g>
       </g>
       <g class="com.sun.star.drawing.LineShape">
        <g id="id25">
         <rect class="BoundingBox" stroke="none" fill="none" x="5530" y="22650" width="285" height="41"/>
         <path fill="none" stroke="rgb(0,0,0)" stroke-width="40" stroke-linejoin="round" d="M 5550,22670 L 5794,22670"/>
        </g>
       </g>
      </g>
      <g class="Group">
       <g class="com.sun.star.drawing.LineShape">
        <g id="id26">
         <rect class="BoundingBox" stroke="none" fill="none" x="9791" y="21131" width="1219" height="353"/>
         <path fill="none" stroke="rgb(0,0,0)" stroke-width="35" stroke-linejoin="round" d="M 9809,21307 L 10504,21307"/>
         <path fill="rgb(0,0,0)" stroke="none" d="M 11009,21307 L 10481,21131 10481,21483 11009,21307 Z"/>
        </g>
       </g>
       <g class="com.sun.star.drawing.CustomShape">
        <g id="id27">
         <rect class="BoundingBox" stroke="none" fill="none" x="8917" y="20860" width="842" height="843"/>
         <path fill="none" stroke="rgb(0,0,0)" stroke-width="40" stroke-linejoin="round" d="M 9337,20880 C 9564,20880 9737,21053 9737,21280 9737,21507 9564,21680 9337,21680 9110,21680 8937,21507 8937,21280 8937,21053 9110,20880 9337,20880 Z"/>
        </g>
       </g>
       <g class="OLE2">
        <g id="id28">
         <rect class="BoundingBox" stroke="none" fill="none" x="9120" y="21191" width="491" height="234"/>
         <defs>
          <clipPath id="clip_path_7" clipPathUnits="userSpaceOnUse">
           <path d="M 9128,21193 L 9604,21193 9604,21431 9128,21431 9128,21193 Z"/>
          </clipPath>
         </defs>
         <g clip-path="url(#clip_path_7)">
          <text class="TextShape"><tspan class="TextParagraph" font-family="OpenSymbol" font-size="422px" font-weight="400"><tspan class="TextPosition" x="9226" y="21429"><tspan fill="rgb(0,0,0)" stroke="none">+</tspan></tspan></tspan></text>
         </g>
        </g>
       </g>
       <g class="com.sun.star.drawing.LineShape">
        <g id="id29">
         <rect class="BoundingBox" stroke="none" fill="none" x="9161" y="21744" width="353" height="948"/>
         <path fill="none" stroke="rgb(0,0,0)" stroke-width="35" stroke-linejoin="round" d="M 9337,22673 L 9337,22249"/>
         <path fill="rgb(0,0,0)" stroke="none" d="M 9337,21744 L 9161,22272 9513,22272 9337,21744 Z"/>
        </g>
       </g>
       <g class="Group">
        <g class="com.sun.star.drawing.CustomShape">
         <g id="id30">
          <rect class="BoundingBox" stroke="none" fill="none" x="9625" y="22187" width="1041" height="1041"/>
          <path fill="none" stroke="rgb(0,0,0)" stroke-width="40" stroke-linejoin="round" d="M 10145,23207 L 9645,23207 9645,22207 10645,22207 10645,23207 10145,23207 Z"/>
         </g>
        </g>
        <g class="OLE2">
         <g id="id31">
          <rect class="BoundingBox" stroke="none" fill="none" x="9739" y="22445" width="813" height="525"/>
          <defs>
           <clipPath id="clip_path_8" clipPathUnits="userSpaceOnUse">
            <path d="M 9737,22437 L 10557,22437 10557,22966 9737,22966 9737,22437 Z"/>
           </clipPath>
          </defs>
          <g clip-path="url(#clip_path_8)">
           <text class="TextShape"><tspan class="TextParagraph" font-family="Liberation Serif, serif" font-size="422px" font-style="italic" font-weight="400"><tspan class="TextPosition" x="9846" y="22868"><tspan fill="rgb(0,0,0)" stroke="none">Z</tspan></tspan></tspan></text>
           <text class="TextShape"><tspan class="TextParagraph" font-family="OpenSymbol" font-size="253px" font-weight="400"><tspan class="TextPosition" x="10113" y="22683"><tspan fill="rgb(0,0,0)" stroke="none">−</tspan></tspan></tspan></text>
           <text class="TextShape"><tspan class="TextParagraph" font-family="Liberation Serif, serif" font-size="253px" font-weight="400"><tspan class="TextPosition" x="10327" y="22683"><tspan fill="rgb(0,0,0)" stroke="none">1</tspan></tspan></tspan></text>
          </g>
         </g>
        </g>
       </g>
       <g class="com.sun.star.drawing.LineShape">
        <g id="id32">
         <rect class="BoundingBox" stroke="none" fill="none" x="9974" y="21137" width="353" height="1047"/>
         <path fill="none" stroke="rgb(0,0,0)" stroke-width="35" stroke-linejoin="round" d="M 10150,22165 L 10150,21466"/>
         <path fill="rgb(0,0,0)" stroke="none" d="M 10118,21485 L 10086,21476 10054,21460 10025,21438 10003,21409 9987,21377 9978,21345 9974,21313 9978,21281 9987,21248 10003,21216 10025,21188 10054,21166 10086,21150 10118,21140 10151,21137 10182,21140 10215,21150 10246,21166 10275,21188 10297,21216 10313,21248 10322,21281 10326,21313 10322,21345 10313,21377 10297,21409 10275,21438 10246,21460 10215,21476 10182,21485 10151,21489 10118,21485 Z"/>
        </g>
       </g>
       <g class="com.sun.star.drawing.LineShape">
        <g id="id33">
         <rect class="BoundingBox" stroke="none" fill="none" x="9310" y="22650" width="285" height="41"/>
         <path fill="none" stroke="rgb(0,0,0)" stroke-width="40" stroke-linejoin="round" d="M 9330,22670 L 9574,22670"/>
        </g>
       </g>
      </g>
      <g class="Group">
       <g class="com.sun.star.drawing.LineShape">
        <g id="id34">
         <rect class="BoundingBox" stroke="none" fill="none" x="12188" y="21168" width="1219" height="353"/>
         <path fill="none" stroke="rgb(0,0,0)" stroke-width="35" stroke-linejoin="round" d="M 12206,21344 L 12901,21344"/>
         <path fill="rgb(0,0,0)" stroke="none" d="M 13406,21344 L 12878,21168 12878,21520 13406,21344 Z"/>
        </g>
       </g>
       <g class="com.sun.star.drawing.CustomShape">
        <g id="id35">
         <rect class="BoundingBox" stroke="none" fill="none" x="13457" y="20897" width="842" height="842"/>
         <path fill="none" stroke="rgb(0,0,0)" stroke-width="40" stroke-linejoin="round" d="M 13878,20917 C 13651,20917 13478,21090 13478,21317 13478,21544 13651,21717 13878,21717 14105,21717 14278,21544 14278,21317 14278,21090 14105,20917 13878,20917 Z"/>
        </g>
       </g>
       <g class="OLE2">
        <g id="id36">
         <rect class="BoundingBox" stroke="none" fill="none" x="13605" y="21228" width="491" height="234"/>
         <defs>
          <clipPath id="clip_path_9" clipPathUnits="userSpaceOnUse">
           <path d="M 13600,21220 L 14102,21220 14102,21458 13600,21458 13600,21220 Z"/>
          </clipPath>
         </defs>
         <g clip-path="url(#clip_path_9)">
          <text class="TextShape"><tspan class="TextParagraph" font-family="OpenSymbol" font-size="422px" font-weight="400"><tspan class="TextPosition" x="13711" y="21466"><tspan fill="rgb(0,0,0)" stroke="none">+</tspan></tspan></tspan></text>
         </g>
        </g>
       </g>
       <g class="com.sun.star.drawing.LineShape">
        <g id="id37">
         <rect class="BoundingBox" stroke="none" fill="none" x="13702" y="21781" width="353" height="948"/>
         <path fill="none" stroke="rgb(0,0,0)" stroke-width="35" stroke-linejoin="round" d="M 13878,22710 L 13878,22286"/>
         <path fill="rgb(0,0,0)" stroke="none" d="M 13878,21781 L 13702,22309 14054,22309 13878,21781 Z"/>
        </g>
       </g>
       <g class="Group">
        <g class="com.sun.star.drawing.CustomShape">
         <g id="id38">
          <rect class="BoundingBox" stroke="none" fill="none" x="12050" y="22224" width="1041" height="1041"/>
          <path fill="none" stroke="rgb(0,0,0)" stroke-width="40" stroke-linejoin="round" d="M 12570,23244 L 12070,23244 12070,22244 13070,22244 13070,23244 12570,23244 Z"/>
         </g>
        </g>
        <g class="OLE2">
         <g id="id39">
          <rect class="BoundingBox" stroke="none" fill="none" x="12164" y="22482" width="940" height="525"/>
          <defs>
           <clipPath id="clip_path_10" clipPathUnits="userSpaceOnUse">
            <path d="M 12171,22490 L 13096,22490 13096,23019 12171,23019 12171,22490 Z"/>
           </clipPath>
          </defs>
          <g clip-path="url(#clip_path_10)">
           <text class="TextShape"><tspan class="TextParagraph" font-family="Liberation Serif, serif" font-size="422px" font-style="italic" font-weight="400"><tspan class="TextPosition" x="12271" y="22905"><tspan fill="rgb(0,0,0)" stroke="none">Z</tspan></tspan></tspan></text>
           <text class="TextShape"><tspan class="TextParagraph" font-family="OpenSymbol" font-size="253px" font-weight="400"><tspan class="TextPosition" x="12538" y="22720"><tspan fill="rgb(0,0,0)" stroke="none">−</tspan></tspan></tspan></text>
           <text class="TextShape"><tspan class="TextParagraph" font-family="Liberation Serif, serif" font-size="253px" font-style="italic" font-weight="400"><tspan class="TextPosition" x="12752" y="22720"><tspan fill="rgb(0,0,0)" stroke="none">M</tspan></tspan></tspan></text>
          </g>
         </g>
        </g>
       </g>
       <g class="com.sun.star.drawing.LineShape">
        <g id="id40">
         <rect class="BoundingBox" stroke="none" fill="none" x="12389" y="21174" width="353" height="1047"/>
         <path fill="none" stroke="rgb(0,0,0)" stroke-width="35" stroke-linejoin="round" d="M 12565,22202 L 12565,21503"/>
         <path fill="rgb(0,0,0)" stroke="none" d="M 12533,21522 L 12501,21513 12469,21497 12440,21475 12418,21446 12402,21414 12393,21382 12389,21350 12393,21318 12402,21285 12418,21253 12440,21225 12469,21203 12501,21187 12533,21177 12566,21174 12597,21177 12630,21187 12661,21203 12690,21225 12712,21253 12728,21285 12737,21318 12741,21350 12737,21382 12728,21414 12712,21446 12690,21475 12661,21497 12630,21513 12597,21522 12566,21526 12533,21522 Z"/>
        </g>
       </g>
       <g class="com.sun.star.drawing.LineShape">
        <g id="id41">
         <rect class="BoundingBox" stroke="none" fill="none" x="13130" y="22687" width="776" height="41"/>
         <path fill="none" stroke="rgb(0,0,0)" stroke-width="40" stroke-linejoin="round" d="M 13885,22707 L 13150,22707"/>
        </g>
       </g>
      </g>
      <g class="Group">
       <g class="com.sun.star.drawing.LineShape">
        <g id="id42">
         <rect class="BoundingBox" stroke="none" fill="none" x="14342" y="21168" width="1219" height="353"/>
         <path fill="none" stroke="rgb(0,0,0)" stroke-width="35" stroke-linejoin="round" d="M 14360,21344 L 15055,21344"/>
         <path fill="rgb(0,0,0)" stroke="none" d="M 15560,21344 L 15032,21168 15032,21520 15560,21344 Z"/>
        </g>
       </g>
       <g class="com.sun.star.drawing.CustomShape">
        <g id="id43">
         <rect class="BoundingBox" stroke="none" fill="none" x="15611" y="20897" width="842" height="842"/>
         <path fill="none" stroke="rgb(0,0,0)" stroke-width="40" stroke-linejoin="round" d="M 16032,20917 C 15805,20917 15632,21090 15632,21317 15632,21544 15805,21717 16032,21717 16259,21717 16432,21544 16432,21317 16432,21090 16259,20917 16032,20917 Z"/>
        </g>
       </g>
       <g class="OLE2">
        <g id="id44">
         <rect class="BoundingBox" stroke="none" fill="none" x="15759" y="21228" width="491" height="234"/>
         <defs>
          <clipPath id="clip_path_11" clipPathUnits="userSpaceOnUse">
           <path d="M 15769,21220 L 16245,21220 16245,21458 15769,21458 15769,21220 Z"/>
          </clipPath>
         </defs>
         <g clip-path="url(#clip_path_11)">
          <text class="TextShape"><tspan class="TextParagraph" font-family="OpenSymbol" font-size="422px" font-weight="400"><tspan class="TextPosition" x="15865" y="21466"><tspan fill="rgb(0,0,0)" stroke="none">+</tspan></tspan></tspan></text>
         </g>
        </g>
       </g>
       <g class="com.sun.star.drawing.LineShape">
        <g id="id45">
         <rect class="BoundingBox" stroke="none" fill="none" x="15856" y="21781" width="353" height="948"/>
         <path fill="none" stroke="rgb(0,0,0)" stroke-width="35" stroke-linejoin="round" d="M 16032,22710 L 16032,22286"/>
         <path fill="rgb(0,0,0)" stroke="none" d="M 16032,21781 L 15856,22309 16208,22309 16032,21781 Z"/>
        </g>
       </g>
       <g class="Group">
        <g class="com.sun.star.drawing.CustomShape">
         <g id="id46">
          <rect class="BoundingBox" stroke="none" fill="none" x="14204" y="22224" width="1041" height="1041"/>
          <path fill="none" stroke="rgb(0,0,0)" stroke-width="40" stroke-linejoin="round" d="M 14724,23244 L 14224,23244 14224,22244 15224,22244 15224,23244 14724,23244 Z"/>
         </g>
        </g>
        <g class="OLE2">
         <g id="id47">
          <rect class="BoundingBox" stroke="none" fill="none" x="14318" y="22482" width="940" height="525"/>
          <defs>
           <clipPath id="clip_path_12" clipPathUnits="userSpaceOnUse">
            <path d="M 14314,22490 L 15266,22490 15266,23019 14314,23019 14314,22490 Z"/>
           </clipPath>
          </defs>
          <g clip-path="url(#clip_path_12)">
           <text class="TextShape"><tspan class="TextParagraph" font-family="Liberation Serif, serif" font-size="422px" font-style="italic" font-weight="400"><tspan class="TextPosition" x="14425" y="22905"><tspan fill="rgb(0,0,0)" stroke="none">Z</tspan></tspan></tspan></text>
           <text class="TextShape"><tspan class="TextParagraph" font-family="OpenSymbol" font-size="253px" font-weight="400"><tspan class="TextPosition" x="14692" y="22720"><tspan fill="rgb(0,0,0)" stroke="none">−</tspan></tspan></tspan></text>
           <text class="TextShape"><tspan class="TextParagraph" font-family="Liberation Serif, serif" font-size="253px" font-style="italic" font-weight="400"><tspan class="TextPosition" x="14906" y="22720"><tspan fill="rgb(0,0,0)" stroke="none">M</tspan></tspan></tspan></text>
          </g>
         </g>
        </g>
       </g>
       <g class="com.sun.star.drawing.LineShape">
        <g id="id48">
         <rect class="BoundingBox" stroke="none" fill="none" x="14543" y="21174" width="353" height="1047"/>
         <path fill="none" stroke="rgb(0,0,0)" stroke-width="35" stroke-linejoin="round" d="M 14719,22202 L 14719,21503"/>
         <path fill="rgb(0,0,0)" stroke="none" d="M 14687,21522 L 14655,21513 14623,21497 14594,21475 14572,21446 14556,21414 14547,21382 14543,21350 14547,21318 14556,21285 14572,21253 14594,21225 14623,21203 14655,21187 14687,21177 14720,21174 14751,21177 14784,21187 14815,21203 14844,21225 14866,21253 14882,21285 14891,21318 14895,21350 14891,21382 14882,21414 14866,21446 14844,21475 14815,21497 14784,21513 14751,21522 14720,21526 14687,21522 Z"/>
        </g>
       </g>
       <g class="com.sun.star.drawing.LineShape">
        <g id="id49">
         <rect class="BoundingBox" stroke="none" fill="none" x="15284" y="22687" width="776" height="41"/>
         <path fill="none" stroke="rgb(0,0,0)" stroke-width="40" stroke-linejoin="round" d="M 16039,22707 L 15304,22707"/>
        </g>
       </g>
      </g>
      <g class="com.sun.star.drawing.LineShape">
       <g id="id50">
        <rect class="BoundingBox" stroke="none" fill="none" x="16455" y="21154" width="919" height="353"/>
        <path fill="none" stroke="rgb(0,0,0)" stroke-width="35" stroke-linejoin="round" d="M 16473,21330 L 16868,21330"/>
        <path fill="rgb(0,0,0)" stroke="none" d="M 17373,21330 L 16845,21154 16845,21506 17373,21330 Z"/>
       </g>
      </g>
      <g class="Group">
       <g class="com.sun.star.drawing.LineShape">
        <g id="id51">
         <rect class="BoundingBox" stroke="none" fill="none" x="18084" y="21168" width="1219" height="353"/>
         <path fill="none" stroke="rgb(0,0,0)" stroke-width="35" stroke-linejoin="round" d="M 18102,21344 L 18797,21344"/>
         <path fill="rgb(0,0,0)" stroke="none" d="M 19302,21344 L 18774,21168 18774,21520 19302,21344 Z"/>
        </g>
       </g>
       <g class="com.sun.star.drawing.CustomShape">
        <g id="id52">
         <rect class="BoundingBox" stroke="none" fill="none" x="19353" y="20897" width="842" height="842"/>
         <path fill="none" stroke="rgb(0,0,0)" stroke-width="40" stroke-linejoin="round" d="M 19774,20917 C 19547,20917 19374,21090 19374,21317 19374,21544 19547,21717 19774,21717 20001,21717 20174,21544 20174,21317 20174,21090 20001,20917 19774,20917 Z"/>
        </g>
       </g>
       <g class="OLE2">
        <g id="id53">
         <rect class="BoundingBox" stroke="none" fill="none" x="19501" y="21228" width="491" height="234"/>
         <defs>
          <clipPath id="clip_path_13" clipPathUnits="userSpaceOnUse">
           <path d="M 19500,21220 L 20003,21220 20003,21458 19500,21458 19500,21220 Z"/>
          </clipPath>
         </defs>
         <g clip-path="url(#clip_path_13)">
          <text class="TextShape"><tspan class="TextParagraph" font-family="OpenSymbol" font-size="422px" font-weight="400"><tspan class="TextPosition" x="19607" y="21466"><tspan fill="rgb(0,0,0)" stroke="none">+</tspan></tspan></tspan></text>
         </g>
        </g>
       </g>
       <g class="com.sun.star.drawing.LineShape">
        <g id="id54">
         <rect class="BoundingBox" stroke="none" fill="none" x="19598" y="21781" width="353" height="948"/>
         <path fill="none" stroke="rgb(0,0,0)" stroke-width="35" stroke-linejoin="round" d="M 19774,22710 L 19774,22286"/>
         <path fill="rgb(0,0,0)" stroke="none" d="M 19774,21781 L 19598,22309 19950,22309 19774,21781 Z"/>
        </g>
       </g>
       <g class="Group">
        <g class="com.sun.star.drawing.CustomShape">
         <g id="id55">
          <rect class="BoundingBox" stroke="none" fill="none" x="17946" y="22224" width="1041" height="1041"/>
          <path fill="none" stroke="rgb(0,0,0)" stroke-width="40" stroke-linejoin="round" d="M 18466,23244 L 17966,23244 17966,22244 18966,22244 18966,23244 18466,23244 Z"/>
         </g>
        </g>
        <g class="OLE2">
         <g id="id56">
          <rect class="BoundingBox" stroke="none" fill="none" x="18060" y="22482" width="940" height="525"/>
          <defs>
           <clipPath id="clip_path_14" clipPathUnits="userSpaceOnUse">
            <path d="M 18071,22490 L 18997,22490 18997,23019 18071,23019 18071,22490 Z"/>
           </clipPath>
          </defs>
          <g clip-path="url(#clip_path_14)">
           <text class="TextShape"><tspan class="TextParagraph" font-family="Liberation Serif, serif" font-size="422px" font-style="italic" font-weight="400"><tspan class="TextPosition" x="18167" y="22905"><tspan fill="rgb(0,0,0)" stroke="none">Z</tspan></tspan></tspan></text>
           <text class="TextShape"><tspan class="TextParagraph" font-family="OpenSymbol" font-size="253px" font-weight="400"><tspan class="TextPosition" x="18433" y="22720"><tspan fill="rgb(0,0,0)" stroke="none">−</tspan></tspan></tspan></text>
           <text class="TextShape"><tspan class="TextParagraph" font-family="Liberation Serif, serif" font-size="253px" font-style="italic" font-weight="400"><tspan class="TextPosition" x="18648" y="22720"><tspan fill="rgb(0,0,0)" stroke="none">M</tspan></tspan></tspan></text>
          </g>
         </g>
        </g>
       </g>
       <g class="com.sun.star.drawing.LineShape">
        <g id="id57">
         <rect class="BoundingBox" stroke="none" fill="none" x="18285" y="21174" width="353" height="1047"/>
         <path fill="none" stroke="rgb(0,0,0)" stroke-width="35" stroke-linejoin="round" d="M 18461,22202 L 18461,21503"/>
         <path fill="rgb(0,0,0)" stroke="none" d="M 18429,21522 L 18397,21513 18365,21497 18336,21475 18314,21446 18298,21414 18289,21382 18285,21350 18289,21318 18298,21285 18314,21253 18336,21225 18365,21203 18397,21187 18429,21177 18462,21174 18493,21177 18526,21187 18557,21203 18586,21225 18608,21253 18624,21285 18633,21318 18637,21350 18633,21382 18624,21414 18608,21446 18586,21475 18557,21497 18526,21513 18493,21522 18462,21526 18429,21522 Z"/>
        </g>
       </g>
       <g class="com.sun.star.drawing.LineShape">
        <g id="id58">
         <rect class="BoundingBox" stroke="none" fill="none" x="19026" y="22687" width="776" height="41"/>
         <path fill="none" stroke="rgb(0,0,0)" stroke-width="40" stroke-linejoin="round" d="M 19781,22707 L 19046,22707"/>
        </g>
       </g>
      </g>
      <g class="com.sun.star.drawing.LineShape">
       <g id="id59">
        <rect class="BoundingBox" stroke="none" fill="none" x="20253" y="21117" width="919" height="353"/>
        <path fill="none" stroke="rgb(0,0,0)" stroke-width="35" stroke-linejoin="round" d="M 20271,21293 L 20666,21293"/>
        <path fill="rgb(0,0,0)" stroke="none" d="M 21171,21293 L 20643,21117 20643,21469 21171,21293 Z"/>
       </g>
      </g>
      <g class="com.sun.star.drawing.CustomShape">
       <g id="id60">
        <rect class="BoundingBox" stroke="none" fill="none" x="3284" y="23355" width="1591" height="592"/>
        <path fill="none" stroke="rgb(0,0,0)" stroke-width="40" stroke-linejoin="round" d="M 3304,23375 C 3304,23513 3368,23651 3433,23651 L 3949,23651 C 4014,23651 4079,23789 4079,23926 4079,23789 4143,23651 4208,23651 L 4724,23651 C 4789,23651 4854,23513 4854,23375"/>
        <path fill="none" stroke="rgb(0,0,0)" stroke-width="40" stroke-linejoin="round" d="M 3304,23926 L 3304,23926 Z"/>
        <path fill="none" stroke="rgb(0,0,0)" stroke-width="40" stroke-linejoin="round" d="M 4854,23375 L 4854,23375 Z"/>
       </g>
      </g>
      <g class="com.sun.star.drawing.CustomShape">
       <g id="id61">
        <rect class="BoundingBox" stroke="none" fill="none" x="5439" y="23355" width="1591" height="592"/>
        <path fill="none" stroke="rgb(0,0,0)" stroke-width="40" stroke-linejoin="round" d="M 5459,23375 C 5459,23513 5523,23651 5588,23651 L 6104,23651 C 6169,23651 6234,23789 6234,23926 6234,23789 6298,23651 6363,23651 L 6879,23651 C 6944,23651 7009,23513 7009,23375"/>
        <path fill="none" stroke="rgb(0,0,0)" stroke-width="40" stroke-linejoin="round" d="M 5459,23926 L 5459,23926 Z"/>
        <path fill="none" stroke="rgb(0,0,0)" stroke-width="40" stroke-linejoin="round" d="M 7009,23375 L 7009,23375 Z"/>
       </g>
      </g>
      <g class="com.sun.star.drawing.CustomShape">
       <g id="id62">
        <rect class="BoundingBox" stroke="none" fill="none" x="9181" y="23354" width="1591" height="593"/>
        <path fill="none" stroke="rgb(0,0,0)" stroke-width="40" stroke-linejoin="round" d="M 9201,23375 C 9201,23513 9265,23651 9330,23651 L 9846,23651 C 9911,23651 9976,23789 9976,23926 9976,23789 10040,23651 10105,23651 L 10621,23651 C 10686,23651 10751,23513 10751,23375"/>
        <path fill="none" stroke="rgb(0,0,0)" stroke-width="40" stroke-linejoin="round" d="M 9201,23926 L 9201,23926 Z"/>
        <path fill="none" stroke="rgb(0,0,0)" stroke-width="40" stroke-linejoin="round" d="M 10751,23375 L 10751,23375 Z"/>
       </g>
      </g>
      <g class="com.sun.star.drawing.CustomShape">
       <g id="id63">
        <rect class="BoundingBox" stroke="none" fill="none" x="11939" y="23355" width="2196" height="592"/>
        <path fill="none" stroke="rgb(0,0,0)" stroke-width="40" stroke-linejoin="round" d="M 11960,23375 C 11960,23513 12049,23651 12139,23651 L 12857,23651 C 12947,23651 13037,23789 13037,23926 13037,23789 13126,23651 13216,23651 L 13934,23651 C 14024,23651 14114,23513 14114,23375"/>
        <path fill="none" stroke="rgb(0,0,0)" stroke-width="40" stroke-linejoin="round" d="M 11960,23926 L 11960,23926 Z"/>
        <path fill="none" stroke="rgb(0,0,0)" stroke-width="40" stroke-linejoin="round" d="M 14114,23375 L 14114,23375 Z"/>
       </g>
      </g>
      <g class="com.sun.star.drawing.CustomShape">
       <g id="id64">
        <rect class="BoundingBox" stroke="none" fill="none" x="14188" y="23355" width="2196" height="592"/>
        <path fill="none" stroke="rgb(0,0,0)" stroke-width="40" stroke-linejoin="round" d="M 14209,23375 C 14209,23513 14298,23651 14388,23651 L 15106,23651 C 15196,23651 15286,23789 15286,23926 15286,23789 15375,23651 15465,23651 L 16183,23651 C 16273,23651 16363,23513 16363,23375"/>
        <path fill="none" stroke="rgb(0,0,0)" stroke-width="40" stroke-linejoin="round" d="M 14209,23926 L 14209,23926 Z"/>
        <path fill="none" stroke="rgb(0,0,0)" stroke-width="40" stroke-linejoin="round" d="M 16363,23375 L 16363,23375 Z"/>
       </g>
      </g>
      <g class="com.sun.star.drawing.CustomShape">
       <g id="id65">
        <rect class="BoundingBox" stroke="none" fill="none" x="17818" y="23355" width="2196" height="592"/>
        <path fill="none" stroke="rgb(0,0,0)" stroke-width="40" stroke-linejoin="round" d="M 17839,23375 C 17839,23513 17928,23651 18018,23651 L 18736,23651 C 18826,23651 18916,23789 18916,23926 18916,23789 19005,23651 19095,23651 L 19813,23651 C 19903,23651 19993,23513 19993,23375"/>
        <path fill="none" stroke="rgb(0,0,0)" stroke-width="40" stroke-linejoin="round" d="M 17839,23926 L 17839,23926 Z"/>
        <path fill="none" stroke="rgb(0,0,0)" stroke-width="40" stroke-linejoin="round" d="M 19993,23375 L 19993,23375 Z"/>
       </g>
      </g>
      <g class="OLE2">
       <g id="id66">
        <rect class="BoundingBox" stroke="none" fill="none" x="3874" y="23981" width="412" height="467"/>
        <defs>
         <clipPath id="clip_path_15" clipPathUnits="userSpaceOnUse">
          <path d="M 3863,23971 L 4286,23971 4286,24448 3863,24448 3863,23971 Z"/>
         </clipPath>
        </defs>
        <g clip-path="url(#clip_path_15)">
         <text class="TextShape"><tspan class="TextParagraph" font-family="Liberation Serif, serif" font-size="422px" font-weight="400"><tspan class="TextPosition" x="3980" y="24351"><tspan fill="rgb(0,0,0)" stroke="none">1</tspan></tspan></tspan></text>
        </g>
       </g>
      </g>
      <g class="OLE2">
       <g id="id67">
        <rect class="BoundingBox" stroke="none" fill="none" x="6029" y="23981" width="412" height="467"/>
        <defs>
         <clipPath id="clip_path_16" clipPathUnits="userSpaceOnUse">
          <path d="M 6033,23971 L 6429,23971 6429,24448 6033,24448 6033,23971 Z"/>
         </clipPath>
        </defs>
        <g clip-path="url(#clip_path_16)">
         <text class="TextShape"><tspan class="TextParagraph" font-family="Liberation Serif, serif" font-size="422px" font-weight="400"><tspan class="TextPosition" x="6134" y="24351"><tspan fill="rgb(0,0,0)" stroke="none">2</tspan></tspan></tspan></text>
        </g>
       </g>
      </g>
      <g class="OLE2">
       <g id="id68">
        <rect class="BoundingBox" stroke="none" fill="none" x="9704" y="23981" width="545" height="467"/>
        <defs>
         <clipPath id="clip_path_17" clipPathUnits="userSpaceOnUse">
          <path d="M 9710,23971 L 10239,23971 10239,24448 9710,24448 9710,23971 Z"/>
         </clipPath>
        </defs>
        <g clip-path="url(#clip_path_17)">
         <text class="TextShape"><tspan class="TextParagraph" font-family="Liberation Serif, serif" font-size="422px" font-style="italic" font-weight="400"><tspan class="TextPosition" x="9835" y="24351"><tspan fill="rgb(0,0,0)" stroke="none">N</tspan></tspan></tspan></text>
        </g>
       </g>
      </g>
      <g class="OLE2">
       <g id="id69">
        <rect class="BoundingBox" stroke="none" fill="none" x="12832" y="23981" width="412" height="467"/>
        <defs>
         <clipPath id="clip_path_18" clipPathUnits="userSpaceOnUse">
          <path d="M 12832,23971 L 13256,23971 13256,24448 12832,24448 12832,23971 Z"/>
         </clipPath>
        </defs>
        <g clip-path="url(#clip_path_18)">
         <text class="TextShape"><tspan class="TextParagraph" font-family="Liberation Serif, serif" font-size="422px" font-weight="400"><tspan class="TextPosition" x="12938" y="24351"><tspan fill="rgb(0,0,0)" stroke="none">1</tspan></tspan></tspan></text>
        </g>
       </g>
      </g>
      <g class="OLE2">
       <g id="id70">
        <rect class="BoundingBox" stroke="none" fill="none" x="15081" y="23981" width="412" height="467"/>
        <defs>
         <clipPath id="clip_path_19" clipPathUnits="userSpaceOnUse">
          <path d="M 15081,23971 L 15505,23971 15505,24448 15081,24448 15081,23971 Z"/>
         </clipPath>
        </defs>
        <g clip-path="url(#clip_path_19)">
         <text class="TextShape"><tspan class="TextParagraph" font-family="Liberation Serif, serif" font-size="422px" font-weight="400"><tspan class="TextPosition" x="15186" y="24351"><tspan fill="rgb(0,0,0)" stroke="none">2</tspan></tspan></tspan></text>
        </g>
       </g>
      </g>
      <g class="OLE2">
       <g id="id71">
        <rect class="BoundingBox" stroke="none" fill="none" x="18644" y="23981" width="545" height="467"/>
        <defs>
         <clipPath id="clip_path_20" clipPathUnits="userSpaceOnUse">
          <path d="M 18653,23971 L 19183,23971 19183,24448 18653,24448 18653,23971 Z"/>
         </clipPath>
        </defs>
        <g clip-path="url(#clip_path_20)">
         <text class="TextShape"><tspan class="TextParagraph" font-family="Liberation Serif, serif" font-size="422px" font-style="italic" font-weight="400"><tspan class="TextPosition" x="18774" y="24351"><tspan fill="rgb(0,0,0)" stroke="none">N</tspan></tspan></tspan></text>
        </g>
       </g>
      </g>
      <g class="com.sun.star.drawing.TextShape">
       <g id="id72">
        <rect class="BoundingBox" stroke="none" fill="none" x="7584" y="23757" width="1202" height="688"/>
        <text class="TextShape"><tspan class="TextParagraph" font-family="Liberation Mono, monospace" font-size="388px" font-weight="400"><tspan class="TextPosition" x="7834" y="24204"><tspan fill="rgb(0,0,0)" stroke="none">...</tspan></tspan></tspan></text>
       </g>
      </g>
      <g class="com.sun.star.drawing.TextShape">
       <g id="id73">
        <rect class="BoundingBox" stroke="none" fill="none" x="16467" y="23757" width="1202" height="688"/>
        <text class="TextShape"><tspan class="TextParagraph" font-family="Liberation Mono, monospace" font-size="388px" font-weight="400"><tspan class="TextPosition" x="16717" y="24204"><tspan fill="rgb(0,0,0)" stroke="none">...</tspan></tspan></tspan></text>
       </g>
      </g>
      <g class="com.sun.star.drawing.CustomShape">
       <g id="id74">
        <rect class="BoundingBox" stroke="none" fill="none" x="21209" y="20773" width="1041" height="1041"/>
        <path fill="none" stroke="rgb(0,0,0)" stroke-width="40" stroke-linejoin="round" d="M 21729,21793 L 21229,21793 21229,20793 22229,20793 22229,21793 21729,21793 Z"/>
       </g>
      </g>
      <g class="OLE2">
       <g id="id75">
        <rect class="BoundingBox" stroke="none" fill="none" x="21219" y="21037" width="1021" height="467"/>
        <defs>
         <clipPath id="clip_path_21" clipPathUnits="userSpaceOnUse">
          <path d="M 21220,21034 L 22252,21034 22252,21511 21220,21511 21220,21034 Z"/>
         </clipPath>
        </defs>
        <g clip-path="url(#clip_path_21)">
         <text class="TextShape"><tspan class="TextParagraph" font-family="OpenSymbol" font-size="422px" font-weight="400"><tspan class="TextPosition" x="21379" y="21407"><tspan fill="rgb(0,0,0)" stroke="none">≫</tspan></tspan></tspan></text>
         <text class="TextShape"><tspan class="TextParagraph" font-family="Liberation Serif, serif" font-size="422px" font-style="italic" font-weight="400"><tspan class="TextPosition" x="21914" y="21407"><tspan fill="rgb(0,0,0)" stroke="none">S</tspan></tspan></tspan></text>
        </g>
       </g>
      </g>
      <g class="OLE2">
       <g id="id76">
        <rect class="BoundingBox" stroke="none" fill="none" x="23140" y="21034" width="967" height="481"/>
        <defs>
         <clipPath id="clip_path_22" clipPathUnits="userSpaceOnUse">
          <path d="M 23151,21034 L 24104,21034 24104,21511 23151,21511 23151,21034 Z"/>
         </clipPath>
        </defs>
        <g clip-path="url(#clip_path_22)">
         <text class="TextShape"><tspan class="TextParagraph" font-family="Liberation Serif, serif" font-size="422px" font-style="italic" font-weight="400"><tspan class="TextPosition" x="23272" y="21404"><tspan fill="rgb(0,0,0)" stroke="none">z</tspan></tspan></tspan></text>
         <text class="TextShape"><tspan class="TextParagraph" font-family="OpenSymbol" font-size="422px" font-weight="400"><tspan class="TextPosition" x="23484" y="21404"><tspan fill="rgb(0,0,0)" stroke="none">[</tspan></tspan></tspan></text>
         <text class="TextShape"><tspan class="TextParagraph" font-family="Liberation Serif, serif" font-size="422px" font-style="italic" font-weight="400"><tspan class="TextPosition" x="23643" y="21404"><tspan fill="rgb(0,0,0)" stroke="none">n</tspan></tspan></tspan></text>
         <text class="TextShape"><tspan class="TextParagraph" font-family="OpenSymbol" font-size="422px" font-weight="400"><tspan class="TextPosition" x="23881" y="21404"><tspan fill="rgb(0,0,0)" stroke="none">]</tspan></tspan></tspan></text>
        </g>
       </g>
      </g>
      <g class="com.sun.star.drawing.LineShape">
       <g id="id77">
        <rect class="BoundingBox" stroke="none" fill="none" x="22313" y="21098" width="919" height="353"/>
        <path fill="none" stroke="rgb(0,0,0)" stroke-width="35" stroke-linejoin="round" d="M 22331,21274 L 22726,21274"/>
        <path fill="rgb(0,0,0)" stroke="none" d="M 23231,21274 L 22703,21098 22703,21450 23231,21274 Z"/>
       </g>
      </g>
      <g class="OLE2">
       <g id="id78">
        <rect class="BoundingBox" stroke="none" fill="none" x="13358" y="22461" width="547" height="61"/>
        <defs>
         <clipPath id="clip_path_23" clipPathUnits="userSpaceOnUse">
          <path d="M 13361,22463 L 13917,22463 13917,22516 13361,22516 13361,22463 Z"/>
         </clipPath>
        </defs>
        <g clip-path="url(#clip_path_23)">
         <text class="TextShape"><tspan class="TextParagraph" font-family="OpenSymbol" font-size="422px" font-weight="400"><tspan class="TextPosition" x="13464" y="22620"><tspan fill="rgb(0,0,0)" stroke="none">−</tspan></tspan></tspan></text>
        </g>
       </g>
      </g>
      <g class="OLE2">
       <g id="id79">
        <rect class="BoundingBox" stroke="none" fill="none" x="15528" y="22461" width="547" height="61"/>
        <defs>
         <clipPath id="clip_path_24" clipPathUnits="userSpaceOnUse">
          <path d="M 15531,22463 L 16087,22463 16087,22516 15531,22516 15531,22463 Z"/>
         </clipPath>
        </defs>
        <g clip-path="url(#clip_path_24)">
         <text class="TextShape"><tspan class="TextParagraph" font-family="OpenSymbol" font-size="422px" font-weight="400"><tspan class="TextPosition" x="15634" y="22620"><tspan fill="rgb(0,0,0)" stroke="none">−</tspan></tspan></tspan></text>
        </g>
       </g>
      </g>
      <g class="OLE2">
       <g id="id80">
        <rect class="BoundingBox" stroke="none" fill="none" x="19274" y="22461" width="547" height="61"/>
        <defs>
         <clipPath id="clip_path_25" clipPathUnits="userSpaceOnUse">
          <path d="M 19262,22463 L 19817,22463 19817,22516 19262,22516 19262,22463 Z"/>
         </clipPath>
        </defs>
        <g clip-path="url(#clip_path_25)">
         <text class="TextShape"><tspan class="TextParagraph" font-family="OpenSymbol" font-size="422px" font-weight="400"><tspan class="TextPosition" x="19380" y="22620"><tspan fill="rgb(0,0,0)" stroke="none">−</tspan></tspan></tspan></text>
        </g>
       </g>
      </g>
     </g>
    </g>
   </g>
  </g>
 </g>
</svg>