<?xml version="1.0" encoding="UTF-8" standalone="no"?>
<!DOCTYPE svg PUBLIC "-//W3C//DTD SVG 1.1//EN" "http://www.w3.org/Graphics/SVG/1.1/DTD/svg11.dtd">
<!-- Generated by Microsoft Visio, SVG Export Window_primitive.svg Page-1 -->
<svg xmlns="http://www.w3.org/2000/svg" xmlns:xlink="http://www.w3.org/1999/xlink" xmlns:ev="http://www.w3.org/2001/xml-events"
		width="7.22656in" height="2.64034in" viewBox="0 0 520.312 190.104" xml:space="preserve" color-interpolation-filters="sRGB"
		class="st2">
	<style type="text/css">
	<![CDATA[
		.st1 {fill:none;stroke:none;stroke-linecap:round;stroke-linejoin:round;stroke-width:0.75}
		.st2 {fill:none;fill-rule:evenodd;font-size:12px;overflow:visible;stroke-linecap:square;stroke-miterlimit:3}
	]]>
	</style>

	<g>
		<title>Page-1</title>
		<g id="shape1-1" transform="translate(0.375,-0.375)">
			<title>Sheet.1</title>
			<rect x="0" y="0.749996" width="519.562" height="189.354" class="st1"/>
			<!-- Unsupported Record: EmfPlusRecordTypeSetPixelOffsetMode  -->
			<svg viewBox="-0.70871 -0.70869 4330 1578" clip="rect(0 0 0 0)" height="189.354" overflow="hidden"
					preserveAspectRatio="none" width="519.562" x="0" y="0.749996">
				<mask id="mfid1">
					<rect width="4330" height="1578" fill="white" stroke="none"/>
				</mask>
				<mask id="mfid2" fill="white" stroke="none">
					<g>
						<g mask="url(#mfid1)">
							<rect x="-0.70871" y="-0.70869" width="4330" height="1578" id="mfid3"/>
						</g>
					</g>
				</mask>
				<defs>
					<path id="mfid4"
							d="M0,341380 C-0.00000000086729,152840 152500,0 340610,0 C528730,-0.00000000086923 681230,152840 681230,341380 C681230,529910 528730,682750 340610,682750 C152500,682750 -0.0000000013009,529910 0,341380 Z"/>
				</defs>
				<g mask="url(#mfid2)">
					<g transform="matrix(0.00065617, 0, 0, 0.00065617, 1176, 723)">
						<g fill="#ffffff">
							<use xlink:href="#mfid4" fill-rule="evenodd" stroke="none"/>
							<defs>
								<path id="mfid5" d="M99764,99987 L581460,582770 M581460,99987 L99764,582770"/>
							</defs>
						</g>
						<g fill="#ffffff" stroke-width="12192" stroke="#000000" stroke-miterlimit="8">
							<use xlink:href="#mfid5" fill="none"/>
							<defs>
								<path id="mfid6"
										d="M0,341380 C-0.00000000086729,152840 152500,0 340610,0 C528730,-0.00000000086923 681230,152840 681230,341380 C681230,529910 528730,682750 340610,682750 C152500,682750 -0.0000000013009,529910 0,341380 Z"/>
							</defs>
							<use xlink:href="#mfid6" fill="none"/>
							<defs>
								<path id="mfid7" d="M6.25,-12.5 L0,0 L-6.25,-12.5 Z"/>
							</defs>
							<defs>
								<path id="mfid8" d="M0,0 L1,831270"/>
							</defs>
						</g>
					</g>
					<g transform="matrix(0.00065617, 0, 0, 0.00065617, 1400, 178)">
						<g fill="#000000">
							<marker id="mfid9" markerUnits="strokeWidth" orient="align" overflow="visible">
								<g transform="rotate(-45)" stroke-linecap="butt" stroke-miterlimit="10">
									<use xlink:href="#mfid7" fill-rule="nonzero" stroke="none" fill="#000000"/>
								</g>
							</marker>
						</g>
						<g fill="#ffffff" stroke-width="6096" stroke="#000000" marker-end="url(#mfid9)" stroke-miterlimit="8">
							<use xlink:href="#mfid8" fill="none"/>
							<defs>
								<path id="mfid10" d="M6.25,-12.5 L0,0 L-6.25,-12.5 Z"/>
							</defs>
							<defs>
								<path id="mfid11" d="M0,0 L931030,1"/>
							</defs>
						</g>
					</g>
					<g transform="matrix(0.00065617, 0, 0, 0.00065617, 565, 947)">
						<g fill="#000000"/>
						<g fill="#ffffff" stroke-width="6096" stroke="#000000" marker-end="url(#mfid9)" stroke-miterlimit="8">
							<use xlink:href="#mfid11" fill="none"/>
							<defs>
								<path id="mfid12" d="M6.25,-12.5 L0,0 L-6.25,-12.5 Z"/>
							</defs>
							<defs>
								<path id="mfid13" d="M0,0 L798020,1"/>
							</defs>
						</g>
					</g>
					<g transform="matrix(0.00065617, 0, 0, 0.00065617, 1623, 949)">
						<g fill="#000000"/>
						<g fill="#ffffff" stroke-width="6096" stroke="#000000" marker-end="url(#mfid9)" stroke-miterlimit="8">
							<use xlink:href="#mfid13" fill="none"/>
							<defs>
								<path id="mfid14" d="M0,0 L1499600,0 L1499600,647700 L0,647700 Z"/>
							</defs>
						</g>
					</g>
					<g transform="matrix(0.00065617, 0, 0, 0.00065617, 2147, 746)">
						<g fill="#ffffff" stroke-width="9144" stroke="#000000" stroke-linejoin="round">
							<use xlink:href="#mfid14" fill="none"/>
						</g>
					</g>
				</g>
				<!-- GetDC -->
				<mask id="mfid15" fill-rule="evenodd" fill="white" stroke="none">
					<rect x="0" y="0" width="4330" height="1578"/>
				</mask>
				<g mask="url(#mfid15)">
					<g transform="matrix(1, 0, 0, 1, 2425.4, 916.44)">
						<g stroke="#000000" stroke-miterlimit="10" fill="none">
							<g font-family="&#39;Calibri&#39;,swiss,sans-serif" font-style="normal" font-weight="400"
									font-size="150">
								<text stroke="none" fill="#000000" x="0,79,148,241,276,352,428" y="0" transform="translate(0,0)"
										xml:space="preserve">RSH 32</text>
							</g>
						</g>
					</g>
				</g>
				<!-- Released DC -->
				<!-- GetDC -->
				<g mask="url(#mfid15)">
					<g transform="matrix(1, 0, 0, 1, 2212.4, 1096.4)">
						<g stroke="#000000" stroke-miterlimit="10" fill="none">
							<g font-family="&#39;Calibri&#39;,swiss,sans-serif" font-style="normal" font-weight="400"
									font-size="150">
								<text stroke="none" fill="#000000" x="0,78,157,236,315,394,429,508,580,614,660,695,774,853" y="0"
										transform="translate(0,0)" xml:space="preserve">Round half up</text>
							</g>
						</g>
					</g>
				</g>
				<!-- Released DC -->
				<defs>
					<path id="mfid16" d="M0,0 L4896600,0 L4896600,2127500 L0,2127500 Z"/>
				</defs>
				<g mask="url(#mfid2)">
					<g transform="matrix(0.00065617, 0, 0, 0.00065617, 565, 178)">
						<g fill="#ffffff" stroke-width="12192" stroke="#000000" stroke-miterlimit="8">
							<use xlink:href="#mfid16" fill="none"/>
						</g>
					</g>
				</g>
				<!-- GetDC -->
				<g mask="url(#mfid15)">
					<g transform="matrix(1, 0, 0, 1, 1224.4, 104.89)">
						<g stroke="#000000" stroke-miterlimit="10" fill="none">
							<g font-family="&#39;Courier New&#39;,modern,monospace" font-style="normal" font-weight="400"
									font-size="83">
								<text stroke="none" fill="#000000" x="0,50,100,150,200,250,300,350" y="0"
										transform="translate(0,0)" xml:space="preserve">data_in</text>
							</g>
						</g>
					</g>
				</g>
				<!-- Released DC -->
				<!-- GetDC -->
				<g mask="url(#mfid15)">
					<g transform="matrix(1, 0, 0, 1, 3839.4, 971.13)">
						<g stroke="#000000" stroke-miterlimit="10" fill="none">
							<g font-family="&#39;Courier New&#39;,modern,monospace" font-style="normal" font-weight="400"
									font-size="83">
								<text stroke="none" fill="#000000" x="0,50,100,150,200,250,300,350,400" y="0"
										transform="translate(0,0)" xml:space="preserve">data_out</text>
							</g>
						</g>
					</g>
				</g>
				<!-- Released DC -->
				<!-- GetDC -->
				<g mask="url(#mfid15)">
					<g transform="matrix(1, 0, 0, 1, 89.881, 954.56)">
						<g stroke="#000000" stroke-miterlimit="10" fill="none">
							<g font-family="&#39;Courier New&#39;,modern,monospace" font-style="normal" font-weight="400"
									font-size="83">
								<text stroke="none" fill="#000000" x="0,50,100,150,200,250,300,350,400" y="0"
										transform="translate(0,0)" xml:space="preserve">coeff_in</text>
							</g>
						</g>
					</g>
				</g>
				<!-- Released DC -->
				<defs>
					<path id="mfid17" d="M6.25,-12.5 L0,0 L-6.25,-12.5 Z"/>
				</defs>
				<defs>
					<path id="mfid18" d="M0,0 L985060,1"/>
				</defs>
				<g mask="url(#mfid2)">
					<g transform="matrix(0.00065617, 0, 0, 0.00065617, 3131, 947)">
						<g fill="#000000">
							<marker id="mfid19" markerUnits="strokeWidth" orient="align" overflow="visible">
								<g transform="rotate(-45)" stroke-linecap="butt" stroke-miterlimit="10">
									<use xlink:href="#mfid17" fill-rule="nonzero" stroke="none" fill="#000000"/>
								</g>
							</marker>
						</g>
						<g fill="#ffffff" stroke-width="6096" stroke="#000000" marker-end="url(#mfid19)" stroke-miterlimit="8">
							<use xlink:href="#mfid18" fill="none"/>
						</g>
					</g>
				</g>
			</svg>
			<rect x="0" y="0.749996" width="519.562" height="189.354" class="st1"/>
		</g>
	</g>
</svg>
