<?xml version="1.0" encoding="UTF-8" standalone="no"?>
<!DOCTYPE svg PUBLIC "-//W3C//DTD SVG 1.1//EN" "http://www.w3.org/Graphics/SVG/1.1/DTD/svg11.dtd">
<!-- Generated by Microsoft Visio, SVG Export Window_block_diagram.svg Page-1 -->
<svg xmlns="http://www.w3.org/2000/svg" xmlns:xlink="http://www.w3.org/1999/xlink" xmlns:ev="http://www.w3.org/2001/xml-events"
		width="8.90262in" height="4.47411in" viewBox="0 0 640.989 322.136" xml:space="preserve" color-interpolation-filters="sRGB"
		class="st9">
	<style type="text/css">
	<![CDATA[
		.st1 {stroke:none;stroke-linecap:round;stroke-linejoin:round;stroke-width:0.75}
		.st2 {fill:#000000;font-family:Courier New;font-size:0.829971em}
		.st3 {stroke:#000000;stroke-linecap:round;stroke-linejoin:round;stroke-width:0.71996}
		.st4 {fill:#000000;font-family:Calibri;font-size:1.49995em}
		.st5 {fill:#000000;stroke:#000000;stroke-linecap:round;stroke-linejoin:round;stroke-width:0.00749959}
		.st6 {fill:#000000;stroke:#000000;stroke-linecap:round;stroke-linejoin:round;stroke-width:0.0149992}
		.st7 {fill:#000000;stroke:#000000;stroke-linecap:round;stroke-linejoin:round;stroke-width:0.0299983}
		.st8 {stroke:#000000;stroke-linecap:round;stroke-linejoin:round;stroke-width:0.479973}
		.st9 {fill:none;fill-rule:evenodd;font-size:12px;overflow:visible;stroke-linecap:square;stroke-miterlimit:3}
	]]>
	</style>

	<g>
		<title>Page-1</title>
		<g id="shape3-1" transform="translate(207.448,-223.039)">
			<title>Sheet.3</title>
			<desc>Q</desc>
			<path d="M13.75 310.18 L0 310.18 L0 322.14 L13.75 322.14 L13.75 310.18" class="st1"/>
			<text x="3.89" y="319.15" class="st2">Q</text>		</g>
		<g id="shape4-5" transform="translate(232.884,-259.843)">
			<title>Sheet.4</title>
			<path d="M0 292.98 L118.19 292.98 L118.19 322.14 L0 322.14 L0 292.98" class="st3"/>
		</g>
		<g id="shape5-8" transform="translate(261.445,-261.54)">
			<title>Sheet.5</title>
			<desc>Window</desc>
			<path d="M75.31 300.53 L0 300.53 L0 322.14 L75.31 322.14 L75.31 300.53" class="st1"/>
			<text x="6.95" y="316.73" class="st4">Window</text>		</g>
		<g id="shape6-12" transform="translate(232.884,-207.405)">
			<title>Sheet.6</title>
			<path d="M0 293.1 L118.19 293.1 L118.19 322.14 L0 322.14 L0 293.1" class="st3"/>
		</g>
		<g id="shape7-15" transform="translate(261.445,-209.025)">
			<title>Sheet.7</title>
			<desc>Window</desc>
			<path d="M75.31 300.53 L0 300.53 L0 322.14 L75.31 322.14 L75.31 300.53" class="st1"/>
			<text x="6.95" y="316.73" class="st4">Window</text>		</g>
		<g id="shape8-19" transform="translate(69.2163,-87.7693)">
			<title>Sheet.8</title>
			<path d="M0 249.42 L118.19 249.42 L118.19 322.14 L0 322.14 L0 249.42" class="st3"/>
		</g>
		<g id="shape9-22" transform="translate(97.8205,-133.084)">
			<title>Sheet.9</title>
			<desc>Protocol</desc>
			<path d="M80.46 300.53 L0 300.53 L0 322.14 L80.46 322.14 L80.46 300.53" class="st1"/>
			<text x="9.32" y="316.73" class="st4">Protocol </text>		</g>
		<g id="shape10-26" transform="translate(95.7807,-111.485)">
			<title>Sheet.10</title>
			<desc>Interface</desc>
			<path d="M85.19 300.53 L0 300.53 L0 322.14 L85.19 322.14 L85.19 300.53" class="st1"/>
			<text x="9.63" y="316.73" class="st4">Interface </text>		</g>
		<g id="shape11-30" transform="translate(108.86,-89.8857)">
			<title>Sheet.11</title>
			<desc>delay</desc>
			<path d="M49.89 300.53 L0 300.53 L0 322.14 L49.89 322.14 L49.89 300.53" class="st1"/>
			<text x="5.29" y="316.73" class="st4">delay</text>		</g>
		<g id="shape12-34" transform="translate(2.26133,-160.509)">
			<title>Sheet.12</title>
			<path d="M0 232.16 L126.29 232.16 L126.29 317.13 L125.81 317.13 L125.81 232.4 L126.05 232.64 L0 232.64 L0 232.16 L0 232.16
						 ZM129.05 316.14 L126.05 322.14 L123.05 316.14 L129.05 316.14 L129.05 316.14 Z" class="st5"/>
		</g>
		<g id="shape13-36" transform="translate(128.372,-249.929)">
			<title>Sheet.13</title>
			<path d="M0 322.14 L52.53 322.14 L52.53 297.7 L52.29 297.94 L99.56 297.94 L99.56 297.46 L52.05 297.46 L52.05 321.9 L52.29
						 321.66 L0 321.66 L0 322.14 L0 322.14 ZM98.56 300.7 L104.56 297.7 L98.56 294.7 L98.56 300.7 L98.56 300.7
						 Z" class="st6"/>
		</g>
		<g id="shape14-38" transform="translate(128.372,-218.91)">
			<title>Sheet.14</title>
			<path d="M0 290.56 L52.53 290.56 L52.53 319.14 L52.29 318.9 L99.56 318.9 L99.56 319.38 L52.05 319.38 L52.05 290.8 L52.29
						 291.04 L0 291.04 L0 290.56 L0 290.56 ZM98.56 316.14 L104.56 319.14 L98.56 322.14 L98.56 316.14 L98.56 316.14
						 Z" class="st6"/>
		</g>
		<g id="shape15-40" transform="translate(207.448,-274.021)">
			<title>Sheet.15</title>
			<desc>I</desc>
			<path d="M13.75 310.18 L0 310.18 L0 322.14 L13.75 322.14 L13.75 310.18" class="st1"/>
			<text x="3.89" y="319.15" class="st2">I</text>		</g>
		<g id="shape16-44" transform="translate(483.305,-127.968)">
			<title>Sheet.16</title>
			<path d="M0 271.26 L118.19 271.26 L118.19 322.14 L0 322.14 L0 271.26" class="st3"/>
		</g>
		<g id="shape17-47" transform="translate(503.019,-151.476)">
			<title>Sheet.17</title>
			<desc>Coefficient</desc>
			<path d="M95.93 300.53 L0 300.53 L0 322.14 L95.93 322.14 L95.93 300.53" class="st1"/>
			<text x="8.29" y="316.73" class="st4">Coefficient</text>		</g>
		<g id="shape18-51" transform="translate(512.979,-129.876)">
			<title>Sheet.18</title>
			<desc>Counter</desc>
			<path d="M72.84 300.53 L0 300.53 L0 322.14 L72.84 322.14 L72.84 300.53" class="st1"/>
			<text x="6.79" y="316.73" class="st4">Counter</text>		</g>
		<g id="shape19-55" transform="translate(483.305,-220.125)">
			<title>Sheet.19</title>
			<path d="M0 271.26 L118.19 271.26 L118.19 322.14 L0 322.14 L0 271.26" class="st3"/>
		</g>
		<g id="shape20-58" transform="translate(503.019,-243.583)">
			<title>Sheet.20</title>
			<desc>Coefficient</desc>
			<path d="M95.93 300.53 L0 300.53 L0 322.14 L95.93 322.14 L95.93 300.53" class="st1"/>
			<text x="8.29" y="316.73" class="st4">Coefficient</text>		</g>
		<g id="shape21-62" transform="translate(514.539,-221.984)">
			<title>Sheet.21</title>
			<desc>DPRAM</desc>
			<path d="M69.03 300.53 L0 300.53 L0 322.14 L69.03 322.14 L69.03 300.53" class="st1"/>
			<text x="6.54" y="316.73" class="st4">DPRAM</text>		</g>
		<g id="shape22-66" transform="translate(351.075,-245.234)">
			<title>Sheet.22</title>
			<path d="M132.32 322.14 L65.94 322.14 L65.94 293.01 L66.18 293.25 L5.01 293.25 L5.01 292.77 L66.42 292.77 L66.42 321.9
						 L66.18 321.66 L132.32 321.66 L132.32 322.14 L132.32 322.14 ZM6 296.01 L0 293.01 L6 290.01 L6 296.01 L6 296.01
						 Z" class="st7"/>
		</g>
		<g id="shape23-68" transform="translate(351.075,-218.895)">
			<title>Sheet.23</title>
			<path d="M132.32 295.23 L65.94 295.23 L65.94 319.14 L66.18 318.9 L5.01 318.9 L5.01 319.38 L66.42 319.38 L66.42 295.47
						 L66.18 295.71 L132.32 295.71 L132.32 295.23 L132.32 295.23 ZM6 316.14 L0 319.14 L6 322.14 L6 316.14 L6 316.14
						 Z" class="st7"/>
		</g>
		<g id="shape24-70" transform="translate(539.461,-178.906)">
			<title>Sheet.24</title>
			<path d="M3.24 322.14 L3.24 285.93 L2.76 285.93 L2.76 322.14 L3.24 322.14 L3.24 322.14 ZM6 286.92 L3 280.92 L0 286.92
						 L6 286.92 L6 286.92 Z" class="st7"/>
		</g>
		<g id="shape25-72" transform="translate(539.461,-271.033)">
			<title>Sheet.25</title>
			<path d="M3.24 271.05 L3.24 317.13 L2.76 317.13 L2.76 271.05 L3.24 271.05 L3.24 271.05 ZM6 316.14 L3 322.14 L0 316.14
						 L6 316.14 L6 316.14 Z" class="st7"/>
		</g>
		<g id="shape26-74" transform="translate(1.19904E-014,-253.034)">
			<title>Sheet.26</title>
			<desc>data_in</desc>
			<path d="M54.99 310.18 L0 310.18 L0 322.14 L54.99 322.14 L54.99 310.18" class="st1"/>
			<text x="6.58" y="319.15" class="st2">data_in</text>		</g>
		<g id="shape27-78" transform="translate(551.631,-303.771)">
			<title>Sheet.27</title>
			<desc>Props_in.raw</desc>
			<path d="M89.36 310.18 L0 310.18 L0 322.14 L89.36 322.14 L89.36 310.18" class="st1"/>
			<text x="8.82" y="319.15" class="st2">Props_in.raw</text>		</g>
		<g id="shape28-82" transform="translate(187.408,-121.188)">
			<title>Sheet.28</title>
			<path d="M104.8 235.92 L104.8 319.38 L5.01 319.38 L5.01 318.9 L104.56 318.9 L104.32 319.14 L104.32 235.92 L104.8 235.92
						 L104.8 235.92 ZM6 322.14 L0 319.14 L6 316.14 L6 322.14 L6 322.14 Z" class="st6"/>
		</g>
		<g id="shape29-84" transform="translate(291.92,-124.113)">
			<title>Sheet.29</title>
			<path d="M0 186.41 L0 199.95 L98.32 199.95 L98.32 322.14" class="st8"/>
		</g>
		<g id="shape30-87" transform="translate(291.92,-124.128)">
			<title>Sheet.30</title>
			<path d="M-0 322.14 L98.32 322.14" class="st8"/>
		</g>
		<g id="shape31-90" transform="translate(125.627,-0.00749959)">
			<title>Sheet.31</title>
			<path d="M2.98 234.37 L3.25 317.14 L2.77 317.14 L2.5 234.39 L2.98 234.37 L2.98 234.37 ZM6 316.14 L3.03 322.14 L0 316.15
						 L6 316.14 L6 316.14 Z" class="st6"/>
		</g>
		<g id="shape32-92" transform="translate(139.19,-12.5809)">
			<title>Sheet.32</title>
			<desc>data_out</desc>
			<path d="M61.86 310.18 L0 310.18 L0 322.14 L61.86 322.14 L61.86 310.18" class="st1"/>
			<text x="7.02" y="319.15" class="st2">data_out</text>		</g>
	</g>
</svg>
