<?xml version="1.0" encoding="UTF-8"?>
<!DOCTYPE svg PUBLIC "-//W3C//DTD SVG 1.1//EN" "http://www.w3.org/Graphics/SVG/1.1/DTD/svg11.dtd">
<svg version="1.2" width="107.74mm" height="82.05mm" viewBox="1000 9973 10774 8205" preserveAspectRatio="xMidYMid" fill-rule="evenodd" stroke-width="28.222" stroke-linejoin="round" xmlns="http://www.w3.org/2000/svg" xmlns:ooo="http://xml.openoffice.org/svg/export" xmlns:xlink="http://www.w3.org/1999/xlink" xmlns:presentation="http://sun.com/xmlns/staroffice/presentation" xmlns:smil="http://www.w3.org/2001/SMIL20/" xmlns:anim="urn:oasis:names:tc:opendocument:xmlns:animation:1.0" xml:space="preserve">
 <defs class="ClipPathGroup">
  <clipPath id="presentation_clip_path" clipPathUnits="userSpaceOnUse">
   <rect x="1000" y="9973" width="10774" height="8205"/>
  </clipPath>
  <clipPath id="presentation_clip_path_shrink" clipPathUnits="userSpaceOnUse">
   <rect x="1010" y="9981" width="10753" height="8189"/>
  </clipPath>
 </defs>
 <defs>
  <font id="EmbeddedFont_1" horiz-adv-x="2048">
   <font-face font-family="Liberation Sans embedded" units-per-em="2048" font-weight="normal" font-style="normal" ascent="1826" descent="423"/>
   <missing-glyph horiz-adv-x="2048" d="M 0,0 L 2047,0 2047,2047 0,2047 0,0 Z"/>
   <glyph unicode="x" horiz-adv-x="1006" d="M 801,0 L 510,444 217,0 23,0 408,556 41,1082 240,1082 510,661 778,1082 979,1082 612,558 1002,0 801,0 Z"/>
   <glyph unicode="v" horiz-adv-x="1033" d="M 613,0 L 400,0 7,1082 199,1082 437,378 C 442,363 447,346 454,325 460,304 466,282 473,259 480,236 486,215 492,194 497,173 502,155 506,141 510,155 515,173 522,194 528,215 534,236 541,258 548,280 555,302 562,323 569,344 575,361 580,376 L 826,1082 1017,1082 613,0 Z"/>
   <glyph unicode="u" horiz-adv-x="874" d="M 314,1082 L 314,396 C 314,343 318,299 326,264 333,229 346,200 363,179 380,157 403,142 432,133 460,124 495,119 537,119 580,119 618,127 653,142 687,157 716,178 741,207 765,235 784,270 797,312 810,353 817,401 817,455 L 817,1082 997,1082 997,231 C 997,208 997,185 998,160 998,135 998,111 999,89 1000,66 1000,47 1001,31 1002,15 1002,5 1003,0 L 833,0 C 832,3 832,12 831,27 830,42 830,59 829,78 828,97 827,116 826,136 825,155 825,172 825,185 L 822,185 C 805,154 786,125 765,100 744,75 720,53 693,36 666,18 634,4 599,-6 564,-15 523,-20 476,-20 416,-20 364,-13 321,2 278,17 242,39 214,70 186,101 166,140 153,188 140,236 133,294 133,361 L 133,1082 314,1082 Z"/>
   <glyph unicode="t" horiz-adv-x="531" d="M 554,8 C 527,1 499,-5 471,-10 442,-14 409,-16 372,-16 228,-16 156,66 156,229 L 156,951 31,951 31,1082 163,1082 216,1324 336,1324 336,1082 536,1082 536,951 336,951 336,268 C 336,216 345,180 362,159 379,138 408,127 450,127 467,127 484,128 501,131 517,134 535,137 554,141 L 554,8 Z"/>
   <glyph unicode="o" horiz-adv-x="980" d="M 1053,542 C 1053,353 1011,212 928,119 845,26 724,-20 565,-20 490,-20 422,-9 363,14 304,37 254,71 213,118 172,165 140,223 119,294 97,364 86,447 86,542 86,915 248,1102 571,1102 655,1102 728,1090 789,1067 850,1044 900,1009 939,962 978,915 1006,857 1025,787 1044,717 1053,635 1053,542 Z M 864,542 C 864,626 858,695 845,750 832,805 813,848 788,881 763,914 732,937 696,950 660,963 619,969 574,969 528,969 487,962 450,949 413,935 381,912 355,879 329,846 309,802 296,747 282,692 275,624 275,542 275,458 282,389 297,334 312,279 332,235 358,202 383,169 414,146 449,133 484,120 522,113 563,113 609,113 651,120 688,133 725,146 757,168 783,201 809,234 829,278 843,333 857,388 864,458 864,542 Z"/>
   <glyph unicode="n" horiz-adv-x="874" d="M 825,0 L 825,686 C 825,739 821,783 814,818 806,853 793,882 776,904 759,925 736,941 708,950 679,959 644,963 602,963 559,963 521,956 487,941 452,926 423,904 399,876 374,847 355,812 342,771 329,729 322,681 322,627 L 322,0 142,0 142,851 C 142,874 142,898 142,923 141,948 141,971 140,994 139,1016 139,1035 138,1051 137,1067 137,1077 136,1082 L 306,1082 C 307,1079 307,1070 308,1055 309,1040 310,1024 311,1005 312,986 312,966 313,947 314,927 314,910 314,897 L 317,897 C 334,928 353,957 374,982 395,1007 419,1029 446,1047 473,1064 505,1078 540,1088 575,1097 616,1102 663,1102 723,1102 775,1095 818,1080 861,1065 897,1043 925,1012 953,981 974,942 987,894 1000,845 1006,788 1006,721 L 1006,0 825,0 Z"/>
   <glyph unicode="m" horiz-adv-x="1457" d="M 768,0 L 768,686 C 768,739 765,783 758,818 751,853 740,882 725,904 709,925 688,941 663,950 638,959 607,963 570,963 532,963 498,956 467,941 436,926 410,904 389,876 367,847 350,812 339,771 327,729 321,681 321,627 L 321,0 142,0 142,851 C 142,874 142,898 142,923 141,948 141,971 140,994 139,1016 139,1035 138,1051 137,1067 137,1077 136,1082 L 306,1082 C 307,1079 307,1070 308,1055 309,1040 310,1024 311,1005 312,986 312,966 313,947 314,927 314,910 314,897 L 317,897 C 333,928 350,957 369,982 388,1007 410,1029 435,1047 460,1064 488,1078 521,1088 553,1097 590,1102 633,1102 715,1102 780,1086 828,1053 875,1020 908,968 927,897 L 930,897 C 946,928 964,957 984,982 1004,1007 1027,1029 1054,1047 1081,1064 1111,1078 1144,1088 1177,1097 1215,1102 1258,1102 1313,1102 1360,1095 1400,1080 1439,1065 1472,1043 1497,1012 1522,981 1541,942 1553,894 1565,845 1571,788 1571,721 L 1571,0 1393,0 1393,686 C 1393,739 1390,783 1383,818 1376,853 1365,882 1350,904 1334,925 1313,941 1288,950 1263,959 1232,963 1195,963 1157,963 1123,956 1092,942 1061,927 1035,906 1014,878 992,850 975,815 964,773 952,731 946,682 946,627 L 946,0 768,0 Z"/>
   <glyph unicode="i" horiz-adv-x="187" d="M 137,1312 L 137,1484 317,1484 317,1312 137,1312 Z M 137,0 L 137,1082 317,1082 317,0 137,0 Z"/>
   <glyph unicode="e" horiz-adv-x="980" d="M 276,503 C 276,446 282,394 294,347 305,299 323,258 348,224 372,189 403,163 441,144 479,125 525,115 578,115 656,115 719,131 766,162 813,193 844,233 861,281 L 1019,236 C 1008,206 992,176 972,146 951,115 924,88 890,64 856,39 814,19 763,4 712,-12 650,-20 578,-20 418,-20 296,28 213,123 129,218 87,360 87,548 87,649 100,735 125,806 150,876 185,933 229,977 273,1021 324,1053 383,1073 442,1092 504,1102 571,1102 662,1102 738,1087 799,1058 860,1029 909,988 946,937 983,885 1009,824 1025,754 1040,684 1048,608 1048,527 L 1048,503 276,503 Z M 862,641 C 852,755 823,838 775,891 727,943 658,969 568,969 538,969 507,964 474,955 441,945 410,928 382,903 354,878 330,845 311,803 292,760 281,706 278,641 L 862,641 Z"/>
   <glyph unicode="d" horiz-adv-x="927" d="M 821,174 C 788,105 744,55 689,25 634,-5 565,-20 484,-20 347,-20 247,26 183,118 118,210 86,349 86,536 86,913 219,1102 484,1102 566,1102 634,1087 689,1057 744,1027 788,979 821,914 L 823,914 C 823,921 823,931 823,946 822,960 822,975 822,991 821,1006 821,1021 821,1035 821,1049 821,1059 821,1065 L 821,1484 1001,1484 1001,223 C 1001,197 1001,172 1002,148 1002,124 1002,102 1003,82 1004,62 1004,45 1005,31 1006,16 1006,6 1007,0 L 835,0 C 834,7 833,16 832,29 831,41 830,55 829,71 828,87 827,104 826,122 825,139 825,157 825,174 L 821,174 Z M 275,542 C 275,467 280,403 289,350 298,297 313,253 334,219 355,184 381,159 413,143 445,127 484,119 530,119 577,119 619,127 656,142 692,157 722,182 747,217 771,251 789,296 802,351 815,406 821,474 821,554 821,631 815,696 802,749 789,802 771,844 746,877 721,910 691,933 656,948 620,962 579,969 532,969 488,969 450,961 418,946 386,931 359,906 338,872 317,838 301,794 291,740 280,685 275,619 275,542 Z"/>
   <glyph unicode="a" horiz-adv-x="1060" d="M 414,-20 C 305,-20 224,9 169,66 114,123 87,202 87,302 87,373 101,432 128,478 155,523 190,559 234,585 277,611 327,629 383,639 439,649 496,655 554,656 L 797,660 797,719 C 797,764 792,802 783,833 774,864 759,890 740,909 721,928 697,943 668,952 639,961 604,965 565,965 530,965 499,963 471,958 443,953 419,944 398,931 377,918 361,900 348,878 335,855 327,827 323,793 L 135,810 C 142,853 154,892 173,928 192,963 218,994 253,1020 287,1046 330,1066 382,1081 433,1095 496,1102 569,1102 705,1102 807,1071 876,1009 945,946 979,856 979,738 L 979,272 C 979,219 986,179 1000,152 1014,125 1041,111 1080,111 1090,111 1100,112 1110,113 1120,114 1130,116 1139,118 L 1139,6 C 1116,1 1094,-3 1072,-6 1049,-9 1025,-10 1000,-10 966,-10 937,-5 913,4 888,13 868,26 853,45 838,63 826,86 818,113 810,140 805,171 803,207 L 797,207 C 778,172 757,141 734,113 711,85 684,61 653,42 622,22 588,7 549,-4 510,-15 465,-20 414,-20 Z M 455,115 C 512,115 563,126 606,147 649,168 684,194 713,227 741,260 762,295 776,334 790,373 797,410 797,445 L 797,534 600,530 C 556,529 514,526 475,521 435,515 400,504 370,487 340,470 316,447 299,417 281,387 272,348 272,299 272,240 288,195 320,163 351,131 396,115 455,115 Z"/>
   <glyph unicode="M" horiz-adv-x="1377" d="M 1366,0 L 1366,940 C 1366,974 1366,1009 1367,1044 1368,1079 1369,1112 1370,1141 1371,1175 1373,1208 1375,1240 1366,1206 1356,1172 1346,1139 1337,1110 1328,1080 1318,1048 1307,1015 1297,986 1287,960 L 923,0 789,0 420,960 C 416,970 412,982 408,995 403,1008 399,1023 394,1038 389,1053 384,1068 379,1084 374,1099 369,1115 364,1130 353,1165 342,1202 331,1240 332,1203 333,1166 334,1129 335,1098 336,1065 337,1031 338,996 338,966 338,940 L 338,0 168,0 168,1409 419,1409 794,432 C 799,419 804,402 811,381 818,360 824,338 830,316 836,294 842,273 847,254 852,234 855,219 857,208 859,219 863,234 868,254 873,274 880,295 887,317 894,339 900,360 907,381 914,402 920,419 925,432 L 1293,1409 1538,1409 1538,0 1366,0 Z"/>
   <glyph unicode="9" horiz-adv-x="980" d="M 1042,733 C 1042,608 1030,498 1007,404 983,309 949,231 905,168 861,105 808,58 745,27 682,-4 611,-20 532,-20 478,-20 429,-14 386,-4 343,8 304,25 270,48 236,71 207,102 183,139 159,176 140,221 125,274 L 297,301 C 316,240 345,196 385,168 424,139 474,125 535,125 584,125 628,137 669,160 709,183 743,217 772,263 800,309 822,367 838,436 854,505 863,587 864,680 850,649 831,621 807,596 782,571 755,551 724,534 693,517 659,504 623,495 587,486 551,481 514,481 450,481 392,493 341,516 289,539 245,571 209,612 173,653 145,703 126,762 106,820 96,885 96,956 96,1029 107,1094 128,1153 149,1212 179,1262 219,1303 259,1344 308,1375 367,1397 425,1419 491,1430 565,1430 722,1430 840,1372 921,1256 1002,1140 1042,966 1042,733 Z M 846,907 C 846,959 840,1008 828,1054 815,1100 797,1140 773,1174 748,1208 718,1235 683,1255 647,1274 606,1284 559,1284 516,1284 477,1276 442,1261 407,1246 378,1224 354,1196 330,1167 312,1133 299,1092 286,1051 279,1006 279,956 279,909 285,865 297,824 308,783 326,748 349,719 372,689 401,666 436,649 471,632 511,623 557,623 590,623 624,629 659,640 693,651 724,669 752,692 779,715 802,745 820,781 837,816 846,858 846,907 Z"/>
   <glyph unicode="8" horiz-adv-x="980" d="M 1050,393 C 1050,333 1041,278 1022,228 1003,177 974,134 935,97 896,60 846,32 785,11 724,-10 653,-20 570,-20 487,-20 416,-10 356,11 295,32 245,60 206,97 166,133 137,176 118,227 99,277 89,332 89,391 89,442 97,488 113,528 128,568 149,603 176,632 202,661 232,684 266,702 299,719 334,731 370,737 L 370,741 C 331,750 296,765 265,786 234,807 208,832 187,861 166,890 150,922 139,957 128,992 122,1030 122,1069 122,1118 132,1165 151,1209 170,1252 198,1291 235,1324 272,1357 319,1383 374,1402 429,1421 493,1430 566,1430 643,1430 709,1420 766,1401 822,1382 869,1356 906,1323 943,1290 970,1251 988,1207 1006,1163 1015,1116 1015,1067 1015,1028 1010,991 999,956 988,921 972,889 951,860 930,831 904,806 873,786 842,765 806,751 765,743 L 765,739 C 806,732 843,720 878,703 913,685 943,662 968,633 993,604 1013,569 1028,529 1043,489 1050,444 1050,393 Z M 828,1057 C 828,1092 824,1125 815,1154 806,1183 791,1209 770,1230 749,1251 722,1267 689,1279 656,1290 615,1296 566,1296 519,1296 479,1290 446,1279 413,1267 387,1251 366,1230 345,1209 329,1183 320,1154 311,1125 306,1092 306,1057 306,1029 310,1000 317,971 324,942 338,915 357,891 376,867 403,847 437,832 471,817 515,809 568,809 625,809 670,817 705,832 739,847 765,867 784,891 802,915 814,942 820,971 825,1000 828,1029 828,1057 Z M 863,410 C 863,444 858,477 849,509 840,540 824,568 801,593 778,617 748,637 710,652 671,667 623,674 566,674 513,674 469,667 432,652 395,637 365,617 342,592 319,567 302,539 291,507 280,474 275,441 275,406 275,363 280,323 291,288 302,252 319,221 342,196 365,170 396,150 434,136 472,122 518,115 572,115 627,115 673,122 710,136 747,150 777,170 800,196 823,221 839,252 849,289 858,325 863,365 863,410 Z"/>
   <glyph unicode="7" horiz-adv-x="954" d="M 1036,1263 C 965,1155 900,1051 841,952 782,852 731,752 688,651 645,550 612,446 589,340 565,233 553,120 553,0 L 365,0 C 365,113 378,223 405,332 432,440 468,546 513,651 558,755 611,857 671,958 731,1059 795,1158 862,1256 L 105,1256 105,1409 1036,1409 1036,1263 Z"/>
   <glyph unicode="6" horiz-adv-x="980" d="M 1049,461 C 1049,390 1039,326 1020,267 1000,208 971,157 933,115 894,72 847,39 790,16 733,-8 668,-20 594,-20 512,-20 440,-4 379,27 318,58 267,104 226,163 185,222 155,294 135,380 114,465 104,563 104,672 104,797 116,907 139,1002 162,1097 195,1176 238,1239 281,1302 334,1350 397,1382 459,1414 529,1430 608,1430 656,1430 701,1425 743,1415 785,1405 823,1389 858,1367 892,1344 922,1315 948,1278 974,1241 995,1196 1010,1143 L 838,1112 C 819,1173 790,1217 749,1244 708,1271 660,1284 606,1284 557,1284 512,1272 472,1249 432,1226 398,1191 370,1145 342,1098 321,1040 306,970 291,900 283,818 283,725 316,786 362,832 421,864 480,895 548,911 625,911 689,911 747,901 799,880 851,859 896,830 933,791 970,752 998,704 1019,649 1039,593 1049,530 1049,461 Z M 866,453 C 866,502 860,546 848,585 836,624 818,658 794,686 770,713 740,735 705,750 670,765 629,772 582,772 549,772 516,767 483,758 450,748 420,732 393,711 366,689 344,660 327,625 310,590 301,547 301,496 301,444 308,396 321,351 334,306 354,266 379,233 404,200 434,173 469,154 504,135 544,125 588,125 631,125 670,133 705,148 739,163 768,184 792,213 816,241 834,275 847,316 860,357 866,402 866,453 Z"/>
   <glyph unicode="5" horiz-adv-x="980" d="M 1053,459 C 1053,388 1042,324 1021,265 1000,206 968,156 926,114 884,71 832,38 770,15 707,-8 635,-20 553,-20 479,-20 415,-11 360,6 305,23 258,47 220,78 182,108 152,143 130,184 107,225 91,268 82,315 L 264,336 C 271,309 282,284 295,259 308,234 327,211 350,192 373,172 401,156 435,145 468,133 509,127 557,127 604,127 646,134 684,149 722,163 755,184 782,212 809,240 829,274 844,315 859,356 866,402 866,455 866,498 859,538 845,575 831,611 811,642 785,669 759,695 727,715 690,730 652,745 609,752 561,752 531,752 503,749 478,744 453,739 429,731 408,722 386,713 366,702 349,690 331,677 314,664 299,651 L 123,651 170,1409 971,1409 971,1256 334,1256 307,809 C 339,834 379,855 427,873 475,890 532,899 598,899 668,899 731,888 787,867 843,846 891,816 930,777 969,738 1000,691 1021,637 1042,583 1053,524 1053,459 Z"/>
   <glyph unicode="4" horiz-adv-x="1060" d="M 881,319 L 881,0 711,0 711,319 47,319 47,459 692,1409 881,1409 881,461 1079,461 1079,319 881,319 Z M 711,1206 C 710,1203 706,1196 701,1187 696,1177 690,1166 683,1154 676,1142 670,1130 663,1118 656,1105 649,1095 644,1087 L 283,555 C 280,550 275,543 269,534 262,525 256,517 249,508 242,499 236,490 229,481 222,472 217,466 213,461 L 711,461 711,1206 Z"/>
   <glyph unicode="3" horiz-adv-x="1006" d="M 1049,389 C 1049,324 1039,267 1018,216 997,165 966,123 926,88 885,53 835,26 776,8 716,-11 648,-20 571,-20 484,-20 410,-9 351,13 291,34 242,63 203,99 164,134 135,175 116,221 97,266 84,313 78,362 L 264,379 C 269,342 279,308 294,277 308,246 327,220 352,198 377,176 407,159 443,147 479,135 522,129 571,129 662,129 733,151 785,196 836,241 862,307 862,395 862,447 851,489 828,521 805,552 776,577 742,595 707,612 670,624 630,630 589,636 552,639 518,639 L 416,639 416,795 514,795 C 548,795 583,799 620,806 657,813 690,825 721,844 751,862 776,887 796,918 815,949 825,989 825,1038 825,1113 803,1173 759,1217 714,1260 648,1282 561,1282 482,1282 418,1262 369,1221 320,1180 291,1123 283,1049 L 102,1063 C 109,1125 126,1179 153,1225 180,1271 214,1309 255,1340 296,1370 342,1393 395,1408 448,1423 504,1430 563,1430 642,1430 709,1420 766,1401 823,1381 869,1354 905,1321 941,1287 968,1247 985,1202 1002,1157 1010,1108 1010,1057 1010,1016 1004,977 993,941 982,905 964,873 940,844 916,815 886,791 849,770 812,749 767,734 715,723 L 715,719 C 772,713 821,700 863,681 905,661 940,636 967,607 994,578 1015,544 1029,507 1042,470 1049,430 1049,389 Z"/>
   <glyph unicode="2" horiz-adv-x="954" d="M 103,0 L 103,127 C 137,205 179,274 228,334 277,393 328,447 382,496 436,544 490,589 543,630 596,671 643,713 686,754 729,795 763,839 790,884 816,929 829,981 829,1038 829,1078 823,1113 811,1144 799,1174 782,1199 759,1220 736,1241 709,1256 678,1267 646,1277 611,1282 572,1282 536,1282 502,1277 471,1267 439,1257 411,1242 386,1222 361,1202 341,1177 326,1148 310,1118 300,1083 295,1044 L 111,1061 C 117,1112 131,1159 153,1204 175,1249 205,1288 244,1322 283,1355 329,1382 384,1401 438,1420 501,1430 572,1430 642,1430 704,1422 759,1405 814,1388 860,1364 898,1331 935,1298 964,1258 984,1210 1004,1162 1014,1107 1014,1044 1014,997 1006,952 989,909 972,866 949,826 921,787 892,748 859,711 822,675 785,639 746,604 705,570 664,535 623,501 582,468 541,434 502,400 466,366 429,332 397,298 368,263 339,228 317,191 301,153 L 1036,153 1036,0 103,0 Z"/>
   <glyph unicode="1" horiz-adv-x="927" d="M 156,0 L 156,153 515,153 515,1237 197,1010 197,1180 530,1409 696,1409 696,153 1039,153 1039,0 156,0 Z"/>
   <glyph unicode="0" horiz-adv-x="980" d="M 1059,705 C 1059,570 1046,456 1021,364 995,271 960,197 916,140 871,83 819,42 759,17 699,-8 635,-20 567,-20 498,-20 434,-8 375,17 316,42 264,82 221,139 177,196 143,270 118,363 93,455 80,569 80,705 80,847 93,965 118,1058 143,1151 177,1225 221,1280 265,1335 317,1374 377,1397 437,1419 502,1430 573,1430 640,1430 704,1419 763,1397 822,1374 873,1335 917,1280 961,1225 996,1151 1021,1058 1046,965 1059,847 1059,705 Z M 876,705 C 876,817 869,910 856,985 843,1059 823,1118 797,1163 771,1207 739,1238 702,1257 664,1275 621,1284 573,1284 522,1284 478,1275 439,1256 400,1237 368,1206 342,1162 315,1117 295,1058 282,984 269,909 262,816 262,705 262,597 269,506 283,432 296,358 316,299 343,254 369,209 401,176 439,157 477,137 520,127 569,127 616,127 659,137 697,157 735,176 767,209 794,254 820,299 840,358 855,432 869,506 876,597 876,705 Z"/>
   <glyph unicode="-" horiz-adv-x="531" d="M 91,464 L 91,624 591,624 591,464 91,464 Z"/>
   <glyph unicode=" " horiz-adv-x="556"/>
  </font>
 </defs>
 <defs>
  <font id="EmbeddedFont_2" horiz-adv-x="2048">
   <font-face font-family="Liberation Serif embedded" units-per-em="2048" font-weight="normal" font-style="italic" ascent="1799" descent="423"/>
   <missing-glyph horiz-adv-x="2048" d="M 0,0 L 2047,0 2047,2047 0,2047 0,0 Z"/>
   <glyph unicode="n" horiz-adv-x="901" d="M 755,748 C 755,778 747,802 731,821 715,840 690,849 655,849 627,849 598,843 569,830 540,817 511,800 484,779 457,758 431,735 408,709 385,682 365,656 349,630 L 239,0 73,0 226,871 108,896 116,941 394,941 367,749 C 392,782 419,811 447,838 474,865 503,887 533,906 562,925 593,939 624,950 655,960 686,965 718,965 749,965 777,961 802,953 827,945 848,932 866,915 883,898 897,876 907,849 916,822 921,791 921,754 921,746 920,735 919,722 917,708 915,693 912,677 909,661 907,645 904,628 901,611 899,595 896,580 L 808,69 939,45 931,0 630,0 732,582 C 735,597 737,612 740,628 743,644 745,660 748,675 750,690 752,704 753,717 754,730 755,740 755,748 Z"/>
  </font>
 </defs>
 <defs class="TextShapeIndex">
  <g ooo:slide="id1" ooo:id-list="id3 id4"/>
 </defs>
 <defs class="EmbeddedBulletChars">
  <g id="bullet-char-template(57356)" transform="scale(0.00048828125,-0.00048828125)">
   <path d="M 580,1141 L 1163,571 580,0 -4,571 580,1141 Z"/>
  </g>
  <g id="bullet-char-template(57354)" transform="scale(0.00048828125,-0.00048828125)">
   <path d="M 8,1128 L 1137,1128 1137,0 8,0 8,1128 Z"/>
  </g>
  <g id="bullet-char-template(10146)" transform="scale(0.00048828125,-0.00048828125)">
   <path d="M 174,0 L 602,739 174,1481 1456,739 174,0 Z M 1358,739 L 309,1346 659,739 1358,739 Z"/>
  </g>
  <g id="bullet-char-template(10132)" transform="scale(0.00048828125,-0.00048828125)">
   <path d="M 2015,739 L 1276,0 717,0 1260,543 174,543 174,936 1260,936 717,1481 1274,1481 2015,739 Z"/>
  </g>
  <g id="bullet-char-template(10007)" transform="scale(0.00048828125,-0.00048828125)">
   <path d="M 0,-2 C -7,14 -16,27 -25,37 L 356,567 C 262,823 215,952 215,954 215,979 228,992 255,992 264,992 276,990 289,987 310,991 331,999 354,1012 L 381,999 492,748 772,1049 836,1024 860,1049 C 881,1039 901,1025 922,1006 886,937 835,863 770,784 769,783 710,716 594,584 L 774,223 C 774,196 753,168 711,139 L 727,119 C 717,90 699,76 672,76 641,76 570,178 457,381 L 164,-76 C 142,-110 111,-127 72,-127 30,-127 9,-110 8,-76 1,-67 -2,-52 -2,-32 -2,-23 -1,-13 0,-2 Z"/>
  </g>
  <g id="bullet-char-template(10004)" transform="scale(0.00048828125,-0.00048828125)">
   <path d="M 285,-33 C 182,-33 111,30 74,156 52,228 41,333 41,471 41,549 55,616 82,672 116,743 169,778 240,778 293,778 328,747 346,684 L 369,508 C 377,444 397,411 428,410 L 1163,1116 C 1174,1127 1196,1133 1229,1133 1271,1133 1292,1118 1292,1087 L 1292,965 C 1292,929 1282,901 1262,881 L 442,47 C 390,-6 338,-33 285,-33 Z"/>
  </g>
  <g id="bullet-char-template(9679)" transform="scale(0.00048828125,-0.00048828125)">
   <path d="M 813,0 C 632,0 489,54 383,161 276,268 223,411 223,592 223,773 276,916 383,1023 489,1130 632,1184 813,1184 992,1184 1136,1130 1245,1023 1353,916 1407,772 1407,592 1407,412 1353,268 1245,161 1136,54 992,0 813,0 Z"/>
  </g>
  <g id="bullet-char-template(8226)" transform="scale(0.00048828125,-0.00048828125)">
   <path d="M 346,457 C 273,457 209,483 155,535 101,586 74,649 74,723 74,796 101,859 155,911 209,963 273,989 346,989 419,989 480,963 531,910 582,859 608,796 608,723 608,648 583,586 532,535 482,483 420,457 346,457 Z"/>
  </g>
  <g id="bullet-char-template(8211)" transform="scale(0.00048828125,-0.00048828125)">
   <path d="M -4,459 L 1135,459 1135,606 -4,606 -4,459 Z"/>
  </g>
  <g id="bullet-char-template(61548)" transform="scale(0.00048828125,-0.00048828125)">
   <path d="M 173,740 C 173,903 231,1043 346,1159 462,1274 601,1332 765,1332 928,1332 1067,1274 1183,1159 1299,1043 1357,903 1357,740 1357,577 1299,437 1183,322 1067,206 928,148 765,148 601,148 462,206 346,322 231,437 173,577 173,740 Z"/>
  </g>
 </defs>
 <defs class="TextEmbeddedBitmaps"/>
 <g class="SlideGroup">
  <g>
   <g id="container-id1">
    <g id="id1" class="Slide" clip-path="url(#presentation_clip_path)">
     <g class="Page">
      <g class="OLE2">
       <g id="id3">
        <rect class="BoundingBox" stroke="none" fill="none" x="1000" y="9973" width="10775" height="7855"/>
        <defs>
         <clipPath id="clip_path_1" clipPathUnits="userSpaceOnUse">
          <path d="M 1005,9975 L 11774,9975 11774,17833 1005,17833 1005,9975 Z"/>
         </clipPath>
        </defs>
        <g clip-path="url(#clip_path_1)"/>
        <defs>
         <clipPath id="clip_path_2" clipPathUnits="userSpaceOnUse">
          <path d="M 1005,9975 L 11774,9975 11774,17833 1005,17833 1005,9975 Z"/>
         </clipPath>
        </defs>
        <g clip-path="url(#clip_path_2)">
         <path fill="rgb(255,255,255)" stroke="none" d="M 6388,17828 L 1000,17828 1000,9973 11775,9973 11775,17828 6388,17828 Z"/>
         <path fill="none" stroke="rgb(179,179,179)" d="M 6893,17077 L 2412,17077 2412,10303 11373,10303 11373,17077 6893,17077 Z"/>
         <path fill="none" stroke="rgb(179,179,179)" d="M 11373,17076 L 2412,17076"/>
         <path fill="none" stroke="rgb(179,179,179)" d="M 11373,16323 L 2412,16323"/>
         <path fill="none" stroke="rgb(179,179,179)" d="M 11373,15570 L 2412,15570"/>
         <path fill="none" stroke="rgb(179,179,179)" d="M 11373,14818 L 2412,14818"/>
         <path fill="none" stroke="rgb(179,179,179)" d="M 11373,14065 L 2412,14065"/>
         <path fill="none" stroke="rgb(179,179,179)" d="M 11373,13312 L 2412,13312"/>
         <path fill="none" stroke="rgb(179,179,179)" d="M 11373,12560 L 2412,12560"/>
         <path fill="none" stroke="rgb(179,179,179)" d="M 11373,11807 L 2412,11807"/>
         <path fill="none" stroke="rgb(179,179,179)" d="M 11373,11054 L 2412,11054"/>
         <path fill="none" stroke="rgb(179,179,179)" d="M 11373,10302 L 2412,10302"/>
         <path fill="none" stroke="rgb(179,179,179)" d="M 2412,17226 L 2412,17076"/>
         <path fill="none" stroke="rgb(179,179,179)" d="M 2412,17226 L 2412,17076"/>
         <path fill="none" stroke="rgb(179,179,179)" d="M 3308,17226 L 3308,17076"/>
         <path fill="none" stroke="rgb(179,179,179)" d="M 3308,17226 L 3308,17076"/>
         <path fill="none" stroke="rgb(179,179,179)" d="M 4204,17226 L 4204,17076"/>
         <path fill="none" stroke="rgb(179,179,179)" d="M 4204,17226 L 4204,17076"/>
         <path fill="none" stroke="rgb(179,179,179)" d="M 5100,17226 L 5100,17076"/>
         <path fill="none" stroke="rgb(179,179,179)" d="M 5100,17226 L 5100,17076"/>
         <path fill="none" stroke="rgb(179,179,179)" d="M 5996,17226 L 5996,17076"/>
         <path fill="none" stroke="rgb(179,179,179)" d="M 5996,17226 L 5996,17076"/>
         <path fill="none" stroke="rgb(179,179,179)" d="M 6892,17226 L 6892,17076"/>
         <path fill="none" stroke="rgb(179,179,179)" d="M 6892,17226 L 6892,17076"/>
         <path fill="none" stroke="rgb(179,179,179)" d="M 7788,17226 L 7788,17076"/>
         <path fill="none" stroke="rgb(179,179,179)" d="M 7788,17226 L 7788,17076"/>
         <path fill="none" stroke="rgb(179,179,179)" d="M 8684,17226 L 8684,17076"/>
         <path fill="none" stroke="rgb(179,179,179)" d="M 8684,17226 L 8684,17076"/>
         <path fill="none" stroke="rgb(179,179,179)" d="M 9580,17226 L 9580,17076"/>
         <path fill="none" stroke="rgb(179,179,179)" d="M 9580,17226 L 9580,17076"/>
         <path fill="none" stroke="rgb(179,179,179)" d="M 10476,17226 L 10476,17076"/>
         <path fill="none" stroke="rgb(179,179,179)" d="M 10476,17226 L 10476,17076"/>
         <path fill="none" stroke="rgb(179,179,179)" d="M 11373,17226 L 11373,17076"/>
         <path fill="none" stroke="rgb(179,179,179)" d="M 11373,17226 L 11373,17076"/>
         <path fill="none" stroke="rgb(179,179,179)" d="M 2412,17076 L 11373,17076"/>
         <path fill="none" stroke="rgb(179,179,179)" d="M 6742,17076 L 6892,17076"/>
         <path fill="none" stroke="rgb(179,179,179)" d="M 6742,17076 L 6892,17076"/>
         <path fill="none" stroke="rgb(179,179,179)" d="M 6742,16323 L 6892,16323"/>
         <path fill="none" stroke="rgb(179,179,179)" d="M 6742,16323 L 6892,16323"/>
         <path fill="none" stroke="rgb(179,179,179)" d="M 6742,15570 L 6892,15570"/>
         <path fill="none" stroke="rgb(179,179,179)" d="M 6742,15570 L 6892,15570"/>
         <path fill="none" stroke="rgb(179,179,179)" d="M 6742,14818 L 6892,14818"/>
         <path fill="none" stroke="rgb(179,179,179)" d="M 6742,14818 L 6892,14818"/>
         <path fill="none" stroke="rgb(179,179,179)" d="M 6742,14065 L 6892,14065"/>
         <path fill="none" stroke="rgb(179,179,179)" d="M 6742,14065 L 6892,14065"/>
         <path fill="none" stroke="rgb(179,179,179)" d="M 6742,13312 L 6892,13312"/>
         <path fill="none" stroke="rgb(179,179,179)" d="M 6742,13312 L 6892,13312"/>
         <path fill="none" stroke="rgb(179,179,179)" d="M 6742,12560 L 6892,12560"/>
         <path fill="none" stroke="rgb(179,179,179)" d="M 6742,12560 L 6892,12560"/>
         <path fill="none" stroke="rgb(179,179,179)" d="M 6742,11807 L 6892,11807"/>
         <path fill="none" stroke="rgb(179,179,179)" d="M 6742,11807 L 6892,11807"/>
         <path fill="none" stroke="rgb(179,179,179)" d="M 6742,11054 L 6892,11054"/>
         <path fill="none" stroke="rgb(179,179,179)" d="M 6742,11054 L 6892,11054"/>
         <path fill="none" stroke="rgb(179,179,179)" d="M 6742,10302 L 6892,10302"/>
         <path fill="none" stroke="rgb(179,179,179)" d="M 6742,10302 L 6892,10302"/>
         <path fill="none" stroke="rgb(179,179,179)" d="M 6892,17076 L 6892,10302"/>
         <path fill="none" stroke="rgb(0,0,168)" stroke-width="80" stroke-linejoin="round" d="M 2412,17068 L 2501,17060 2591,17068 2680,17068 2770,17068 2860,17060 2949,17068 3039,17060 3128,17068 3218,17060 3308,17068 3397,17060 3487,17068 3576,17060 3666,17068 3756,17060 3845,17053 3935,17068 4024,17068 4114,17060 4204,17060 4293,17060 4383,17068 4473,17060 4562,17060 4652,17053 4741,17053 4831,17053 4921,17053 5010,17060 5100,17053 5189,17053 5279,17053 5369,17023 5458,17015 5548,17030 5637,17038 5727,17030 5817,16993 5906,16985 5996,16940 6086,16985 6175,16963 6265,16857 6354,16887 6444,16737 6534,16827 6623,16534 6713,15374 6802,13342 6892,11017 6982,13342 7071,15405 7161,15916 7250,16594 7340,16774 7430,16887 7519,16857 7609,16978 7698,16985 7788,16940 7878,16985 7967,16993 8057,17030 8147,17038 8236,17023 8326,17015 8415,17023 8505,17053 8595,17053 8684,17060 8774,17060 8863,17053 8953,17053 9043,17053 9132,17053 9222,17060 9311,17060 9401,17068 9491,17060 9580,17060 9670,17060 9760,17068 9849,17068 9939,17053 10028,17060 10118,17068 10208,17060 10297,17068 10387,17060 10476,17060 10566,17068 10656,17068 10745,17060 10835,17068 10924,17068 11014,17068 11104,17060 11193,17068 11283,17060 11373,17068"/>
         <text class="TextShape"><tspan class="TextParagraph" font-family="Liberation Sans, sans-serif" font-size="353px" font-weight="400"><tspan class="TextPosition" x="2175" y="17617"><tspan fill="rgb(0,0,0)" stroke="none">-50</tspan></tspan></tspan></text>
         <text class="TextShape"><tspan class="TextParagraph" font-family="Liberation Sans, sans-serif" font-size="353px" font-weight="400"><tspan class="TextPosition" x="3071" y="17617"><tspan fill="rgb(0,0,0)" stroke="none">-40</tspan></tspan></tspan></text>
         <text class="TextShape"><tspan class="TextParagraph" font-family="Liberation Sans, sans-serif" font-size="353px" font-weight="400"><tspan class="TextPosition" x="3967" y="17617"><tspan fill="rgb(0,0,0)" stroke="none">-30</tspan></tspan></tspan></text>
         <text class="TextShape"><tspan class="TextParagraph" font-family="Liberation Sans, sans-serif" font-size="353px" font-weight="400"><tspan class="TextPosition" x="4863" y="17617"><tspan fill="rgb(0,0,0)" stroke="none">-20</tspan></tspan></tspan></text>
         <text class="TextShape"><tspan class="TextParagraph" font-family="Liberation Sans, sans-serif" font-size="353px" font-weight="400"><tspan class="TextPosition" x="5759" y="17617"><tspan fill="rgb(0,0,0)" stroke="none">-10</tspan></tspan></tspan></text>
         <text class="TextShape"><tspan class="TextParagraph" font-family="Liberation Sans, sans-serif" font-size="353px" font-weight="400"><tspan class="TextPosition" x="6800" y="17617"><tspan fill="rgb(0,0,0)" stroke="none">0</tspan></tspan></tspan></text>
         <text class="TextShape"><tspan class="TextParagraph" font-family="Liberation Sans, sans-serif" font-size="353px" font-weight="400"><tspan class="TextPosition" x="7604" y="17617"><tspan fill="rgb(0,0,0)" stroke="none">10</tspan></tspan></tspan></text>
         <text class="TextShape"><tspan class="TextParagraph" font-family="Liberation Sans, sans-serif" font-size="353px" font-weight="400"><tspan class="TextPosition" x="8500" y="17617"><tspan fill="rgb(0,0,0)" stroke="none">20</tspan></tspan></tspan></text>
         <text class="TextShape"><tspan class="TextParagraph" font-family="Liberation Sans, sans-serif" font-size="353px" font-weight="400"><tspan class="TextPosition" x="9396" y="17617"><tspan fill="rgb(0,0,0)" stroke="none">30</tspan></tspan></tspan></text>
         <text class="TextShape"><tspan class="TextParagraph" font-family="Liberation Sans, sans-serif" font-size="353px" font-weight="400"><tspan class="TextPosition" x="10292" y="17617"><tspan fill="rgb(0,0,0)" stroke="none">40</tspan></tspan></tspan></text>
         <text class="TextShape"><tspan class="TextParagraph" font-family="Liberation Sans, sans-serif" font-size="353px" font-weight="400"><tspan class="TextPosition" x="11189" y="17617"><tspan fill="rgb(0,0,0)" stroke="none">50</tspan></tspan></tspan></text>
         <text class="TextShape"><tspan class="TextParagraph" font-family="Liberation Sans, sans-serif" font-size="353px" font-weight="400"><tspan class="TextPosition" x="6457" y="17196"><tspan fill="rgb(0,0,0)" stroke="none">0</tspan></tspan></tspan></text>
         <text class="TextShape"><tspan class="TextParagraph" font-family="Liberation Sans, sans-serif" font-size="353px" font-weight="400"><tspan class="TextPosition" x="6086" y="16443"><tspan fill="rgb(0,0,0)" stroke="none">100</tspan></tspan></tspan></text>
         <text class="TextShape"><tspan class="TextParagraph" font-family="Liberation Sans, sans-serif" font-size="353px" font-weight="400"><tspan class="TextPosition" x="6086" y="15690"><tspan fill="rgb(0,0,0)" stroke="none">200</tspan></tspan></tspan></text>
         <text class="TextShape"><tspan class="TextParagraph" font-family="Liberation Sans, sans-serif" font-size="353px" font-weight="400"><tspan class="TextPosition" x="6086" y="14938"><tspan fill="rgb(0,0,0)" stroke="none">300</tspan></tspan></tspan></text>
         <text class="TextShape"><tspan class="TextParagraph" font-family="Liberation Sans, sans-serif" font-size="353px" font-weight="400"><tspan class="TextPosition" x="6086" y="14185"><tspan fill="rgb(0,0,0)" stroke="none">400</tspan></tspan></tspan></text>
         <text class="TextShape"><tspan class="TextParagraph" font-family="Liberation Sans, sans-serif" font-size="353px" font-weight="400"><tspan class="TextPosition" x="6086" y="13432"><tspan fill="rgb(0,0,0)" stroke="none">500</tspan></tspan></tspan></text>
         <text class="TextShape"><tspan class="TextParagraph" font-family="Liberation Sans, sans-serif" font-size="353px" font-weight="400"><tspan class="TextPosition" x="6086" y="12680"><tspan fill="rgb(0,0,0)" stroke="none">600</tspan></tspan></tspan></text>
         <text class="TextShape"><tspan class="TextParagraph" font-family="Liberation Sans, sans-serif" font-size="353px" font-weight="400"><tspan class="TextPosition" x="6086" y="11927"><tspan fill="rgb(0,0,0)" stroke="none">700</tspan></tspan></tspan></text>
         <text class="TextShape"><tspan class="TextParagraph" font-family="Liberation Sans, sans-serif" font-size="353px" font-weight="400"><tspan class="TextPosition" x="6086" y="11174"><tspan fill="rgb(0,0,0)" stroke="none">800</tspan></tspan></tspan></text>
         <text class="TextShape"><tspan class="TextParagraph" font-family="Liberation Sans, sans-serif" font-size="353px" font-weight="400"><tspan class="TextPosition" x="6086" y="10422"><tspan fill="rgb(0,0,0)" stroke="none">900</tspan></tspan></tspan></text>
         <text class="TextShape" transform="translate(1812,15303) rotate(-90) translate(-1812,-15303)"><tspan class="TextParagraph" font-family="Liberation Sans, sans-serif" font-size="318px" font-weight="400"><tspan class="TextPosition" x="1812" y="15303"><tspan fill="rgb(0,0,0)" stroke="none">Maximum deviation</tspan></tspan></tspan></text>
        </g>
        <g clip-path="url(#clip_path_1)"/>
        <defs>
         <clipPath id="clip_path_3" clipPathUnits="userSpaceOnUse">
          <path d="M 1005,9975 L 11774,9975 11774,17833 1005,17833 1005,9975 Z"/>
         </clipPath>
        </defs>
        <g clip-path="url(#clip_path_3)"/>
        <g clip-path="url(#clip_path_1)"/>
       </g>
      </g>
      <g class="OLE2">
       <g id="id4">
        <rect class="BoundingBox" stroke="none" fill="none" x="6659" y="17712" width="425" height="467"/>
        <defs>
         <clipPath id="clip_path_4" clipPathUnits="userSpaceOnUse">
          <path d="M 6668,17701 L 7091,17701 7091,18177 6668,18177 6668,17701 Z"/>
         </clipPath>
        </defs>
        <g clip-path="url(#clip_path_4)">
         <text class="TextShape"><tspan class="TextParagraph" font-family="Liberation Serif, serif" font-size="422px" font-style="italic" font-weight="400"><tspan class="TextPosition" x="6765" y="18082"><tspan fill="rgb(0,0,0)" stroke="none">n</tspan></tspan></tspan></text>
        </g>
       </g>
      </g>
     </g>
    </g>
   </g>
  </g>
 </g>
</svg>