<?xml version="1.0" encoding="UTF-8" standalone="no"?>
<!DOCTYPE svg PUBLIC "-//W3C//DTD SVG 1.1//EN" "http://www.w3.org/Graphics/SVG/1.1/DTD/svg11.dtd">
<!-- Generated by Microsoft Visio, SVG Export Symmetric_FIR.svg Page-1 -->
<svg xmlns="http://www.w3.org/2000/svg" xmlns:xlink="http://www.w3.org/1999/xlink" xmlns:ev="http://www.w3.org/2001/xml-events"
		width="10.8684in" height="6.85654in" viewBox="0 0 782.528 493.671" xml:space="preserve" color-interpolation-filters="sRGB"
		class="st12">
	<style type="text/css">
	<![CDATA[
		.st1 {fill:#ffffff;stroke:none;stroke-width:1.5}
		.st2 {fill:#000000;font-family:Calibri;font-size:1.16666em}
		.st3 {fill:#ffffff;stroke:#000000;stroke-width:1.5}
		.st4 {fill:#000000;font-family:Calibri;font-size:1.99999em}
		.st5 {baseline-shift:32.4951%;font-size:0.649901em}
		.st6 {stroke:#000000;stroke-linecap:round;stroke-linejoin:round;stroke-width:1.5}
		.st7 {marker-end:url(#mrkr4-53);stroke:#000000;stroke-linecap:round;stroke-linejoin:round;stroke-width:1.5}
		.st8 {fill:#000000;fill-opacity:1;stroke:#000000;stroke-opacity:1;stroke-width:0.37313432835821}
		.st9 {visibility:visible}
		.st10 {fill:none;filter:url(#filter_2);stroke:#5b9bd5;stroke-dasharray:10.5,7.5,0.01,7.5;stroke-opacity:0.22}
		.st11 {fill:none;stroke:#000000;stroke-dasharray:10.5,7.5,0.01,7.5;stroke-width:1.5}
		.st12 {fill:none;fill-rule:evenodd;font-size:12px;overflow:visible;stroke-linecap:square;stroke-miterlimit:3}
	]]>
	</style>

	<defs id="Markers">
		<g id="lend4">
			<path d="M 2 1 L 0 0 L 2 -1 L 2 1 " style="stroke:none"/>
		</g>
		<marker id="mrkr4-53" class="st8" refX="-5.36" orient="auto" markerUnits="strokeWidth" overflow="visible">
			<use xlink:href="#lend4" transform="scale(-2.68,-2.68) "/>
		</marker>
	</defs>
	<defs id="Filters">
		<filter id="filter_2">
			<feGaussianBlur stdDeviation="2"/>
		</filter>
	</defs>
	<g>
		<title>Page-1</title>
		<g id="group138-1" transform="translate(1.5,-1.5)">
			<title>Sheet.138</title>
			<g id="shape59-2" transform="translate(-6.59472E-014,-356.7)">
				<title>Rectangle.59</title>
				<desc>x(n)</desc>
				<rect x="0" y="446.899" width="31.8898" height="46.7717" class="st1"/>
				<text x="5.98" y="474.49" class="st2">x(n)</text>			</g>
			<g id="shape25-5" transform="translate(146.693,-356.7)">
				<title>Rectangle.25</title>
				<desc>Z-1</desc>
				<rect x="0" y="446.899" width="46.7717" height="46.7717" class="st3"/>
				<text x="11.43" y="477.49" class="st4">Z<tspan dy="-0.234em" class="st5">-</tspan><tspan class="st5">1</tspan></text>			</g>
			<g id="group26-10" transform="translate(70.8661,-289.155)">
				<title>Sheet.26</title>
				<g id="shape27-11">
					<title>Circle</title>
					<path d="M0 470.29 A23.3858 23.3858 0 0 1 46.77 470.29 A23.3858 23.3858 0 1 1 0 470.29 Z" class="st3"/>
				</g>
				<g id="shape28-13" transform="translate(517.057,446.899) rotate(90)">
					<title>Sheet.28</title>
					<path d="M0 493.67 L46.77 493.67" class="st6"/>
				</g>
				<g id="shape29-16" transform="translate(0,-23.3858)">
					<title>Sheet.29</title>
					<path d="M0 493.67 L46.77 493.67" class="st6"/>
				</g>
			</g>
			<g id="group30-19" transform="translate(70.8661,-186.621)">
				<title>Sheet.30</title>
				<g id="shape31-20">
					<title>Circle</title>
					<path d="M0 470.29 A23.3858 23.3858 0 0 1 46.77 470.29 A23.3858 23.3858 0 1 1 0 470.29 Z" class="st3"/>
				</g>
				<g id="shape32-22" transform="translate(-342.231,137.745) rotate(-45)">
					<title>Sheet.32</title>
					<path d="M0 493.67 L46.78 493.67" class="st6"/>
				</g>
				<g id="shape33-25" transform="translate(-309.154,835.902) rotate(-135)">
					<title>Sheet.33</title>
					<path d="M0 493.67 L46.78 493.67" class="st6"/>
				</g>
			</g>
			<g id="group34-28" transform="translate(70.8661,-84.0876)">
				<title>Sheet.34</title>
				<g id="shape35-29">
					<title>Circle</title>
					<path d="M0 470.29 A23.3858 23.3858 0 0 1 46.77 470.29 A23.3858 23.3858 0 1 1 0 470.29 Z" class="st3"/>
				</g>
				<g id="shape36-31" transform="translate(517.057,446.899) rotate(90)">
					<title>Sheet.36</title>
					<path d="M0 493.67 L46.77 493.67" class="st6"/>
				</g>
				<g id="shape37-34" transform="translate(0,-23.3858)">
					<title>Sheet.37</title>
					<path d="M0 493.67 L46.77 493.67" class="st6"/>
				</g>
			</g>
			<g id="shape52-37" transform="translate(146.693,-429.449)">
				<title>Rectangle.52</title>
				<desc>Z-1</desc>
				<rect x="0" y="446.899" width="46.7717" height="46.7717" class="st3"/>
				<text x="11.43" y="477.49" class="st4">Z<tspan dy="-0.234em" class="st5">-</tspan><tspan class="st5">1</tspan></text>			</g>
			<g id="shape53-42" transform="translate(146.693,-452.835)">
				<title>Dynamic connector.53</title>
				<path d="M0 493.67 L-86.46 493.67 L-86.46 633.97 L-75.83 633.97" class="st6"/>
			</g>
			<g id="shape54-45" transform="translate(117.638,-312.54)">
				<title>Dynamic connector.54</title>
				<path d="M0 493.67 L10.63 493.67 L10.63 426.13 L29.06 426.13" class="st6"/>
			</g>
			<g id="shape55-48" transform="translate(87.1654,-289.155)">
				<title>Dynamic connector.55</title>
				<path d="M7.09 493.67 L7.09 541.39" class="st7"/>
			</g>
			<g id="shape56-54" transform="translate(87.1654,-186.621)">
				<title>Dynamic connector.56</title>
				<path d="M7.09 493.67 L7.09 541.39" class="st7"/>
			</g>
			<g id="shape57-59" transform="translate(17.7165,-186.621)">
				<title>Rectangle.57</title>
				<desc>h(0)</desc>
				<rect x="0" y="446.899" width="31.8898" height="46.7717" class="st1"/>
				<text x="4.95" y="474.49" class="st2">h(0)</text>			</g>
			<g id="shape58-62" transform="translate(49.6063,-202.92)">
				<title>Dynamic connector.58</title>
				<path d="M0 486.58 L13.22 486.58" class="st7"/>
			</g>
			<g id="shape61-67" transform="translate(31.8898,-372.999)">
				<title>Dynamic connector.61</title>
				<path d="M0 486.58 L25.98 486.58 A2.3622 2.3622 0 1 1 30.71 486.58 L106.76 486.58" class="st7"/>
			</g>
			<g id="shape64-72" transform="translate(364.252,-356.7)">
				<title>Rectangle.64</title>
				<desc>Z-1</desc>
				<rect x="0" y="446.899" width="46.7717" height="46.7717" class="st3"/>
				<text x="11.43" y="477.49" class="st4">Z<tspan dy="-0.234em" class="st5">-</tspan><tspan class="st5">1</tspan></text>			</g>
			<g id="group65-77" transform="translate(288.425,-289.155)">
				<title>Sheet.65</title>
				<g id="shape66-78">
					<title>Circle</title>
					<path d="M0 470.29 A23.3858 23.3858 0 0 1 46.77 470.29 A23.3858 23.3858 0 1 1 0 470.29 Z" class="st3"/>
				</g>
				<g id="shape67-80" transform="translate(517.057,446.899) rotate(90)">
					<title>Sheet.67</title>
					<path d="M0 493.67 L46.77 493.67" class="st6"/>
				</g>
				<g id="shape68-83" transform="translate(0,-23.3858)">
					<title>Sheet.68</title>
					<path d="M0 493.67 L46.77 493.67" class="st6"/>
				</g>
			</g>
			<g id="group69-86" transform="translate(288.425,-186.621)">
				<title>Sheet.69</title>
				<g id="shape70-87">
					<title>Circle</title>
					<path d="M0 470.29 A23.3858 23.3858 0 0 1 46.77 470.29 A23.3858 23.3858 0 1 1 0 470.29 Z" class="st3"/>
				</g>
				<g id="shape71-89" transform="translate(-342.231,137.745) rotate(-45)">
					<title>Sheet.71</title>
					<path d="M0 493.67 L46.78 493.67" class="st6"/>
				</g>
				<g id="shape72-92" transform="translate(-309.154,835.902) rotate(-135)">
					<title>Sheet.72</title>
					<path d="M0 493.67 L46.78 493.67" class="st6"/>
				</g>
			</g>
			<g id="group73-95" transform="translate(288.425,-84.0876)">
				<title>Sheet.73</title>
				<g id="shape74-96">
					<title>Circle</title>
					<path d="M0 470.29 A23.3858 23.3858 0 0 1 46.77 470.29 A23.3858 23.3858 0 1 1 0 470.29 Z" class="st3"/>
				</g>
				<g id="shape75-98" transform="translate(517.057,446.899) rotate(90)">
					<title>Sheet.75</title>
					<path d="M0 493.67 L46.77 493.67" class="st6"/>
				</g>
				<g id="shape76-101" transform="translate(0,-23.3858)">
					<title>Sheet.76</title>
					<path d="M0 493.67 L46.77 493.67" class="st6"/>
				</g>
			</g>
			<g id="shape77-104" transform="translate(364.252,-429.449)">
				<title>Rectangle.77</title>
				<desc>Z-1</desc>
				<rect x="0" y="446.899" width="46.7717" height="46.7717" class="st3"/>
				<text x="11.43" y="477.49" class="st4">Z<tspan dy="-0.234em" class="st5">-</tspan><tspan class="st5">1</tspan></text>			</g>
			<g id="shape78-109" transform="translate(364.252,-452.835)">
				<title>Dynamic connector</title>
				<path d="M0 493.67 L-86.46 493.67 L-86.46 633.97 L-75.83 633.97" class="st6"/>
			</g>
			<g id="shape79-112" transform="translate(335.197,-312.54)">
				<title>Dynamic connector.79</title>
				<path d="M0 493.67 L10.63 493.67 L10.63 426.13 L29.06 426.13" class="st6"/>
			</g>
			<g id="shape80-115" transform="translate(304.724,-289.155)">
				<title>Dynamic connector.80</title>
				<path d="M7.09 493.67 L7.09 541.39" class="st7"/>
			</g>
			<g id="shape81-120" transform="translate(304.724,-186.621)">
				<title>Dynamic connector.81</title>
				<path d="M7.09 493.67 L7.09 541.39" class="st7"/>
			</g>
			<g id="shape82-125" transform="translate(237.402,-186.621)">
				<title>Rectangle.82</title>
				<desc>h(1)</desc>
				<rect x="0" y="446.899" width="31.8898" height="46.7717" class="st1"/>
				<text x="4.95" y="474.49" class="st2">h(1)</text>			</g>
			<g id="shape83-128" transform="translate(267.165,-202.92)">
				<title>Dynamic connector.83</title>
				<path d="M0 486.58 L13.22 486.58" class="st7"/>
			</g>
			<g id="shape84-133" transform="translate(193.465,-372.999)">
				<title>Dynamic connector.84</title>
				<path d="M0 486.58 L81.97 486.58 A2.3622 2.3622 0 0 1 86.69 486.58 L162.75 486.58" class="st7"/>
			</g>
			<g id="shape86-138" transform="translate(557.423,-356.7)">
				<title>Rectangle.86</title>
				<desc>Z-1</desc>
				<rect x="0" y="446.899" width="46.7717" height="46.7717" class="st3"/>
				<text x="11.43" y="477.49" class="st4">Z<tspan dy="-0.234em" class="st5">-</tspan><tspan class="st5">1</tspan></text>			</g>
			<g id="group87-143" transform="translate(481.596,-289.155)">
				<title>Sheet.87</title>
				<g id="shape88-144">
					<title>Circle</title>
					<path d="M0 470.29 A23.3858 23.3858 0 0 1 46.77 470.29 A23.3858 23.3858 0 1 1 0 470.29 Z" class="st3"/>
				</g>
				<g id="shape89-146" transform="translate(517.057,446.899) rotate(90)">
					<title>Sheet.89</title>
					<path d="M0 493.67 L46.77 493.67" class="st6"/>
				</g>
				<g id="shape90-149" transform="translate(0,-23.3858)">
					<title>Sheet.90</title>
					<path d="M0 493.67 L46.77 493.67" class="st6"/>
				</g>
			</g>
			<g id="group91-152" transform="translate(481.596,-186.621)">
				<title>Sheet.91</title>
				<g id="shape92-153">
					<title>Circle</title>
					<path d="M0 470.29 A23.3858 23.3858 0 0 1 46.77 470.29 A23.3858 23.3858 0 1 1 0 470.29 Z" class="st3"/>
				</g>
				<g id="shape93-155" transform="translate(-342.231,137.745) rotate(-45)">
					<title>Sheet.93</title>
					<path d="M0 493.67 L46.78 493.67" class="st6"/>
				</g>
				<g id="shape94-158" transform="translate(-309.154,835.902) rotate(-135)">
					<title>Sheet.94</title>
					<path d="M0 493.67 L46.78 493.67" class="st6"/>
				</g>
			</g>
			<g id="group95-161" transform="translate(481.596,-84.0876)">
				<title>Sheet.95</title>
				<g id="shape96-162">
					<title>Circle</title>
					<path d="M0 470.29 A23.3858 23.3858 0 0 1 46.77 470.29 A23.3858 23.3858 0 1 1 0 470.29 Z" class="st3"/>
				</g>
				<g id="shape97-164" transform="translate(517.057,446.899) rotate(90)">
					<title>Sheet.97</title>
					<path d="M0 493.67 L46.77 493.67" class="st6"/>
				</g>
				<g id="shape98-167" transform="translate(0,-23.3858)">
					<title>Sheet.98</title>
					<path d="M0 493.67 L46.77 493.67" class="st6"/>
				</g>
			</g>
			<g id="shape99-170" transform="translate(557.423,-429.449)">
				<title>Rectangle.99</title>
				<desc>Z-1</desc>
				<rect x="0" y="446.899" width="46.7717" height="46.7717" class="st3"/>
				<text x="11.43" y="477.49" class="st4">Z<tspan dy="-0.234em" class="st5">-</tspan><tspan class="st5">1</tspan></text>			</g>
			<g id="shape100-175" transform="translate(557.423,-452.835)">
				<title>Dynamic connector.100</title>
				<path d="M0 493.67 L-86.46 493.67 L-86.46 633.97 L-75.83 633.97" class="st6"/>
			</g>
			<g id="shape101-178" transform="translate(528.368,-312.54)">
				<title>Dynamic connector.101</title>
				<path d="M0 493.67 L10.63 493.67 L10.63 426.13 L29.06 426.13" class="st6"/>
			</g>
			<g id="shape102-181" transform="translate(497.895,-289.155)">
				<title>Dynamic connector.102</title>
				<path d="M7.09 493.67 L7.09 541.39" class="st7"/>
			</g>
			<g id="shape103-186" transform="translate(497.895,-186.621)">
				<title>Dynamic connector.103</title>
				<path d="M7.09 493.67 L7.09 541.39" class="st7"/>
			</g>
			<g id="shape104-191" transform="translate(435.827,-186.621)">
				<title>Rectangle.104</title>
				<desc>h(2)</desc>
				<rect x="0" y="446.899" width="31.8898" height="46.7717" class="st1"/>
				<text x="4.95" y="474.49" class="st2">h(2)</text>			</g>
			<g id="shape105-194" transform="translate(467.57,-202.92)">
				<title>Dynamic connector.105</title>
				<path d="M0.15 486.58 L5.99 486.58" class="st7"/>
			</g>
			<g id="shape106-199" transform="translate(411.024,-372.999)">
				<title>Dynamic connector.106</title>
				<path d="M0 486.58 L57.58 486.58 A2.3622 2.3622 0 0 1 62.3 486.58 L138.36 486.58" class="st7"/>
			</g>
			<g id="group113-204" transform="translate(640.984,-186.621)">
				<title>Sheet.113</title>
				<g id="shape114-205">
					<title>Circle</title>
					<path d="M0 470.29 A23.3858 23.3858 0 0 1 46.77 470.29 A23.3858 23.3858 0 1 1 0 470.29 Z" class="st3"/>
				</g>
				<g id="shape115-207" transform="translate(-342.231,137.745) rotate(-45)">
					<title>Sheet.115</title>
					<path d="M0 493.67 L46.78 493.67" class="st6"/>
				</g>
				<g id="shape116-210" transform="translate(-309.154,835.902) rotate(-135)">
					<title>Sheet.116</title>
					<path d="M0 493.67 L46.78 493.67" class="st6"/>
				</g>
			</g>
			<g id="group117-213" transform="translate(640.984,-84.0876)">
				<title>Sheet.117</title>
				<g id="shape118-214">
					<title>Circle</title>
					<path d="M0 470.29 A23.3858 23.3858 0 0 1 46.77 470.29 A23.3858 23.3858 0 1 1 0 470.29 Z" class="st3"/>
				</g>
				<g id="shape119-216" transform="translate(517.057,446.899) rotate(90)">
					<title>Sheet.119</title>
					<path d="M0 493.67 L46.77 493.67" class="st6"/>
				</g>
				<g id="shape120-219" transform="translate(0,-23.3858)">
					<title>Sheet.120</title>
					<path d="M0 493.67 L46.77 493.67" class="st6"/>
				</g>
			</g>
			<g id="shape122-222" transform="translate(597.108,-380.086)">
				<title>Dynamic connector.122</title>
				<path d="M7.09 493.67 L67.26 493.67 L67.26 420.92 L7.09 420.92" class="st6"/>
			</g>
			<g id="shape124-225" transform="translate(604.195,-380.086)">
				<title>Dynamic connector.124</title>
				<path d="M0 493.67 L60.18 493.67 L60.18 632.32" class="st7"/>
			</g>
			<g id="shape125-230" transform="translate(657.283,-186.621)">
				<title>Dynamic connector.125</title>
				<path d="M7.09 493.67 L7.09 541.39" class="st7"/>
			</g>
			<g id="shape126-235" transform="translate(543.898,-186.621)">
				<title>Rectangle.126</title>
				<desc>h((N-1)/2)</desc>
				<rect x="0" y="446.899" width="75.8268" height="46.7717" class="st1"/>
				<text x="11.64" y="474.49" class="st2">h((N-1)/2)</text>			</g>
			<g id="shape127-238" transform="translate(619.724,-202.92)">
				<title>Dynamic connector.127</title>
				<path d="M0 486.58 L13.22 486.58" class="st7"/>
			</g>
			<g id="shape129-243" transform="translate(557.423,-445.748)">
				<title>Dynamic connector.129</title>
				<path d="M0 486.58 L-138.36 486.58" class="st7"/>
			</g>
			<g id="shape130-248" transform="translate(364.252,-445.748)">
				<title>Dynamic connector.130</title>
				<path d="M0 486.58 L-162.75 486.58" class="st7"/>
			</g>
			<g id="shape131-253" transform="translate(117.638,-100.387)">
				<title>Dynamic connector.131</title>
				<path d="M0 486.58 L162.75 486.58" class="st7"/>
			</g>
			<g id="shape132-258" transform="translate(335.197,-100.387)">
				<title>Dynamic connector.132</title>
				<path d="M0 486.58 L138.36 486.58" class="st7"/>
			</g>
			<g id="shape133-263" transform="translate(528.368,-100.387)">
				<title>Dynamic connector.133</title>
				<path d="M0 486.58 L104.58 486.58" class="st7"/>
			</g>
			<g id="shape134-268" transform="translate(747.638,-84.0876)">
				<title>Rectangle.134</title>
				<desc>y(n)</desc>
				<rect x="0" y="446.899" width="31.8898" height="46.7717" class="st1"/>
				<text x="4" y="474.49" class="st2">y(n)</text>			</g>
			<g id="shape135-271" transform="translate(687.756,-100.387)">
				<title>Dynamic connector.135</title>
				<path d="M0 486.58 L51.84 486.58" class="st7"/>
			</g>
			<g id="shape136-276" transform="translate(226.772,-51.0236)">
				<title>Rectangle</title>
				<g id="shadow136-277" transform="matrix(1,0,0,1,0.345598,1.97279)" class="st9">
					<path d="M0 493.67 L207.55 493.67 L207.55 54.3 L0 54.3 L0 493.67 Z" class="st10"/>
				</g>
				<path d="M0 493.67 L207.55 493.67 L207.55 54.3 L0 54.3 L0 493.67 Z" class="st11"/>
			</g>
			<g id="shape137-281" transform="translate(226.772,0)">
				<title>Rectangle.137</title>
				<desc>Repeated for (N-1)/2 Taps</desc>
				<rect x="0" y="446.899" width="207.55" height="46.7717" class="st1"/>
				<text x="29.57" y="463.5" class="st2">Repeated for (N-1)/2 Taps</text>			</g>
		</g>
	</g>
</svg>
