<?xml version="1.0" standalone="no"?>
<!DOCTYPE svg PUBLIC "-//W3C//DTD SVG 20010904//EN"
 "http://www.w3.org/TR/2001/REC-SVG-20010904/DTD/svg10.dtd">
<svg version="1.0" xmlns="http://www.w3.org/2000/svg"
 width="3964.000000pt" height="2656.000000pt" viewBox="0 0 3964.000000 2656.000000"
 preserveAspectRatio="xMidYMid meet">
<metadata>
Created by potrace 1.16, written by Peter Selinger 2001-2019
</metadata>
<g transform="translate(0.000000,2656.000000) scale(0.100000,-0.100000)"
fill="#000000" stroke="none">
<path d="M24300 24613 c-22 -11 -36 -27 -38 -42 -2 -13 0 -21 5 -19 68 34 88
39 110 29 13 -6 28 -22 35 -36 19 -42 -4 -92 -87 -185 -42 -47 -74 -92 -73
-100 3 -12 26 -16 121 -18 112 -3 117 -2 117 18 0 19 -6 20 -85 20 -47 0 -85
3 -85 6 0 4 28 36 61 72 68 73 89 112 89 171 0 83 -88 126 -170 84z"/>
<path d="M23707 24614 c-4 -4 -7 -90 -7 -191 l0 -183 25 0 25 0 0 158 0 157
65 -115 c112 -202 112 -202 143 -198 l27 3 0 185 c0 184 0 185 -22 188 -22 3
-22 2 -25 -146 l-3 -150 -81 146 c-74 132 -85 147 -111 150 -16 2 -32 0 -36
-4z"/>
<path d="M27727 24614 c-4 -4 -7 -90 -7 -191 l0 -183 25 0 25 0 0 158 0 157
65 -115 c112 -202 112 -202 143 -198 l27 3 0 185 c0 184 0 185 -22 188 -22 3
-22 2 -25 -146 l-3 -150 -81 146 c-74 132 -85 147 -111 150 -16 2 -32 0 -36
-4z"/>
<path d="M28342 24588 c-31 -20 -52 -40 -52 -50 0 -23 7 -23 48 2 18 11 35 20
37 20 3 0 5 -63 5 -139 l0 -140 -42 -3 c-30 -2 -43 -8 -43 -18 0 -12 20 -16
108 -18 102 -3 107 -2 107 18 0 17 -6 20 -40 20 l-40 0 0 170 c0 196 2 193
-88 138z"/>
<path d="M15250 24593 c-22 -11 -36 -27 -38 -42 -2 -13 0 -21 5 -19 68 34 88
39 110 29 13 -6 28 -22 35 -36 19 -42 -4 -92 -87 -185 -42 -47 -74 -92 -73
-100 3 -12 26 -16 121 -18 112 -3 117 -2 117 18 0 19 -6 20 -85 20 -47 0 -85
3 -85 6 0 4 28 36 61 72 68 73 89 112 89 171 0 83 -88 126 -170 84z"/>
<path d="M11252 24568 c-31 -20 -52 -40 -52 -50 0 -23 7 -23 48 2 18 11 35 20
37 20 3 0 5 -63 5 -139 l0 -140 -42 -3 c-30 -2 -43 -8 -43 -18 0 -12 20 -16
108 -18 102 -3 107 -2 107 18 0 17 -6 20 -40 20 l-40 0 0 170 c0 196 2 193
-88 138z"/>
<path d="M24060 24390 c0 -18 7 -20 70 -20 63 0 70 2 70 20 0 18 -7 20 -70 20
-63 0 -70 -2 -70 -20z"/>
<path d="M28080 24390 c0 -18 7 -20 70 -20 63 0 70 2 70 20 0 18 -7 20 -70 20
-63 0 -70 -2 -70 -20z"/>
<path d="M22870 22440 l0 -1620 1200 0 1200 0 0 780 0 780 800 0 800 0 0 -780
0 -780 1200 0 1200 0 0 775 0 775 774 0 c690 0 775 -2 787 -16 34 -41 77 -49
160 -30 26 6 27 4 38 -61 20 -113 17 -111 66 -63 l42 41 207 -225 c113 -123
206 -226 206 -228 0 -2 -37 -42 -83 -88 -89 -91 -145 -175 -180 -268 -18 -47
-21 -79 -21 -177 0 -121 10 -186 45 -305 36 -122 102 -249 159 -309 20 -20 22
-28 13 -52 l-11 -29 99 0 100 0 -44 58 c-24 31 -51 68 -59 81 l-16 23 -15 -28
-14 -27 -33 44 c-113 153 -193 465 -162 631 22 119 118 273 224 360 l45 37
184 -202 c106 -116 183 -208 181 -217 -16 -72 -15 -79 21 -115 45 -45 91 -47
137 -8 l32 26 1437 -6 c1123 -5 1442 -3 1461 6 33 17 39 61 10 77 -14 8 -434
13 -1468 17 l-1447 6 -29 24 c-24 20 -38 24 -76 21 l-46 -3 -183 199 -183 200
39 23 c167 104 323 156 531 178 61 7 62 7 62 37 l0 31 -77 -7 c-190 -17 -365
-76 -521 -173 -72 -44 -74 -45 -91 -27 -10 11 -91 100 -181 199 -90 99 -177
195 -194 213 l-30 32 33 34 33 34 -94 14 -93 14 -5 46 c-6 51 -20 72 -61 94
-41 21 -81 17 -123 -11 l-37 -25 -774 0 -775 0 0 795 0 795 -1200 0 -1200 0 0
-790 0 -790 -800 0 -800 0 0 790 0 790 -1200 0 -1200 0 0 -1620z m2370 0 l0
-1600 -1170 0 -1170 0 0 1600 0 1600 1170 0 1170 0 0 -1600z m4000 0 l0 -1600
-1170 0 -1170 0 0 1600 0 1600 1170 0 1170 0 0 -1600z"/>
<path d="M23888 22695 c-5 -5 -8 -102 -8 -218 l0 -209 118 4 c108 3 120 5 159
31 24 15 49 27 57 27 8 0 25 19 37 43 20 36 24 56 23 136 0 76 -3 96 -17 106
-9 7 -17 17 -17 22 0 9 -16 19 -75 43 -35 14 -266 26 -277 15z m261 -62 c51
-23 81 -75 81 -137 0 -59 -19 -95 -69 -135 -37 -30 -43 -31 -130 -31 l-91 0 0
158 c0 87 3 162 8 166 13 14 160 -1 201 -21z"/>
<path d="M27888 22695 c-5 -5 -8 -102 -8 -218 l0 -209 118 4 c108 3 120 5 159
31 24 15 49 27 57 27 8 0 25 19 37 43 20 36 24 56 23 136 0 76 -3 96 -17 106
-9 7 -17 17 -17 22 0 9 -16 19 -75 43 -35 14 -266 26 -277 15z m261 -62 c51
-23 81 -75 81 -137 0 -59 -19 -95 -69 -135 -37 -30 -43 -31 -130 -31 l-91 0 0
158 c0 87 3 162 8 166 13 14 160 -1 201 -21z"/>
<path d="M10110 23245 l0 -795 -780 0 -779 0 -37 25 c-44 30 -88 32 -131 5
-51 -30 -62 -69 -42 -139 3 -11 -18 -18 -89 -29 l-94 -14 33 -34 32 -33 -38
-43 c-22 -24 -93 -102 -158 -174 l-120 -131 -81 58 c-177 128 -383 205 -599
225 l-77 7 0 -31 c0 -30 1 -30 63 -37 219 -23 377 -78 547 -190 121 -80 134
-46 -131 -336 l-232 -254 -47 3 c-38 3 -52 -1 -76 -21 l-29 -24 -1447 -6
c-1034 -4 -1454 -9 -1468 -17 -29 -16 -23 -60 10 -77 19 -9 338 -11 1461 -6
l1437 6 32 -26 c46 -39 92 -37 137 8 36 36 37 43 21 115 -2 9 96 124 232 273
l235 258 34 -38 c88 -99 147 -219 158 -323 17 -170 -63 -458 -167 -599 l-33
-44 -14 27 -15 28 -16 -23 c-8 -13 -35 -50 -59 -81 l-44 -58 100 0 99 0 -11
29 c-9 24 -7 32 13 52 57 60 123 187 159 309 35 119 45 184 45 305 0 98 -3
130 -21 177 -28 75 -82 164 -138 226 -25 28 -45 53 -45 57 0 3 70 83 156 176
l157 170 42 -41 c48 -47 47 -48 65 62 l12 75 47 -5 c49 -4 95 12 120 42 12 14
98 16 792 16 l779 0 0 -775 0 -775 1200 0 1200 0 0 780 0 780 800 0 800 0 0
-780 0 -780 1200 0 1200 0 0 1620 0 1620 -1200 0 -1200 0 0 -790 0 -790 -800
0 -800 0 0 790 0 790 -1200 0 -1200 0 0 -795z m2370 -825 l0 -1600 -1170 0
-1170 0 0 1600 0 1600 1170 0 1170 0 0 -1600z m4000 0 l0 -1600 -1170 0 -1170
0 0 1600 0 1600 1170 0 1170 0 0 -1600z"/>
<path d="M11128 22675 c-5 -5 -8 -102 -8 -218 l0 -209 118 4 c108 3 120 5 159
31 24 15 49 27 57 27 8 0 25 19 37 43 20 36 24 56 23 136 0 76 -3 96 -17 106
-9 7 -17 17 -17 22 0 9 -16 19 -75 43 -35 14 -266 26 -277 15z m261 -62 c51
-23 81 -75 81 -137 0 -59 -19 -95 -69 -135 -37 -30 -43 -31 -130 -31 l-91 0 0
158 c0 87 3 162 8 166 13 14 160 -1 201 -21z"/>
<path d="M15128 22675 c-5 -5 -8 -102 -8 -218 l0 -209 118 4 c108 3 120 5 159
31 24 15 49 27 57 27 8 0 25 19 37 43 20 36 24 56 23 136 0 76 -3 96 -17 106
-9 7 -17 17 -17 22 0 9 -16 19 -75 43 -35 14 -266 26 -277 15z m261 -62 c51
-23 81 -75 81 -137 0 -59 -19 -95 -69 -135 -37 -30 -43 -31 -130 -31 l-91 0 0
158 c0 87 3 162 8 166 13 14 160 -1 201 -21z"/>
<path d="M8420 22988 c-76 -41 -104 -205 -55 -325 24 -57 104 -80 165 -48 45
23 63 68 68 165 5 99 -8 157 -42 189 -30 28 -100 38 -136 19z m99 -47 c26 -26
34 -73 29 -172 -3 -74 -6 -83 -31 -105 -80 -69 -143 30 -122 192 11 90 75 134
124 85z"/>
<path d="M18480 22528 c-52 -27 -90 -90 -90 -148 0 -58 38 -121 90 -147 24
-13 58 -23 75 -23 53 0 116 40 142 89 45 86 15 186 -67 229 -24 12 -58 22 -75
22 -17 0 -51 -10 -75 -22z"/>
<path d="M19590 22528 c-52 -27 -90 -90 -90 -148 0 -58 38 -121 90 -147 24
-13 58 -23 75 -23 53 0 116 40 142 89 45 86 15 186 -67 229 -24 12 -58 22 -75
22 -17 0 -51 -10 -75 -22z"/>
<path d="M20690 22528 c-52 -27 -90 -90 -90 -148 0 -58 38 -121 90 -147 24
-13 58 -23 75 -23 53 0 116 40 142 89 45 86 15 186 -67 229 -24 12 -58 22 -75
22 -17 0 -51 -10 -75 -22z"/>
<path d="M35540 21291 l0 -251 51 0 c43 0 50 3 47 18 -2 10 -14 18 -31 20
l-27 3 0 209 0 209 28 3 c16 2 27 9 27 18 0 11 -13 16 -47 18 l-48 3 0 -250z"/>
<path d="M36010 21521 c0 -16 6 -21 25 -21 l25 0 0 -210 0 -210 -25 0 c-19 0
-25 -5 -25 -21 0 -18 5 -20 48 -17 l47 3 0 245 0 245 -47 3 c-43 3 -48 1 -48
-17z"/>
<path d="M3530 21261 l0 -251 51 0 c43 0 50 3 47 18 -2 10 -14 18 -31 20 l-27
3 0 209 0 209 28 3 c16 2 27 9 27 18 0 11 -13 16 -47 18 l-48 3 0 -250z"/>
<path d="M4000 21491 c0 -16 6 -21 25 -21 l25 0 0 -210 0 -210 -25 0 c-19 0
-25 -5 -25 -21 0 -18 5 -20 48 -17 l47 3 0 245 0 245 -47 3 c-43 3 -48 1 -48
-17z"/>
<path d="M35781 21394 c-30 -25 -31 -25 -31 -5 0 14 -6 21 -20 21 -19 0 -20
-7 -20 -140 0 -133 1 -140 20 -140 19 0 20 7 20 99 0 99 0 99 31 125 69 59 97
27 101 -114 3 -100 4 -105 26 -108 22 -3 22 -2 22 113 0 115 0 117 -29 146
-37 37 -79 38 -120 3z"/>
<path d="M35244 21395 c3 -8 21 -39 40 -69 l34 -54 -22 -33 c-12 -19 -32 -51
-45 -71 l-23 -38 25 0 c20 0 33 12 60 57 l35 56 26 -42 c15 -23 30 -49 33 -57
6 -16 53 -19 53 -4 0 6 -18 38 -39 72 l-39 62 39 61 c21 34 39 65 39 69 0 3
-9 6 -20 6 -14 0 -31 -16 -52 -50 -17 -27 -34 -50 -37 -50 -3 0 -19 23 -34 50
-22 40 -33 50 -54 50 -18 0 -24 -4 -19 -15z"/>
<path d="M3771 21364 c-30 -25 -31 -25 -31 -5 0 14 -6 21 -20 21 -19 0 -20 -7
-20 -140 0 -133 1 -140 20 -140 19 0 20 7 20 99 0 99 0 99 31 125 69 59 97 27
101 -114 3 -100 4 -105 26 -108 22 -3 22 -2 22 113 0 115 0 117 -29 146 -37
37 -79 38 -120 3z"/>
<path d="M3210 21375 c0 -2 23 -66 51 -142 l52 -137 -17 -45 c-9 -25 -16 -49
-16 -53 0 -12 38 -9 45 2 9 15 135 363 135 373 0 5 -10 7 -22 5 -22 -3 -46
-56 -92 -203 -5 -14 -18 11 -47 93 -37 100 -44 112 -65 112 -13 0 -24 -2 -24
-5z"/>
<path d="M11260 20108 c-52 -27 -90 -90 -90 -148 0 -58 38 -121 90 -147 24
-13 58 -23 75 -23 53 0 116 40 142 89 45 86 15 186 -67 229 -24 12 -58 22 -75
22 -17 0 -51 -10 -75 -22z"/>
<path d="M11260 19218 c-52 -27 -90 -90 -90 -148 0 -58 38 -121 90 -147 24
-13 58 -23 75 -23 53 0 116 40 142 89 45 86 15 186 -67 229 -24 12 -58 22 -75
22 -17 0 -51 -10 -75 -22z"/>
<path d="M11264 18301 c-81 -37 -115 -141 -74 -226 30 -63 69 -85 145 -85 76
0 115 22 145 85 54 111 -25 245 -145 245 -16 0 -48 -9 -71 -19z"/>
<path d="M11318 17973 c12 -2 30 -2 40 0 9 3 -1 5 -23 4 -22 0 -30 -2 -17 -4z"/>
<path d="M19280 17293 c-22 -11 -36 -27 -38 -42 -2 -13 0 -21 5 -19 4 2 24 12
44 22 46 23 86 15 99 -20 22 -57 -16 -104 -82 -104 -31 0 -38 -4 -38 -20 0
-17 7 -20 44 -20 55 0 96 -30 96 -70 0 -68 -66 -85 -167 -44 -8 4 -13 -3 -13
-16 0 -25 51 -50 106 -50 117 0 177 125 88 185 l-30 20 24 20 c17 14 26 35 29
66 4 38 1 50 -19 73 -31 37 -97 45 -148 19z"/>
<path d="M11282 17268 c-31 -20 -52 -40 -52 -50 0 -23 7 -23 48 2 18 11 35 20
37 20 3 0 5 -63 5 -139 l0 -140 -42 -3 c-30 -2 -43 -8 -43 -18 0 -12 20 -16
108 -18 102 -3 107 -2 107 18 0 17 -6 20 -40 20 l-40 0 0 170 c0 196 2 193
-88 138z"/>
<path d="M15280 17273 c-22 -11 -36 -27 -38 -42 -2 -13 0 -21 5 -19 68 34 88
39 110 29 13 -6 28 -22 35 -36 19 -42 -4 -92 -87 -185 -42 -47 -74 -92 -73
-100 3 -12 26 -16 121 -18 112 -3 117 -2 117 18 0 19 -6 20 -85 20 -47 0 -85
3 -85 6 0 4 28 36 61 72 68 73 89 112 89 171 0 83 -88 126 -170 84z"/>
<path d="M10130 15945 l0 -805 -785 0 -784 0 -37 25 c-105 72 -233 -36 -165
-139 20 -29 27 -33 87 -43 33 -5 81 14 103 41 12 14 98 16 797 16 l784 0 0
-765 0 -765 1200 0 1200 0 0 815 0 815 800 0 800 0 0 -825 0 -825 1200 0 1200
0 0 815 0 815 790 0 790 0 0 -805 0 -805 1200 0 1200 0 0 770 0 770 5144 0
c4656 0 5145 -1 5157 -16 22 -27 70 -46 103 -41 60 10 67 14 87 43 36 55 19
118 -41 149 -42 22 -82 18 -124 -10 l-37 -25 -5144 0 -5145 0 0 800 0 800
-1200 0 -1200 0 0 -755 0 -755 -790 0 -790 0 0 745 0 745 -1200 0 -1200 0 0
-745 0 -745 -800 0 -800 0 0 755 0 755 -1200 0 -1200 0 0 -805z m2370 -815 l0
-1600 -1170 0 -1170 0 0 1600 0 1600 1170 0 1170 0 0 -1600z m7980 0 l0 -1600
-1170 0 -1170 0 0 1600 0 1600 1170 0 1170 0 0 -1600z m-3980 -20 l0 -1600
-1170 0 -1170 0 0 1600 0 1600 1170 0 1170 0 0 -1600z"/>
<path d="M11148 15385 c-5 -5 -8 -102 -8 -218 l0 -209 118 4 c108 3 120 5 159
31 24 15 49 27 57 27 8 0 25 19 37 43 20 36 24 56 23 136 0 76 -3 96 -17 106
-9 7 -17 17 -17 22 0 9 -16 19 -75 43 -35 14 -266 26 -277 15z m261 -62 c51
-23 81 -75 81 -137 0 -59 -19 -95 -69 -135 -37 -30 -43 -31 -130 -31 l-91 0 0
158 c0 87 3 162 8 166 13 14 160 -1 201 -21z"/>
<path d="M19128 15385 c-5 -5 -8 -102 -8 -218 l0 -209 118 4 c108 3 120 5 159
31 24 15 49 27 57 27 8 0 25 19 37 43 20 36 24 56 23 136 0 76 -3 96 -17 106
-9 7 -17 17 -17 22 0 9 -16 19 -75 43 -35 14 -266 26 -277 15z m261 -62 c51
-23 81 -75 81 -137 0 -59 -19 -95 -69 -135 -37 -30 -43 -31 -130 -31 l-91 0 0
158 c0 87 3 162 8 166 13 14 160 -1 201 -21z"/>
<path d="M15148 15365 c-5 -5 -8 -102 -8 -218 l0 -209 118 4 c108 3 120 5 159
31 24 15 49 27 57 27 8 0 25 19 37 43 20 36 24 56 23 136 0 76 -3 96 -17 106
-9 7 -17 17 -17 22 0 9 -16 19 -75 43 -35 14 -266 26 -277 15z m261 -62 c51
-23 81 -75 81 -137 0 -59 -19 -95 -69 -135 -37 -30 -43 -31 -130 -31 l-91 0 0
158 c0 87 3 162 8 166 13 14 160 -1 201 -21z"/>
<path d="M8417 15674 c-4 -4 -7 -90 -7 -191 l0 -183 25 0 25 0 0 158 0 157 65
-115 c112 -202 112 -202 143 -198 l27 3 0 185 c0 184 0 185 -22 188 -22 3 -22
2 -25 -146 l-3 -150 -81 146 c-74 132 -85 147 -111 150 -16 2 -32 0 -36 -4z"/>
<path d="M9023 15563 c-102 -168 -101 -173 6 -173 l80 0 3 -42 c2 -36 7 -44
26 -46 20 -3 22 1 22 42 0 41 2 45 28 48 16 2 27 9 27 18 0 9 -11 16 -27 18
l-28 3 0 125 0 124 -33 0 c-31 0 -36 -6 -104 -117z m84 -130 c-3 -2 -30 -3
-60 -1 l-55 3 56 95 57 94 3 -93 c1 -52 1 -95 -1 -98z"/>
<path d="M8770 15450 c0 -18 7 -20 70 -20 63 0 70 2 70 20 0 18 -7 20 -70 20
-63 0 -70 -2 -70 -20z"/>
<path d="M15280 13303 c-22 -11 -36 -27 -38 -42 -2 -13 0 -21 5 -19 68 34 88
39 110 29 13 -6 28 -22 35 -36 19 -42 -4 -92 -87 -185 -42 -47 -74 -92 -73
-100 3 -12 26 -16 121 -18 112 -3 117 -2 117 18 0 19 -6 20 -85 20 -47 0 -85
3 -85 6 0 4 28 36 61 72 68 73 89 112 89 171 0 83 -88 126 -170 84z"/>
<path d="M11302 13278 c-31 -20 -52 -40 -52 -50 0 -23 7 -23 48 2 18 11 35 20
37 20 3 0 5 -63 5 -139 l0 -140 -42 -3 c-30 -2 -43 -8 -43 -18 0 -12 20 -16
108 -18 102 -3 107 -2 107 18 0 17 -6 20 -40 20 l-40 0 0 170 c0 196 2 193
-88 138z"/>
<path d="M10110 11965 l0 -795 -775 0 -774 0 -37 25 c-105 72 -233 -36 -165
-139 20 -29 27 -33 87 -43 33 -5 81 14 103 41 12 14 97 16 787 16 l774 0 0
-775 0 -775 1200 0 1200 0 0 780 0 780 800 0 800 0 0 -780 0 -780 1200 0 1200
0 0 780 0 780 7149 0 c6476 0 7150 -1 7162 -16 22 -27 70 -46 103 -41 60 10
67 14 87 43 36 55 19 118 -41 149 -42 22 -82 18 -124 -10 l-37 -25 -7149 0
-7150 0 0 790 0 790 -1200 0 -1200 0 0 -790 0 -790 -800 0 -800 0 0 790 0 790
-1200 0 -1200 0 0 -795z m2370 -825 l0 -1600 -1170 0 -1170 0 0 1600 0 1600
1170 0 1170 0 0 -1600z m4000 0 l0 -1600 -1170 0 -1170 0 0 1600 0 1600 1170
0 1170 0 0 -1600z"/>
<path d="M11128 11395 c-5 -5 -8 -102 -8 -218 l0 -209 118 4 c108 3 120 5 159
31 24 15 49 27 57 27 8 0 25 19 37 43 20 36 24 56 23 136 0 76 -3 96 -17 106
-9 7 -17 17 -17 22 0 9 -16 19 -75 43 -35 14 -266 26 -277 15z m261 -62 c51
-23 81 -75 81 -137 0 -59 -19 -95 -69 -135 -37 -30 -43 -31 -130 -31 l-91 0 0
158 c0 87 3 162 8 166 13 14 160 -1 201 -21z"/>
<path d="M15128 11395 c-5 -5 -8 -102 -8 -218 l0 -209 118 4 c108 3 120 5 159
31 24 15 49 27 57 27 8 0 25 19 37 43 20 36 24 56 23 136 0 76 -3 96 -17 106
-9 7 -17 17 -17 22 0 9 -16 19 -75 43 -35 14 -266 26 -277 15z m261 -62 c51
-23 81 -75 81 -137 0 -59 -19 -95 -69 -135 -37 -30 -43 -31 -130 -31 l-91 0 0
158 c0 87 3 162 8 166 13 14 160 -1 201 -21z"/>
<path d="M9000 11713 c-22 -11 -36 -27 -38 -42 -2 -13 0 -21 5 -19 4 2 24 12
44 22 46 23 86 15 99 -20 22 -57 -16 -104 -82 -104 -31 0 -38 -4 -38 -20 0
-17 7 -20 44 -20 55 0 96 -30 96 -70 0 -68 -66 -85 -167 -44 -8 4 -13 -3 -13
-16 0 -25 51 -50 106 -50 117 0 177 125 88 185 l-30 20 24 20 c17 14 26 35 29
66 4 38 1 50 -19 73 -31 37 -97 45 -148 19z"/>
<path d="M8407 11714 c-4 -4 -7 -90 -7 -191 l0 -183 25 0 25 0 0 158 0 157 65
-115 c112 -202 112 -202 143 -198 l27 3 0 185 c0 184 0 185 -22 188 -22 3 -22
2 -25 -146 l-3 -150 -81 146 c-74 132 -85 147 -111 150 -16 2 -32 0 -36 -4z"/>
<path d="M8760 11490 c0 -18 7 -20 70 -20 63 0 70 2 70 20 0 18 -7 20 -70 20
-63 0 -70 -2 -70 -20z"/>
<path d="M11263 9267 c-18 -12 -33 -30 -33 -39 0 -23 8 -22 48 2 18 11 35 20
37 20 3 0 5 -63 5 -139 l0 -140 -42 -3 c-30 -2 -43 -8 -43 -18 0 -12 20 -16
108 -18 102 -3 107 -2 107 18 0 17 -6 20 -40 20 l-40 0 0 160 0 160 -37 -1
c-22 0 -52 -10 -70 -22z"/>
<path d="M10120 7930 l0 -800 -775 0 -774 0 -37 25 c-105 72 -233 -36 -165
-139 20 -29 27 -33 87 -43 33 -5 81 14 103 41 12 14 97 16 787 16 l774 0 0
-770 0 -770 1200 0 1200 0 0 770 0 770 9154 0 c8296 0 9155 -1 9167 -16 22
-27 70 -46 103 -41 60 10 67 14 87 43 36 55 19 118 -41 149 -42 22 -82 18
-124 -10 l-37 -25 -9154 0 -9155 0 0 800 0 800 -1200 0 -1200 0 0 -800z m2370
-820 l0 -1600 -1170 0 -1170 0 0 1600 0 1600 1170 0 1170 0 0 -1600z"/>
<path d="M11138 7365 c-5 -5 -8 -102 -8 -218 l0 -209 118 4 c108 3 120 5 159
31 24 15 49 27 57 27 8 0 25 19 37 43 20 36 24 56 23 136 0 76 -3 96 -17 106
-9 7 -17 17 -17 22 0 9 -16 19 -75 43 -35 14 -266 26 -277 15z m261 -62 c51
-23 81 -75 81 -137 0 -59 -19 -95 -69 -135 -37 -30 -43 -31 -130 -31 l-91 0 0
158 c0 87 3 162 8 166 13 14 160 -1 201 -21z"/>
<path d="M8990 7663 c-22 -11 -36 -27 -38 -42 -2 -13 0 -21 5 -19 68 34 88 39
110 29 13 -6 28 -22 35 -36 19 -42 -4 -92 -87 -185 -42 -47 -74 -92 -73 -100
3 -12 26 -16 121 -18 112 -3 117 -2 117 18 0 19 -6 20 -85 20 -47 0 -85 3 -85
6 0 4 28 36 61 72 68 73 89 112 89 171 0 83 -88 126 -170 84z"/>
<path d="M8397 7664 c-4 -4 -7 -90 -7 -191 l0 -183 25 0 25 0 0 158 0 157 65
-115 c112 -202 112 -202 143 -198 l27 3 0 185 c0 184 0 185 -22 188 -22 3 -22
2 -25 -146 l-3 -150 -81 146 c-74 132 -85 147 -111 150 -16 2 -32 0 -36 -4z"/>
<path d="M8750 7440 c0 -18 7 -20 70 -20 63 0 70 2 70 20 0 18 -7 20 -70 20
-63 0 -70 -2 -70 -20z"/>
<path d="M8397 5204 c-4 -4 -7 -90 -7 -191 l0 -183 25 0 25 0 0 158 0 157 65
-115 c112 -202 112 -202 143 -198 l27 3 0 185 c0 184 0 185 -22 188 -22 3 -22
2 -25 -146 l-3 -150 -81 146 c-74 132 -85 147 -111 150 -16 2 -32 0 -36 -4z"/>
<path d="M9012 5178 c-31 -20 -52 -40 -52 -50 0 -23 7 -23 48 2 18 11 35 20
37 20 3 0 5 -63 5 -139 l0 -140 -42 -3 c-30 -2 -43 -8 -43 -18 0 -12 20 -16
108 -18 102 -3 107 -2 107 18 0 17 -6 20 -40 20 l-40 0 0 170 c0 196 2 193
-88 138z"/>
<path d="M8750 4980 c0 -18 7 -20 70 -20 63 0 70 2 70 20 0 18 -7 20 -70 20
-63 0 -70 -2 -70 -20z"/>
<path d="M30972 4710 l-34 -21 -3386 11 c-1863 6 -3394 12 -3403 14 -9 2
-3524 -7 -7810 -20 l-7794 -24 -36 20 c-44 24 -80 25 -119 5 -38 -20 -60 -53
-60 -90 0 -36 32 -87 57 -93 60 -13 76 -13 103 -2 17 7 39 23 49 36 l19 24
6488 20 c7765 24 8739 25 12763 10 3077 -11 3115 -11 3128 -30 31 -45 97 -61
150 -38 42 19 54 35 60 77 6 47 -8 76 -50 101 -41 25 -83 25 -125 0z"/>
</g>
</svg>
