<?xml version="1.0" encoding="UTF-8" standalone="no"?>
<svg
   xmlns:dc="http://purl.org/dc/elements/1.1/"
   xmlns:cc="http://creativecommons.org/ns#"
   xmlns:rdf="http://www.w3.org/1999/02/22-rdf-syntax-ns#"
   xmlns:svg="http://www.w3.org/2000/svg"
   xmlns="http://www.w3.org/2000/svg"
   xmlns:sodipodi="http://sodipodi.sourceforge.net/DTD/sodipodi-0.dtd"
   xmlns:inkscape="http://www.inkscape.org/namespaces/inkscape"
   version="1.2"
   width="70.790825mm"
   height="28.65mm"
   viewBox="1000 16481 7079.0824 2865"
   preserveAspectRatio="xMidYMid"
   xml:space="preserve"
   id="svg5486"
   sodipodi:docname="symbol_mapper_bool.svg"
   style="fill-rule:evenodd;stroke-width:28.22200012;stroke-linejoin:round"
   inkscape:version="0.92.2 (5c3e80d, 2017-08-06)"><metadata
     id="metadata5490"><rdf:RDF><cc:Work
         rdf:about=""><dc:format>image/svg+xml</dc:format><dc:type
           rdf:resource="http://purl.org/dc/dcmitype/StillImage" /><dc:title /></cc:Work></rdf:RDF></metadata><sodipodi:namedview
     pagecolor="#ffffff"
     bordercolor="#666666"
     borderopacity="1"
     objecttolerance="10"
     gridtolerance="10"
     guidetolerance="10"
     inkscape:pageopacity="0"
     inkscape:pageshadow="2"
     inkscape:window-width="1920"
     inkscape:window-height="872"
     id="namedview5488"
     showgrid="false"
     fit-margin-top="0"
     fit-margin-left="0"
     fit-margin-right="0"
     fit-margin-bottom="0"
     inkscape:zoom="2.4815668"
     inkscape:cx="51.059685"
     inkscape:cy="50.28102"
     inkscape:window-x="0"
     inkscape:window-y="28"
     inkscape:window-maximized="1"
     inkscape:current-layer="g6213" /><defs
     class="ClipPathGroup"
     id="defs5146" /><defs
     id="defs5179" /><defs
     id="defs5190" /><defs
     id="defs5203" /><defs
     id="defs5214" /><defs
     class="TextShapeIndex"
     id="defs5218" /><defs
     class="EmbeddedBulletChars"
     id="defs5250" /><defs
     class="TextEmbeddedBitmaps"
     id="defs5252" /><g
     id="g5476"
     class="Group"><g
       id="g6213"><g
         class="com.sun.star.drawing.LineShape"
         id="g5277"><g
           id="id5"
           style="display:inline"><path
             d="m 6069,17271 h 495"
             id="path5272"
             inkscape:connector-curvature="0"
             style="display:inline;fill:none;stroke:#000000;stroke-width:35;stroke-linejoin:round" /><path
             d="m 7069,17271 -528,-176 v 352 z"
             id="path5274"
             inkscape:connector-curvature="0"
             style="display:inline;fill:#000000;stroke:none" /></g></g><g
         class="com.sun.star.drawing.LineShape"
         id="g5295"><g
           id="id7"><path
             d="m 5732,18824 v -495"
             id="path5290"
             inkscape:connector-curvature="0"
             style="fill:none;stroke:#000000;stroke-width:35;stroke-linejoin:round" /><path
             d="m 5732,17824 -176,528 h 352 z"
             id="path5292"
             inkscape:connector-curvature="0"
             style="fill:#000000;stroke:none" /></g></g><g
         class="OLE2"
         id="g5339"><g
           id="id8"><defs
             id="defs5302" /><text
             id="text5310"
             class="TextShape"><tspan
               style="font-style:italic;font-weight:400;font-size:422px;font-family:'Liberation Serif', serif"
               id="tspan5308"
               font-weight="400"
               font-style="italic"
               font-size="422px"
               class="TextParagraph"><tspan
                 id="tspan5306"
                 y="19235"
                 x="5369"
                 class="TextPosition"><tspan
                   style="fill:#000000;stroke:none"
                   id="tspan5304">x</tspan></tspan></tspan></text>
<text
             id="text5318"
             class="TextShape"><tspan
               style="font-weight:400;font-size:422px;font-family:OpenSymbol"
               id="tspan5316"
               font-weight="400"
               font-size="422px"
               class="TextParagraph"><tspan
                 id="tspan5314"
                 y="19235"
                 x="5607"
                 class="TextPosition"><tspan
                   style="fill:#000000;stroke:none"
                   id="tspan5312">[</tspan></tspan></tspan></text>
<text
             id="text5326"
             class="TextShape"><tspan
               style="font-style:italic;font-weight:400;font-size:422px;font-family:'Liberation Serif', serif"
               id="tspan5324"
               font-weight="400"
               font-style="italic"
               font-size="422px"
               class="TextParagraph"><tspan
                 id="tspan5322"
                 y="19235"
                 x="5766"
                 class="TextPosition"><tspan
                   style="fill:#000000;stroke:none"
                   id="tspan5320">n</tspan></tspan></tspan></text>
<text
             id="text5334"
             class="TextShape"><tspan
               style="font-weight:400;font-size:422px;font-family:OpenSymbol"
               id="tspan5332"
               font-weight="400"
               font-size="422px"
               class="TextParagraph"><tspan
                 id="tspan5330"
                 y="19235"
                 x="6004"
                 class="TextPosition"><tspan
                   style="fill:#000000;stroke:none"
                   id="tspan5328">]</tspan></tspan></tspan></text>
</g></g><g
         transform="translate(-1957.9173)"
         class="OLE2"
         id="g5383"><g
           id="id9"><defs
             id="defs5346" /><text
             id="text5354"
             class="TextShape"><tspan
               style="font-style:italic;font-weight:400;font-size:422px;font-family:'Liberation Serif', serif"
               id="tspan5352"
               font-weight="400"
               font-style="italic"
               font-size="422px"
               class="TextParagraph"><tspan
                 id="tspan5350"
                 y="17401"
                 x="9169"
                 class="TextPosition"><tspan
                   style="fill:#000000;stroke:none"
                   id="tspan5348">y</tspan></tspan></tspan></text>
<text
             id="text5362"
             class="TextShape"><tspan
               style="font-weight:400;font-size:422px;font-family:OpenSymbol"
               id="tspan5360"
               font-weight="400"
               font-size="422px"
               class="TextParagraph"><tspan
                 id="tspan5358"
                 y="17401"
                 x="9407"
                 class="TextPosition"><tspan
                   style="fill:#000000;stroke:none"
                   id="tspan5356">[</tspan></tspan></tspan></text>
<text
             id="text5370"
             class="TextShape"><tspan
               style="font-style:italic;font-weight:400;font-size:422px;font-family:'Liberation Serif', serif"
               id="tspan5368"
               font-weight="400"
               font-style="italic"
               font-size="422px"
               class="TextParagraph"><tspan
                 id="tspan5366"
                 y="17401"
                 x="9566"
                 class="TextPosition"><tspan
                   style="fill:#000000;stroke:none"
                   id="tspan5364">n</tspan></tspan></tspan></text>
<text
             id="text5378"
             class="TextShape"><tspan
               style="font-weight:400;font-size:422px;font-family:OpenSymbol"
               id="tspan5376"
               font-weight="400"
               font-size="422px"
               class="TextParagraph"><tspan
                 id="tspan5374"
                 y="17401"
                 x="9830"
                 class="TextPosition"><tspan
                   style="fill:#000000;stroke:none"
                   id="tspan5372">]</tspan></tspan></tspan></text>
</g></g><g
         class="com.sun.star.drawing.CustomShape"
         id="g5390"><g
           id="id10"><path
             d="m 5181,16521 v 1500 l 824,-375 v -750 z"
             id="path5387"
             inkscape:connector-curvature="0"
             style="fill:none;stroke:#000000;stroke-width:40;stroke-linejoin:round" /></g></g><g
         class="OLE2"
         id="g5430"><g
           id="id12"><text
             class="TextShape"
             id="text5405"><tspan
               class="TextParagraph"
               font-size="422px"
               font-weight="400"
               id="tspan5403"
               style="font-weight:400;font-size:422px;font-family:'Liberation Serif', serif"><tspan
                 class="TextPosition"
                 x="5262"
                 y="17814"
                 id="tspan5401"><tspan
                   id="tspan5399"
                   style="fill:#000000;stroke:none">1</tspan></tspan></tspan></text>
<text
             class="TextShape"
             id="text5425"><tspan
               class="TextParagraph"
               font-size="422px"
               font-weight="400"
               id="tspan5423"
               style="font-weight:400;font-size:422px;font-family:'Liberation Serif', serif"><tspan
                 class="TextPosition"
                 x="5262"
                 y="16963"
                 id="tspan5421"><tspan
                   id="tspan5419"
                   style="fill:#000000;stroke:none">0</tspan></tspan></tspan></text>
<defs
             id="defs5417" /></g></g><g
         class="com.sun.star.drawing.TextShape"
         id="g5443"><g
           id="id13"><text
             class="TextShape"
             id="text5440"><tspan
               class="TextParagraph"
               font-size="388px"
               font-weight="400"
               id="tspan5438"
               style="font-weight:400;font-size:388px;font-family:'Liberation Mono', monospace"><tspan
                 class="TextPosition"
                 x="1483"
                 y="17834"
                 id="tspan5436"><tspan
                   id="tspan5434"
                   style="fill:#000000;stroke:none">mark_symbol</tspan></tspan></tspan></text>
</g></g><g
         class="com.sun.star.drawing.TextShape"
         id="g5456"><g
           id="id14"><text
             class="TextShape"
             id="text5453"><tspan
               class="TextParagraph"
               font-size="388px"
               font-weight="400"
               id="tspan5451"
               style="font-weight:400;font-size:388px;font-family:'Liberation Mono', monospace"><tspan
                 class="TextPosition"
                 x="1250"
                 y="16928"
                 id="tspan5449"><tspan
                   id="tspan5447"
                   style="fill:#000000;stroke:none">space_symbol</tspan></tspan></tspan></text>
</g></g><g
         class="com.sun.star.drawing.LineShape"
         id="g5474"><g
           id="id16"
           style="display:inline"><g
             id="id15"><path
               d="m 4104,16778 h 495"
               id="path5460"
               inkscape:connector-curvature="0"
               style="fill:none;stroke:#000000;stroke-width:35;stroke-linejoin:round" /><path
               d="m 5104,16778 -528,-176 v 352 z"
               id="path5462"
               inkscape:connector-curvature="0"
               style="fill:#000000;stroke:none" /></g><path
             d="m 4122,17704 h 495"
             id="path5469"
             inkscape:connector-curvature="0"
             style="fill:none;stroke:#000000;stroke-width:35;stroke-linejoin:round" /><path
             d="m 5122,17704 -528,-176 v 352 z"
             id="path5471"
             inkscape:connector-curvature="0"
             style="fill:#000000;stroke:none" /></g></g></g></g></svg>