<?xml version="1.0" encoding="UTF-8" standalone="no"?>
<!DOCTYPE svg PUBLIC "-//W3C//DTD SVG 1.1//EN" "http://www.w3.org/Graphics/SVG/1.1/DTD/svg11.dtd">
<!-- Generated by Microsoft Visio, SVG Export fir_filter_scaled.svg Page-1 -->
<svg xmlns="http://www.w3.org/2000/svg" xmlns:xlink="http://www.w3.org/1999/xlink" xmlns:ev="http://www.w3.org/2001/xml-events"
		width="13.0584in" height="3.97867in" viewBox="0 0 940.205 286.465" xml:space="preserve" color-interpolation-filters="sRGB"
		class="st12">
	<style type="text/css">
	<![CDATA[
		.st1 {fill:#ffffff;stroke:#000000;stroke-width:1.5}
		.st2 {fill:#000000;font-family:Calibri;font-size:1.99999em}
		.st3 {baseline-shift:32.4951%;font-size:0.649901em}
		.st4 {fill:none;stroke:none;stroke-width:1.5}
		.st5 {stroke:#000000;stroke-linecap:round;stroke-linejoin:round;stroke-width:1.5}
		.st6 {fill:#ffffff;stroke:none;stroke-width:1.5}
		.st7 {fill:#000000;font-family:Calibri;font-size:1.16666em}
		.st8 {marker-end:url(#mrkr4-106);stroke:#000000;stroke-linecap:round;stroke-linejoin:round;stroke-width:1.5}
		.st9 {fill:#000000;fill-opacity:1;stroke:#000000;stroke-opacity:1;stroke-width:0.37313432835821}
		.st10 {fill:#000000;font-family:Cambria Math;font-size:1.99999em}
		.st11 {font-family:Calibri;font-size:1em}
		.st12 {fill:none;fill-rule:evenodd;font-size:12px;overflow:visible;stroke-linecap:square;stroke-miterlimit:3}
	]]>
	</style>

	<defs id="Markers">
		<g id="lend4">
			<path d="M 2 1 L 0 0 L 2 -1 L 2 1 " style="stroke:none"/>
		</g>
		<marker id="mrkr4-106" class="st9" refX="-5.36" orient="auto" markerUnits="strokeWidth" overflow="visible">
			<use xlink:href="#lend4" transform="scale(-2.68,-2.68) "/>
		</marker>
	</defs>
	<g>
		<title>Page-1</title>
		<g id="group61-1" transform="translate(1.5,-1.5)">
			<title>Sheet.61</title>
			<g id="shape62-2" transform="translate(340.157,-226.772)">
				<title>Rectangle.204</title>
				<desc>Z-1</desc>
				<rect x="0" y="229.772" width="56.6929" height="56.6929" class="st1"/>
				<text x="16.39" y="265.32" class="st2">Z<tspan dy="-0.234em" class="st3">-</tspan><tspan class="st3">1</tspan></text>			</g>
			<g id="shape63-7" transform="translate(170.079,-226.772)">
				<title>Rectangle.205</title>
				<desc>Z-1</desc>
				<rect x="0" y="229.772" width="56.6929" height="56.6929" class="st1"/>
				<text x="16.39" y="265.32" class="st2">Z<tspan dy="-0.234em" class="st3">-</tspan><tspan class="st3">1</tspan></text>			</g>
			<g id="shape64-12" transform="translate(524.409,-226.772)">
				<title>Rectangle.206</title>
				<desc>...</desc>
				<rect x="0" y="229.772" width="56.6929" height="56.6929" class="st4"/>
				<text x="19.26" y="265.32" class="st2">...</text>			</g>
			<g id="shape65-15" transform="translate(637.795,-226.849)">
				<title>Rectangle.207</title>
				<desc>Z-1</desc>
				<rect x="0" y="229.849" width="56.6929" height="56.6156" class="st1"/>
				<text x="16.39" y="265.36" class="st2">Z<tspan dy="-0.234em" class="st3">-</tspan><tspan class="st3">1</tspan></text>			</g>
			<g id="group66-20" transform="translate(708.661,-113.386)">
				<title>Sheet.66</title>
				<g id="shape67-21">
					<title>Circle</title>
					<path d="M0 258.12 A28.3465 28.3465 0 0 1 56.69 258.12 A28.3465 28.3465 0 0 1 0 258.12 Z" class="st1"/>
				</g>
				<g id="shape68-23" transform="translate(-194.261,75.6037) rotate(-45)">
					<title>Sheet.68</title>
					<path d="M0 286.46 L56.7 286.46" class="st5"/>
				</g>
				<g id="shape69-26" transform="translate(-154.168,480.726) rotate(-135)">
					<title>Sheet.69</title>
					<path d="M0 286.46 L56.7 286.46" class="st5"/>
				</g>
			</g>
			<g id="group70-29" transform="translate(262.205,-113.386)">
				<title>Sheet.70</title>
				<g id="shape71-30">
					<title>Circle</title>
					<path d="M0 258.12 A28.3465 28.3465 0 0 1 56.69 258.12 A28.3465 28.3465 0 0 1 0 258.12 Z" class="st1"/>
				</g>
				<g id="shape72-32" transform="translate(-194.261,75.6037) rotate(-45)">
					<title>Sheet.72</title>
					<path d="M0 286.46 L56.7 286.46" class="st5"/>
				</g>
				<g id="shape73-35" transform="translate(-154.168,480.726) rotate(-135)">
					<title>Sheet.73</title>
					<path d="M0 286.46 L56.7 286.46" class="st5"/>
				</g>
			</g>
			<g id="group74-38" transform="translate(99.2126,-113.386)">
				<title>Sheet.74</title>
				<g id="shape75-39">
					<title>Circle</title>
					<path d="M0 258.12 A28.3465 28.3465 0 0 1 56.69 258.12 A28.3465 28.3465 0 0 1 0 258.12 Z" class="st1"/>
				</g>
				<g id="shape76-41" transform="translate(-194.261,75.6037) rotate(-45)">
					<title>Sheet.76</title>
					<path d="M0 286.46 L56.7 286.46" class="st5"/>
				</g>
				<g id="shape77-44" transform="translate(-154.168,480.726) rotate(-135)">
					<title>Sheet.77</title>
					<path d="M0 286.46 L56.7 286.46" class="st5"/>
				</g>
			</g>
			<g id="group78-47" transform="translate(425.197,-113.386)">
				<title>Sheet.78</title>
				<g id="shape79-48">
					<title>Circle</title>
					<path d="M0 258.12 A28.3465 28.3465 0 0 1 56.69 258.12 A28.3465 28.3465 0 0 1 0 258.12 Z" class="st1"/>
				</g>
				<g id="shape80-50" transform="translate(-194.261,75.6037) rotate(-45)">
					<title>Sheet.80</title>
					<path d="M0 286.46 L56.7 286.46" class="st5"/>
				</g>
				<g id="shape81-53" transform="translate(-154.168,480.726) rotate(-135)">
					<title>Sheet.81</title>
					<path d="M0 286.46 L56.7 286.46" class="st5"/>
				</g>
			</g>
			<g id="shape82-56" transform="translate(524.409,-7.95808E-013)">
				<title>Rectangle.224</title>
				<desc>...</desc>
				<rect x="0" y="229.772" width="56.6929" height="56.6929" class="st4"/>
				<text x="19.26" y="265.32" class="st2">...</text>			</g>
			<g id="group83-59" transform="translate(261.56,0)">
				<title>Sheet.83</title>
				<g id="shape84-60">
					<title>Circle</title>
					<path d="M0 258.12 A28.3465 28.3465 0 0 1 56.69 258.12 A28.3465 28.3465 0 1 1 0 258.12 Z" class="st1"/>
				</g>
				<g id="shape85-62" transform="translate(314.811,229.772) rotate(90)">
					<title>Sheet.85</title>
					<path d="M0 286.46 L56.69 286.46" class="st5"/>
				</g>
				<g id="shape86-65" transform="translate(0,-28.3465)">
					<title>Sheet.86</title>
					<path d="M0 286.46 L56.69 286.46" class="st5"/>
				</g>
			</g>
			<g id="group87-68" transform="translate(425.197,-5.11591E-013)">
				<title>Sheet.87</title>
				<g id="shape88-69">
					<title>Circle</title>
					<path d="M0 258.12 A28.3465 28.3465 0 0 1 56.69 258.12 A28.3465 28.3465 0 1 1 0 258.12 Z" class="st1"/>
				</g>
				<g id="shape89-71" transform="translate(314.811,229.772) rotate(90)">
					<title>Sheet.89</title>
					<path d="M0 286.46 L56.69 286.46" class="st5"/>
				</g>
				<g id="shape90-74" transform="translate(0,-28.3465)">
					<title>Sheet.90</title>
					<path d="M0 286.46 L56.69 286.46" class="st5"/>
				</g>
			</g>
			<g id="group91-77" transform="translate(708.661,-5.11591E-013)">
				<title>Sheet.91</title>
				<g id="shape92-78">
					<title>Circle</title>
					<path d="M0 258.12 A28.3465 28.3465 0 0 1 56.69 258.12 A28.3465 28.3465 0 1 1 0 258.12 Z" class="st1"/>
				</g>
				<g id="shape93-80" transform="translate(314.811,229.772) rotate(90)">
					<title>Sheet.93</title>
					<path d="M0 286.46 L56.69 286.46" class="st5"/>
				</g>
				<g id="shape94-83" transform="translate(0,-28.3465)">
					<title>Sheet.94</title>
					<path d="M0 286.46 L56.69 286.46" class="st5"/>
				</g>
			</g>
			<g id="shape95-86" transform="translate(6.39488E-014,-231.732)">
				<title>Rectangle.59</title>
				<desc>x(n)</desc>
				<rect x="0" y="239.693" width="31.8898" height="46.7717" class="st6"/>
				<text x="5.98" y="267.28" class="st7">x(n)</text>			</g>
			<g id="shape96-89" transform="translate(40.748,-118.346)">
				<title>Rectangle.57</title>
				<desc>h(0)</desc>
				<rect x="0" y="239.693" width="31.8898" height="46.7717" class="st6"/>
				<text x="4.95" y="267.28" class="st7">h(0)</text>			</g>
			<g id="shape97-92" transform="translate(191.339,-118.346)">
				<title>Rectangle.243</title>
				<desc>h(1)</desc>
				<rect x="0" y="239.693" width="31.8898" height="46.7717" class="st6"/>
				<text x="4.95" y="267.28" class="st7">h(1)</text>			</g>
			<g id="shape98-95" transform="translate(354.331,-118.346)">
				<title>Rectangle.244</title>
				<desc>h(2)</desc>
				<rect x="0" y="239.693" width="31.8898" height="46.7717" class="st6"/>
				<text x="4.95" y="267.28" class="st7">h(2)</text>			</g>
			<g id="shape99-98" transform="translate(609.449,-118.346)">
				<title>Rectangle.245</title>
				<desc>h(N - 1)</desc>
				<rect x="0" y="239.693" width="56.6929" height="46.7717" class="st6"/>
				<text x="10.1" y="267.28" class="st7">h(N - 1)</text>			</g>
			<g id="shape100-101" transform="translate(31.8898,-248.031)">
				<title>Dynamic connector</title>
				<path d="M0 279.38 L130.15 279.38" class="st8"/>
			</g>
			<g id="shape101-107" transform="translate(72.6378,-134.646)">
				<title>Dynamic connector.248</title>
				<path d="M0 279.38 L18.53 279.38" class="st8"/>
			</g>
			<g id="shape102-112" transform="translate(223.228,-134.646)">
				<title>Dynamic connector.249</title>
				<path d="M0 279.38 L30.94 279.38" class="st8"/>
			</g>
			<g id="shape103-117" transform="translate(386.221,-134.646)">
				<title>Dynamic connector.250</title>
				<path d="M0 279.38 L30.94 279.38" class="st8"/>
			</g>
			<g id="shape104-122" transform="translate(666.142,-134.646)">
				<title>Dynamic connector.251</title>
				<path d="M0 279.38 L34.48 279.38" class="st8"/>
			</g>
			<g id="shape105-127" transform="translate(226.772,-248.031)">
				<title>Dynamic connector.252</title>
				<path d="M0 279.38 L105.35 279.38" class="st8"/>
			</g>
			<g id="shape106-132" transform="translate(396.85,-248.031)">
				<title>Dynamic connector.253</title>
				<path d="M0 279.38 L119.52 279.38" class="st8"/>
			</g>
			<g id="shape107-137" transform="translate(396.85,-255.118)">
				<title>Dynamic connector.254</title>
				<path d="M0 286.46 L56.69 286.46 L56.69 363.46" class="st8"/>
			</g>
			<g id="shape108-142" transform="translate(581.102,-248.051)">
				<title>Dynamic connector.255</title>
				<path d="M0 279.4 L48.65 279.36" class="st8"/>
			</g>
			<g id="shape109-147" transform="translate(31.8898,-255.118)">
				<title>Dynamic connector.259</title>
				<path d="M0 286.46 L95.67 286.46 L95.67 363.46" class="st8"/>
			</g>
			<g id="shape110-152" transform="translate(226.772,-255.118)">
				<title>Dynamic connector.260</title>
				<path d="M0 286.46 L63.78 286.46 L63.78 363.46" class="st8"/>
			</g>
			<g id="shape111-157" transform="translate(297.316,-113.386)">
				<title>Dynamic connector.261</title>
				<path d="M-6.76 286.46 L-7.32 335.12" class="st8"/>
			</g>
			<g id="shape112-162" transform="translate(446.457,-113.386)">
				<title>Dynamic connector.262</title>
				<path d="M7.09 286.46 L7.09 335.12" class="st8"/>
			</g>
			<g id="shape113-167" transform="translate(318.253,-21.2598)">
				<title>Dynamic connector.263</title>
				<path d="M0 279.38 L98.9 279.38" class="st8"/>
			</g>
			<g id="shape114-172" transform="translate(481.89,-21.2598)">
				<title>Dynamic connector.264</title>
				<path d="M0 279.38 L34.48 279.38" class="st8"/>
			</g>
			<g id="shape115-177" transform="translate(581.102,-21.2598)">
				<title>Dynamic connector.265</title>
				<path d="M0 279.38 L119.52 279.38" class="st8"/>
			</g>
			<g id="shape116-182" transform="translate(694.488,-255.157)">
				<title>Dynamic connector.266</title>
				<path d="M0 286.46 L42.52 286.46 L42.52 363.5" class="st8"/>
			</g>
			<g id="shape117-187" transform="translate(729.921,-113.386)">
				<title>Dynamic connector.267</title>
				<path d="M7.09 286.46 L7.09 335.12" class="st8"/>
			</g>
			<g id="shape118-192" transform="translate(905.315,-4.47002)">
				<title>Rectangle.134</title>
				<desc>y(n)</desc>
				<rect x="0" y="239.693" width="31.8898" height="46.7717" class="st6"/>
				<text x="4" y="267.28" class="st7">y(n)</text>			</g>
			<g id="shape119-195" transform="translate(807.874,-0.0773079)">
				<title>Rectangle.119</title>
				<desc>⪢ Sf</desc>
				<rect x="0" y="229.849" width="56.6929" height="56.6156" class="st1"/>
				<text x="7.47" y="265.56" class="st10">⪢<tspan class="st11"> </tspan><tspan class="st11">Sf</tspan></text>			</g>
			<g id="shape120-200" transform="translate(765.354,-21.2792)">
				<title>Dynamic connector.123</title>
				<path d="M0 279.4 L34.48 279.37" class="st8"/>
			</g>
			<g id="shape121-205" transform="translate(864.567,-35.2071)">
				<title>Dynamic connector.124</title>
				<path d="M0 293.29 L32.71 293.71" class="st8"/>
			</g>
		</g>
		<g id="shape122-210" transform="translate(129.059,-114.886)">
			<title>Dynamic connector.127</title>
			<path d="M0 286.46 L0 371.5 L125.96 371.5" class="st8"/>
		</g>
	</g>
</svg>
