<?xml version="1.0" encoding="UTF-8"?>
<!DOCTYPE svg PUBLIC "-//W3C//DTD SVG 1.1//EN" "http://www.w3.org/Graphics/SVG/1.1/DTD/svg11.dtd">
<svg version="1.2" width="140.31mm" height="78.26mm" viewBox="1203 15209 14031 7826" preserveAspectRatio="xMidYMid" fill-rule="evenodd" stroke-width="28.222" stroke-linejoin="round" xmlns="http://www.w3.org/2000/svg" xmlns:ooo="http://xml.openoffice.org/svg/export" xmlns:xlink="http://www.w3.org/1999/xlink" xmlns:presentation="http://sun.com/xmlns/staroffice/presentation" xmlns:smil="http://www.w3.org/2001/SMIL20/" xmlns:anim="urn:oasis:names:tc:opendocument:xmlns:animation:1.0" xml:space="preserve">
 <defs class="ClipPathGroup">
  <clipPath id="presentation_clip_path" clipPathUnits="userSpaceOnUse">
   <rect x="1203" y="15209" width="14031" height="7826"/>
  </clipPath>
  <clipPath id="presentation_clip_path_shrink" clipPathUnits="userSpaceOnUse">
   <rect x="1217" y="15216" width="14003" height="7811"/>
  </clipPath>
 </defs>
 <defs>
  <font id="EmbeddedFont_1" horiz-adv-x="2048">
   <font-face font-family="Liberation Mono embedded" units-per-em="2048" font-weight="normal" font-style="normal" ascent="1693" descent="609"/>
   <missing-glyph horiz-adv-x="2048" d="M 0,0 L 2047,0 2047,2047 0,2047 0,0 Z"/>
   <glyph unicode="v" horiz-adv-x="1112" d="M 715,0 L 502,0 69,1082 271,1082 539,378 C 544,363 550,346 556,325 562,304 568,282 575,259 582,236 588,215 594,194 599,173 604,155 608,141 612,155 617,173 624,194 630,215 636,236 643,258 650,280 657,302 664,323 671,344 677,361 682,376 L 958,1082 1159,1082 715,0 Z"/>
   <glyph unicode="u" horiz-adv-x="900" d="M 365,1082 L 365,396 C 365,343 369,299 377,264 384,229 397,200 415,179 432,157 455,142 484,133 512,124 547,119 589,119 632,119 670,127 705,142 739,157 768,178 793,207 817,235 836,270 849,312 862,353 868,401 868,455 L 868,1082 1049,1082 1049,231 C 1049,208 1049,185 1050,160 1050,135 1050,111 1051,89 1052,66 1052,47 1053,31 1054,15 1054,5 1055,0 L 885,0 C 884,3 884,12 883,27 882,42 882,59 881,78 880,97 879,116 878,136 877,155 877,172 877,185 L 874,185 C 857,154 838,125 817,100 796,75 772,53 745,36 718,18 686,4 651,-6 616,-15 575,-20 528,-20 468,-20 416,-13 373,2 330,17 294,39 266,70 238,101 218,140 205,189 192,237 185,294 185,361 L 185,1082 365,1082 Z"/>
   <glyph unicode="t" horiz-adv-x="848" d="M 190,940 L 190,1082 360,1082 418,1364 538,1364 538,1082 970,1082 970,940 538,940 538,288 C 538,235 552,196 581,171 609,146 655,133 720,133 747,133 774,134 803,137 831,139 858,142 885,145 911,148 936,152 959,156 982,160 1001,164 1017,167 L 1017,30 C 1002,26 983,21 960,16 937,11 911,6 882,1 853,-4 821,-8 787,-11 753,-14 718,-16 682,-16 574,-16 493,7 439,53 385,98 358,170 358,269 L 358,940 190,940 Z"/>
   <glyph unicode="r" horiz-adv-x="821" d="M 1045,918 C 1014,923 981,928 947,932 912,935 874,937 833,937 777,937 727,926 682,903 637,880 600,850 569,811 538,772 515,726 499,674 482,622 474,567 474,508 L 474,0 294,0 294,701 C 294,738 292,776 288,815 284,854 279,890 274,925 269,959 263,990 257,1017 251,1044 246,1066 242,1082 L 413,1082 C 418,1066 423,1048 428,1027 433,1006 437,985 442,963 447,940 451,918 454,895 457,872 460,851 461,832 L 466,832 C 485,873 504,911 525,944 546,977 570,1006 599,1029 627,1052 660,1070 699,1083 738,1096 784,1102 839,1102 876,1102 913,1100 949,1097 985,1094 1017,1090 1045,1085 L 1045,918 Z"/>
   <glyph unicode="p" horiz-adv-x="927" d="M 1090,546 C 1090,464 1083,388 1070,319 1057,250 1035,190 1004,140 973,90 933,51 883,23 833,-6 771,-20 698,-20 661,-20 626,-17 593,-10 560,-3 529,7 500,22 471,37 446,56 424,79 401,102 382,131 367,164 L 362,164 C 363,163 363,157 364,147 364,136 364,123 365,108 365,93 365,75 366,56 366,37 366,17 366,-2 L 366,-425 185,-425 185,858 C 185,885 185,910 185,935 184,960 184,982 183,1002 182,1021 182,1038 181,1052 180,1066 180,1076 179,1082 L 354,1082 C 355,1080 356,1073 357,1061 358,1048 359,1033 360,1016 361,999 362,980 363,960 364,940 364,921 364,904 L 368,904 C 385,939 404,969 425,994 446,1019 469,1040 496,1057 523,1073 553,1085 586,1093 619,1100 657,1104 698,1104 771,1104 833,1091 883,1064 933,1037 973,1000 1004,951 1035,902 1057,843 1070,774 1083,705 1090,629 1090,546 Z M 904,546 C 904,613 900,672 892,724 884,776 870,820 851,856 831,891 805,918 773,937 740,956 700,965 651,965 612,965 575,959 540,947 505,934 475,912 450,880 424,847 404,802 389,745 374,688 366,614 366,524 366,447 372,383 385,331 397,278 415,236 439,204 463,171 493,148 528,134 563,120 604,113 649,113 698,113 738,123 771,142 804,161 830,188 850,225 869,262 883,307 892,361 900,415 904,477 904,546 Z"/>
   <glyph unicode="o" horiz-adv-x="1006" d="M 1097,542 C 1097,447 1086,365 1064,295 1041,224 1009,166 967,119 925,72 874,38 814,15 753,-8 685,-20 609,-20 536,-20 471,-9 412,14 353,37 302,71 261,118 219,165 187,223 164,294 141,364 130,447 130,542 130,728 172,868 257,962 341,1055 460,1102 615,1102 778,1102 899,1056 978,963 1057,870 1097,730 1097,542 Z M 908,542 C 908,626 901,695 887,750 872,805 852,848 827,881 801,914 770,937 735,950 700,963 661,969 618,969 575,969 535,962 498,949 461,935 430,912 404,879 377,846 357,802 342,747 327,692 319,624 319,542 319,458 327,389 343,334 358,279 379,235 406,202 432,169 463,146 498,133 533,120 569,113 607,113 650,113 691,120 728,133 765,146 796,168 823,201 850,234 871,278 886,333 901,388 908,458 908,542 Z"/>
   <glyph unicode="n" horiz-adv-x="900" d="M 868,0 L 868,695 C 868,748 863,792 852,827 841,861 825,888 806,909 786,929 763,943 736,951 709,959 680,963 648,963 609,963 572,956 538,941 503,926 473,904 448,876 422,847 402,812 387,771 372,729 365,681 365,627 L 365,0 185,0 185,851 C 185,874 185,898 185,923 184,948 184,971 183,994 182,1016 182,1035 181,1051 180,1067 180,1077 179,1082 L 349,1082 C 350,1079 350,1070 351,1055 352,1040 353,1024 354,1005 355,986 355,966 356,947 357,927 357,910 357,897 L 360,897 C 376,928 395,957 417,982 438,1007 463,1029 492,1047 520,1064 552,1078 587,1088 622,1097 662,1102 706,1102 761,1102 810,1095 853,1080 896,1065 932,1043 961,1012 990,981 1012,942 1027,894 1042,846 1049,788 1049,721 L 1049,0 868,0 Z"/>
   <glyph unicode="i" horiz-adv-x="1007" d="M 745,142 L 1125,142 1125,0 143,0 143,142 565,142 565,940 246,940 246,1082 745,1082 745,142 Z M 545,1292 L 545,1484 745,1484 745,1292 545,1292 Z"/>
   <glyph unicode="e" horiz-adv-x="980" d="M 322,503 C 322,446 328,394 341,347 354,299 373,258 398,224 423,189 455,163 493,144 530,125 574,115 623,115 660,115 694,119 725,128 756,136 783,147 808,162 833,177 853,194 870,215 887,235 899,257 907,281 L 1065,236 C 1054,206 1038,176 1017,146 996,115 967,88 932,64 897,39 854,19 803,4 752,-12 692,-20 623,-20 546,-20 478,-8 417,16 356,40 305,76 263,123 221,170 189,230 167,301 144,372 133,454 133,548 133,652 146,739 173,810 199,881 234,938 279,981 324,1024 375,1055 434,1074 492,1093 553,1102 617,1102 704,1102 778,1088 839,1060 899,1032 948,993 986,943 1024,892 1052,832 1069,761 1086,690 1094,612 1094,527 L 1094,503 322,503 Z M 619,969 C 588,969 556,964 523,955 489,945 458,928 429,903 400,878 376,845 357,803 337,760 326,706 324,641 L 908,641 C 903,704 891,756 874,798 857,840 835,874 810,899 784,924 755,942 722,953 689,964 655,969 619,969 Z"/>
   <glyph unicode="d" horiz-adv-x="927" d="M 862,174 C 829,104 786,53 732,22 678,-10 611,-26 530,-26 395,-26 296,20 233,113 170,206 138,345 138,532 138,909 269,1098 530,1098 611,1098 678,1084 733,1055 787,1026 830,979 863,914 L 865,914 C 865,917 865,926 865,940 864,954 864,969 864,986 864,1003 864,1019 864,1034 863,1049 863,1059 863,1065 L 863,1484 1043,1484 1043,223 C 1043,197 1043,172 1044,148 1044,124 1044,102 1045,82 1046,62 1046,45 1047,31 1048,16 1048,6 1049,0 L 877,0 C 876,3 875,10 874,22 873,34 872,48 871,65 870,82 869,100 868,119 867,138 867,157 867,174 L 862,174 Z M 324,538 C 324,463 329,399 339,346 348,293 363,249 384,214 404,179 430,154 462,138 494,121 532,113 577,113 623,113 664,121 700,137 735,153 765,179 790,214 814,249 832,294 845,350 857,406 863,474 863,554 863,631 857,696 845,749 832,801 814,843 790,875 766,907 736,930 701,944 666,958 625,965 579,965 536,965 499,957 467,942 435,927 409,902 388,868 367,834 351,790 340,736 329,681 324,615 324,538 Z"/>
   <glyph unicode="a" horiz-adv-x="1059" d="M 1101,111 C 1111,111 1121,112 1131,113 1141,114 1151,116 1160,118 L 1160,6 C 1137,1 1115,-3 1093,-6 1070,-9 1046,-10 1021,-10 987,-10 958,-5 934,4 909,13 889,26 874,45 859,63 847,86 839,113 831,140 826,171 824,207 L 818,207 C 799,172 779,141 756,113 733,85 707,61 678,42 649,22 615,7 577,-4 539,-15 495,-20 446,-20 341,-20 261,9 208,66 155,123 128,202 128,302 128,373 141,432 168,478 194,523 228,559 271,585 314,611 362,629 417,640 471,650 526,655 582,656 L 818,660 818,719 C 818,764 814,802 805,833 796,864 782,890 764,909 745,928 722,943 694,952 666,961 633,965 596,965 563,965 533,963 506,958 479,953 455,944 436,931 417,918 401,900 389,878 376,855 368,827 364,793 L 176,810 C 183,853 195,892 214,928 232,963 258,994 291,1020 324,1046 366,1066 417,1081 467,1095 528,1102 599,1102 732,1102 833,1071 900,1009 967,946 1000,856 1000,738 L 1000,272 C 1000,219 1007,179 1021,152 1035,125 1062,111 1101,111 Z M 492,117 C 547,117 595,128 636,149 677,170 711,196 738,228 765,260 785,295 798,334 811,373 818,410 818,445 L 818,534 628,530 C 591,529 555,527 518,522 481,517 447,506 418,490 388,474 364,451 345,421 326,390 317,350 317,299 317,244 332,200 362,167 391,134 435,117 492,117 Z"/>
   <glyph unicode="_" horiz-adv-x="1271" d="M -5,-220 L -5,-124 1233,-124 1233,-220 -5,-220 Z"/>
  </font>
 </defs>
 <defs>
  <font id="EmbeddedFont_2" horiz-adv-x="2048">
   <font-face font-family="Liberation Sans embedded" units-per-em="2048" font-weight="normal" font-style="normal" ascent="1826" descent="423"/>
   <missing-glyph horiz-adv-x="2048" d="M 0,0 L 2047,0 2047,2047 0,2047 0,0 Z"/>
   <glyph unicode="t" horiz-adv-x="531" d="M 554,8 C 527,1 499,-5 471,-10 442,-14 409,-16 372,-16 228,-16 156,66 156,229 L 156,951 31,951 31,1082 163,1082 216,1324 336,1324 336,1082 536,1082 536,951 336,951 336,268 C 336,216 345,180 362,159 379,138 408,127 450,127 467,127 484,128 501,131 517,134 535,137 554,141 L 554,8 Z"/>
   <glyph unicode="s" horiz-adv-x="901" d="M 950,299 C 950,248 940,203 921,164 901,124 872,91 835,64 798,37 752,16 698,2 643,-13 581,-20 511,-20 448,-20 392,-15 342,-6 291,4 247,20 209,41 171,62 139,91 114,126 88,161 69,203 57,254 L 216,285 C 231,227 263,185 311,158 359,131 426,117 511,117 550,117 585,120 618,125 650,130 678,140 701,153 724,166 743,183 756,205 769,226 775,253 775,285 775,318 767,345 752,366 737,387 715,404 688,418 661,432 628,444 589,455 550,465 507,476 460,489 417,500 374,513 331,527 288,541 250,560 216,583 181,606 153,634 132,668 111,702 100,745 100,796 100,895 135,970 206,1022 276,1073 378,1099 513,1099 632,1099 727,1078 798,1036 868,994 912,927 931,834 L 769,814 C 763,842 752,866 736,885 720,904 701,919 678,931 655,942 630,951 602,956 573,961 544,963 513,963 432,963 372,951 333,926 294,901 275,864 275,814 275,785 282,761 297,742 311,723 331,707 357,694 382,681 413,669 449,660 485,650 525,640 568,629 597,622 626,614 656,606 686,597 715,587 744,576 772,564 799,550 824,535 849,519 870,500 889,478 908,456 923,430 934,401 945,372 950,338 950,299 Z"/>
   <glyph unicode="o" horiz-adv-x="980" d="M 1053,542 C 1053,353 1011,212 928,119 845,26 724,-20 565,-20 490,-20 422,-9 363,14 304,37 254,71 213,118 172,165 140,223 119,294 97,364 86,447 86,542 86,915 248,1102 571,1102 655,1102 728,1090 789,1067 850,1044 900,1009 939,962 978,915 1006,857 1025,787 1044,717 1053,635 1053,542 Z M 864,542 C 864,626 858,695 845,750 832,805 813,848 788,881 763,914 732,937 696,950 660,963 619,969 574,969 528,969 487,962 450,949 413,935 381,912 355,879 329,846 309,802 296,747 282,692 275,624 275,542 275,458 282,389 297,334 312,279 332,235 358,202 383,169 414,146 449,133 484,120 522,113 563,113 609,113 651,120 688,133 725,146 757,168 783,201 809,234 829,278 843,333 857,388 864,458 864,542 Z"/>
   <glyph unicode="n" horiz-adv-x="874" d="M 825,0 L 825,686 C 825,739 821,783 814,818 806,853 793,882 776,904 759,925 736,941 708,950 679,959 644,963 602,963 559,963 521,956 487,941 452,926 423,904 399,876 374,847 355,812 342,771 329,729 322,681 322,627 L 322,0 142,0 142,851 C 142,874 142,898 142,923 141,948 141,971 140,994 139,1016 139,1035 138,1051 137,1067 137,1077 136,1082 L 306,1082 C 307,1079 307,1070 308,1055 309,1040 310,1024 311,1005 312,986 312,966 313,947 314,927 314,910 314,897 L 317,897 C 334,928 353,957 374,982 395,1007 419,1029 446,1047 473,1064 505,1078 540,1088 575,1097 616,1102 663,1102 723,1102 775,1095 818,1080 861,1065 897,1043 925,1012 953,981 974,942 987,894 1000,845 1006,788 1006,721 L 1006,0 825,0 Z"/>
   <glyph unicode="i" horiz-adv-x="187" d="M 137,1312 L 137,1484 317,1484 317,1312 137,1312 Z M 137,0 L 137,1082 317,1082 317,0 137,0 Z"/>
   <glyph unicode="g" horiz-adv-x="927" d="M 548,-425 C 486,-425 431,-419 383,-406 335,-393 294,-375 260,-352 226,-328 198,-300 177,-267 156,-234 140,-198 131,-158 L 312,-132 C 324,-182 351,-220 392,-248 433,-274 486,-288 553,-288 594,-288 631,-282 664,-271 697,-260 726,-241 749,-217 772,-191 790,-159 803,-119 816,-79 822,-30 822,27 L 822,201 820,201 C 807,174 790,148 771,123 751,98 727,75 699,56 670,37 637,21 600,10 563,-2 520,-8 472,-8 403,-8 345,4 296,27 247,50 207,84 176,130 145,176 122,233 108,302 93,370 86,449 86,539 86,626 93,704 108,773 122,842 145,901 178,950 210,998 252,1035 304,1061 355,1086 418,1099 492,1099 569,1099 635,1082 692,1047 748,1012 791,962 822,897 L 824,897 C 824,914 825,933 826,953 827,974 828,994 829,1012 830,1031 831,1046 832,1060 833,1073 835,1080 836,1080 L 1007,1080 C 1006,1074 1006,1064 1005,1050 1004,1035 1004,1018 1003,998 1002,978 1002,956 1002,932 1001,907 1001,882 1001,856 L 1001,30 C 1001,-121 964,-234 890,-311 815,-387 701,-425 548,-425 Z M 822,541 C 822,616 814,681 798,735 781,788 760,832 733,866 706,900 676,925 642,941 607,957 572,965 536,965 490,965 451,957 418,941 385,925 357,900 336,866 314,831 298,787 288,734 277,680 272,616 272,541 272,463 277,398 288,345 298,292 314,249 335,216 356,183 383,160 416,146 449,132 488,125 533,125 569,125 604,133 639,148 673,163 704,188 731,221 758,254 780,297 797,350 814,403 822,466 822,541 Z"/>
   <glyph unicode="f" horiz-adv-x="557" d="M 361,951 L 361,0 181,0 181,951 29,951 29,1082 181,1082 181,1204 C 181,1243 185,1280 192,1314 199,1347 213,1377 233,1402 252,1427 279,1446 313,1461 347,1475 391,1482 445,1482 466,1482 489,1481 512,1479 535,1477 555,1474 572,1470 L 572,1333 C 561,1335 548,1337 533,1339 518,1340 504,1341 492,1341 465,1341 444,1337 427,1330 410,1323 396,1312 387,1299 377,1285 370,1268 367,1248 363,1228 361,1205 361,1179 L 361,1082 572,1082 572,951 361,951 Z"/>
   <glyph unicode="e" horiz-adv-x="980" d="M 276,503 C 276,446 282,394 294,347 305,299 323,258 348,224 372,189 403,163 441,144 479,125 525,115 578,115 656,115 719,131 766,162 813,193 844,233 861,281 L 1019,236 C 1008,206 992,176 972,146 951,115 924,88 890,64 856,39 814,19 763,4 712,-12 650,-20 578,-20 418,-20 296,28 213,123 129,218 87,360 87,548 87,649 100,735 125,806 150,876 185,933 229,977 273,1021 324,1053 383,1073 442,1092 504,1102 571,1102 662,1102 738,1087 799,1058 860,1029 909,988 946,937 983,885 1009,824 1025,754 1040,684 1048,608 1048,527 L 1048,503 276,503 Z M 862,641 C 852,755 823,838 775,891 727,943 658,969 568,969 538,969 507,964 474,955 441,945 410,928 382,903 354,878 330,845 311,803 292,760 281,706 278,641 L 862,641 Z"/>
   <glyph unicode="c" horiz-adv-x="901" d="M 275,546 C 275,484 280,427 289,375 298,323 313,278 334,241 355,203 384,174 419,153 454,132 497,122 548,122 612,122 666,139 709,174 752,209 778,262 788,334 L 970,322 C 964,277 951,234 931,193 911,152 884,115 850,84 815,53 773,28 724,9 675,-10 618,-20 553,-20 468,-20 396,-6 337,23 278,52 230,91 193,142 156,192 129,251 112,320 95,388 87,462 87,542 87,615 93,679 105,735 117,790 134,839 156,881 177,922 203,957 232,986 261,1014 293,1037 328,1054 362,1071 398,1083 436,1091 474,1098 512,1102 551,1102 612,1102 666,1094 713,1077 760,1060 801,1038 836,1009 870,980 898,945 919,906 940,867 955,824 964,779 L 779,765 C 770,825 746,873 708,908 670,943 616,961 546,961 495,961 452,953 418,936 383,919 355,893 334,859 313,824 298,781 289,729 280,677 275,616 275,546 Z"/>
   <glyph unicode="b" horiz-adv-x="953" d="M 1053,546 C 1053,169 920,-20 655,-20 573,-20 505,-5 451,25 396,54 352,102 318,168 L 316,168 C 316,151 316,133 315,114 314,95 313,78 312,62 311,46 310,32 309,21 308,10 307,3 306,0 L 132,0 C 133,6 133,16 134,31 135,45 135,62 136,82 137,102 137,124 138,148 138,172 138,197 138,223 L 138,1484 318,1484 318,1061 C 318,1041 318,1022 318,1004 317,985 317,969 316,955 315,938 315,923 314,908 L 318,908 C 351,977 396,1027 451,1057 506,1087 574,1102 655,1102 792,1102 892,1056 957,964 1021,872 1053,733 1053,546 Z M 864,540 C 864,615 859,679 850,732 841,785 826,829 805,864 784,898 758,923 726,939 694,955 655,963 609,963 562,963 520,955 484,940 447,925 417,900 393,866 368,832 350,787 337,732 324,677 318,609 318,529 318,452 324,387 337,334 350,281 368,239 393,206 417,173 447,149 483,135 519,120 560,113 607,113 651,113 689,121 721,136 753,151 780,176 801,210 822,244 838,288 849,343 859,397 864,463 864,540 Z"/>
   <glyph unicode="a" horiz-adv-x="1060" d="M 414,-20 C 305,-20 224,9 169,66 114,123 87,202 87,302 87,373 101,432 128,478 155,523 190,559 234,585 277,611 327,629 383,639 439,649 496,655 554,656 L 797,660 797,719 C 797,764 792,802 783,833 774,864 759,890 740,909 721,928 697,943 668,952 639,961 604,965 565,965 530,965 499,963 471,958 443,953 419,944 398,931 377,918 361,900 348,878 335,855 327,827 323,793 L 135,810 C 142,853 154,892 173,928 192,963 218,994 253,1020 287,1046 330,1066 382,1081 433,1095 496,1102 569,1102 705,1102 807,1071 876,1009 945,946 979,856 979,738 L 979,272 C 979,219 986,179 1000,152 1014,125 1041,111 1080,111 1090,111 1100,112 1110,113 1120,114 1130,116 1139,118 L 1139,6 C 1116,1 1094,-3 1072,-6 1049,-9 1025,-10 1000,-10 966,-10 937,-5 913,4 888,13 868,26 853,45 838,63 826,86 818,113 810,140 805,171 803,207 L 797,207 C 778,172 757,141 734,113 711,85 684,61 653,42 622,22 588,7 549,-4 510,-15 465,-20 414,-20 Z M 455,115 C 512,115 563,126 606,147 649,168 684,194 713,227 741,260 762,295 776,334 790,373 797,410 797,445 L 797,534 600,530 C 556,529 514,526 475,521 435,515 400,504 370,487 340,470 316,447 299,417 281,387 272,348 272,299 272,240 288,195 320,163 351,131 396,115 455,115 Z"/>
   <glyph unicode="M" horiz-adv-x="1377" d="M 1366,0 L 1366,940 C 1366,974 1366,1009 1367,1044 1368,1079 1369,1112 1370,1141 1371,1175 1373,1208 1375,1240 1366,1206 1356,1172 1346,1139 1337,1110 1328,1080 1318,1048 1307,1015 1297,986 1287,960 L 923,0 789,0 420,960 C 416,970 412,982 408,995 403,1008 399,1023 394,1038 389,1053 384,1068 379,1084 374,1099 369,1115 364,1130 353,1165 342,1202 331,1240 332,1203 333,1166 334,1129 335,1098 336,1065 337,1031 338,996 338,966 338,940 L 338,0 168,0 168,1409 419,1409 794,432 C 799,419 804,402 811,381 818,360 824,338 830,316 836,294 842,273 847,254 852,234 855,219 857,208 859,219 863,234 868,254 873,274 880,295 887,317 894,339 900,360 907,381 914,402 920,419 925,432 L 1293,1409 1538,1409 1538,0 1366,0 Z"/>
   <glyph unicode="L" horiz-adv-x="927" d="M 168,0 L 168,1409 359,1409 359,156 1071,156 1071,0 168,0 Z"/>
   <glyph unicode=" " horiz-adv-x="556"/>
  </font>
 </defs>
 <defs>
  <font id="EmbeddedFont_3" horiz-adv-x="2048">
   <font-face font-family="Liberation Serif embedded" units-per-em="2048" font-weight="normal" font-style="normal" ascent="1799" descent="423"/>
   <missing-glyph horiz-adv-x="2048" d="M 0,0 L 2047,0 2047,2047 0,2047 0,0 Z"/>
   <glyph unicode="1" horiz-adv-x="742" d="M 627,80 L 901,53 901,0 180,0 180,53 455,80 455,1174 184,1077 184,1130 575,1352 627,1352 627,80 Z"/>
   <glyph unicode="0" horiz-adv-x="901" d="M 946,676 C 946,564 937,465 920,378 902,291 875,219 839,160 803,101 757,56 702,26 647,-5 581,-20 506,-20 365,-20 258,39 186,158 114,277 78,449 78,676 78,898 114,1068 186,1186 258,1303 367,1362 514,1362 655,1362 763,1304 836,1188 909,1071 946,901 946,676 Z M 762,676 C 762,772 758,858 750,933 741,1008 727,1072 708,1124 688,1175 662,1215 629,1242 596,1269 555,1282 506,1282 457,1282 416,1269 385,1242 353,1215 328,1175 310,1124 292,1072 280,1008 273,933 266,858 262,772 262,676 262,580 266,494 273,418 280,341 292,277 310,224 328,171 353,130 385,102 416,73 457,59 506,59 555,59 596,73 629,102 662,130 688,171 708,224 727,277 741,341 750,418 758,494 762,580 762,676 Z"/>
  </font>
 </defs>
 <defs>
  <font id="EmbeddedFont_4" horiz-adv-x="2048">
   <font-face font-family="Liberation Serif embedded" units-per-em="2048" font-weight="normal" font-style="italic" ascent="1799" descent="423"/>
   <missing-glyph horiz-adv-x="2048" d="M 0,0 L 2047,0 2047,2047 0,2047 0,0 Z"/>
   <glyph unicode="n" horiz-adv-x="901" d="M 755,748 C 755,778 747,802 731,821 715,840 690,849 655,849 627,849 598,843 569,830 540,817 511,800 484,779 457,758 431,735 408,709 385,682 365,656 349,630 L 239,0 73,0 226,871 108,896 116,941 394,941 367,749 C 392,782 419,811 447,838 474,865 503,887 533,906 562,925 593,939 624,950 655,960 686,965 718,965 749,965 777,961 802,953 827,945 848,932 866,915 883,898 897,876 907,849 916,822 921,791 921,754 921,746 920,735 919,722 917,708 915,693 912,677 909,661 907,645 904,628 901,611 899,595 896,580 L 808,69 939,45 931,0 630,0 732,582 C 735,597 737,612 740,628 743,644 745,660 748,675 750,690 752,704 753,717 754,730 755,740 755,748 Z"/>
   <glyph unicode="e" horiz-adv-x="821" d="M 863,760 C 863,717 849,676 822,637 795,598 755,564 703,533 650,502 586,476 509,455 432,434 343,420 244,413 243,407 243,398 242,385 241,372 240,357 240,340 240,307 243,276 250,245 256,214 267,187 283,163 299,139 321,120 348,106 375,91 410,84 452,84 512,84 567,94 618,115 669,135 716,158 760,184 L 789,142 C 768,124 743,105 714,86 685,67 654,49 621,34 587,18 551,5 514,-5 477,-15 439,-20 400,-20 343,-20 294,-12 252,5 210,21 175,44 147,74 119,104 98,141 84,184 70,227 63,276 63,330 63,389 70,446 83,501 96,555 115,606 139,653 163,700 192,742 225,781 258,819 295,852 334,879 373,906 414,928 458,943 501,958 546,965 591,965 634,965 672,960 706,950 739,939 768,925 791,907 814,888 832,867 845,842 857,817 863,789 863,760 Z M 252,476 C 325,481 388,493 443,511 498,528 543,550 580,576 616,601 643,630 661,662 679,693 688,726 688,760 688,797 678,828 658,852 637,876 608,888 569,888 530,888 493,876 458,851 423,826 392,793 365,754 337,715 313,671 294,622 275,573 261,524 252,476 Z"/>
   <glyph unicode="d" horiz-adv-x="980" d="M 783,941 C 784,949 785,961 787,976 789,991 791,1006 794,1023 797,1039 799,1055 802,1070 804,1085 806,1098 808,1108 L 851,1352 697,1376 705,1421 1029,1421 789,70 902,45 894,0 609,0 638,156 C 582,97 528,53 477,24 426,-6 376,-21 329,-21 289,-21 253,-13 220,2 187,17 159,40 136,69 113,98 95,133 82,175 69,217 62,264 62,317 62,374 68,430 81,485 94,539 112,590 135,638 158,686 187,730 220,770 253,809 290,844 331,873 372,902 417,924 466,940 514,956 565,964 618,964 651,964 682,962 709,958 736,954 760,948 783,941 Z M 760,837 C 737,852 713,864 688,873 663,882 633,886 598,886 562,886 528,878 497,863 466,848 437,827 410,801 383,774 360,743 339,708 318,673 300,635 285,594 270,553 259,511 252,468 244,425 240,382 240,339 240,297 245,261 254,232 263,202 276,178 291,159 306,140 323,126 343,117 362,108 382,104 403,104 440,104 481,116 525,141 568,165 610,199 651,243 L 760,837 Z"/>
  </font>
 </defs>
 <defs>
  <font id="EmbeddedFont_5" horiz-adv-x="2048">
   <font-face font-family="OpenSymbol embedded" units-per-em="2048" font-weight="normal" font-style="normal" ascent="1402" descent="423"/>
   <missing-glyph horiz-adv-x="2048" d="M 0,0 L 2047,0 2047,2047 0,2047 0,0 Z"/>
   <glyph unicode="+" horiz-adv-x="980" d="M 512,115 L 512,516 115,516 115,684 512,684 512,1083 682,1083 682,684 1081,684 1081,516 682,516 682,115 512,115 Z"/>
  </font>
 </defs>
 <defs class="TextShapeIndex">
  <g ooo:slide="id1" ooo:id-list="id3 id4 id5 id6 id7 id8 id9 id10 id11 id12 id13 id14 id15 id16 id17 id18 id19 id20 id21 id22 id23 id24 id25 id26 id27 id28 id29 id30 id31 id32 id33 id34 id35 id36 id37 id38 id39 id40 id41 id42 id43 id44 id45 id46 id47 id48 id49 id50 id51 id52 id53 id54 id55 id56 id57 id58 id59 id60 id61 id62 id63 id64 id65 id66 id67 id68"/>
 </defs>
 <defs class="EmbeddedBulletChars">
  <g id="bullet-char-template(57356)" transform="scale(0.00048828125,-0.00048828125)">
   <path d="M 580,1141 L 1163,571 580,0 -4,571 580,1141 Z"/>
  </g>
  <g id="bullet-char-template(57354)" transform="scale(0.00048828125,-0.00048828125)">
   <path d="M 8,1128 L 1137,1128 1137,0 8,0 8,1128 Z"/>
  </g>
  <g id="bullet-char-template(10146)" transform="scale(0.00048828125,-0.00048828125)">
   <path d="M 174,0 L 602,739 174,1481 1456,739 174,0 Z M 1358,739 L 309,1346 659,739 1358,739 Z"/>
  </g>
  <g id="bullet-char-template(10132)" transform="scale(0.00048828125,-0.00048828125)">
   <path d="M 2015,739 L 1276,0 717,0 1260,543 174,543 174,936 1260,936 717,1481 1274,1481 2015,739 Z"/>
  </g>
  <g id="bullet-char-template(10007)" transform="scale(0.00048828125,-0.00048828125)">
   <path d="M 0,-2 C -7,14 -16,27 -25,37 L 356,567 C 262,823 215,952 215,954 215,979 228,992 255,992 264,992 276,990 289,987 310,991 331,999 354,1012 L 381,999 492,748 772,1049 836,1024 860,1049 C 881,1039 901,1025 922,1006 886,937 835,863 770,784 769,783 710,716 594,584 L 774,223 C 774,196 753,168 711,139 L 727,119 C 717,90 699,76 672,76 641,76 570,178 457,381 L 164,-76 C 142,-110 111,-127 72,-127 30,-127 9,-110 8,-76 1,-67 -2,-52 -2,-32 -2,-23 -1,-13 0,-2 Z"/>
  </g>
  <g id="bullet-char-template(10004)" transform="scale(0.00048828125,-0.00048828125)">
   <path d="M 285,-33 C 182,-33 111,30 74,156 52,228 41,333 41,471 41,549 55,616 82,672 116,743 169,778 240,778 293,778 328,747 346,684 L 369,508 C 377,444 397,411 428,410 L 1163,1116 C 1174,1127 1196,1133 1229,1133 1271,1133 1292,1118 1292,1087 L 1292,965 C 1292,929 1282,901 1262,881 L 442,47 C 390,-6 338,-33 285,-33 Z"/>
  </g>
  <g id="bullet-char-template(9679)" transform="scale(0.00048828125,-0.00048828125)">
   <path d="M 813,0 C 632,0 489,54 383,161 276,268 223,411 223,592 223,773 276,916 383,1023 489,1130 632,1184 813,1184 992,1184 1136,1130 1245,1023 1353,916 1407,772 1407,592 1407,412 1353,268 1245,161 1136,54 992,0 813,0 Z"/>
  </g>
  <g id="bullet-char-template(8226)" transform="scale(0.00048828125,-0.00048828125)">
   <path d="M 346,457 C 273,457 209,483 155,535 101,586 74,649 74,723 74,796 101,859 155,911 209,963 273,989 346,989 419,989 480,963 531,910 582,859 608,796 608,723 608,648 583,586 532,535 482,483 420,457 346,457 Z"/>
  </g>
  <g id="bullet-char-template(8211)" transform="scale(0.00048828125,-0.00048828125)">
   <path d="M -4,459 L 1135,459 1135,606 -4,606 -4,459 Z"/>
  </g>
  <g id="bullet-char-template(61548)" transform="scale(0.00048828125,-0.00048828125)">
   <path d="M 173,740 C 173,903 231,1043 346,1159 462,1274 601,1332 765,1332 928,1332 1067,1274 1183,1159 1299,1043 1357,903 1357,740 1357,577 1299,437 1183,322 1067,206 928,148 765,148 601,148 462,206 346,322 231,437 173,577 173,740 Z"/>
  </g>
 </defs>
 <defs class="TextEmbeddedBitmaps"/>
 <g class="SlideGroup">
  <g>
   <g id="container-id1">
    <g id="id1" class="Slide" clip-path="url(#presentation_clip_path)">
     <g class="Page">
      <g class="OLE2">
       <g id="id3">
        <rect class="BoundingBox" stroke="none" fill="none" x="1900" y="18154" width="425" height="467"/>
        <defs>
         <clipPath id="clip_path_1" clipPathUnits="userSpaceOnUse">
          <path d="M 1905,18150 L 2328,18150 2328,18627 1905,18627 1905,18150 Z"/>
         </clipPath>
        </defs>
        <g clip-path="url(#clip_path_1)">
         <text class="TextShape"><tspan class="TextParagraph" font-family="Liberation Serif, serif" font-size="422px" font-style="italic" font-weight="400"><tspan class="TextPosition" x="2006" y="18524"><tspan fill="rgb(0,0,0)" stroke="none">n</tspan></tspan></tspan></text>
        </g>
       </g>
      </g>
      <g class="OLE2">
       <g id="id4">
        <rect class="BoundingBox" stroke="none" fill="none" x="12641" y="18154" width="412" height="467"/>
        <defs>
         <clipPath id="clip_path_2" clipPathUnits="userSpaceOnUse">
          <path d="M 12647,18150 L 13044,18150 13044,18627 12647,18627 12647,18150 Z"/>
         </clipPath>
        </defs>
        <g clip-path="url(#clip_path_2)">
         <text class="TextShape"><tspan class="TextParagraph" font-family="Liberation Serif, serif" font-size="422px" font-weight="400"><tspan class="TextPosition" x="12747" y="18524"><tspan fill="rgb(0,0,0)" stroke="none">1</tspan></tspan></tspan></text>
        </g>
       </g>
      </g>
      <g class="com.sun.star.drawing.CustomShape">
       <g id="id5">
        <rect class="BoundingBox" stroke="none" fill="none" x="10479" y="15682" width="843" height="1232"/>
        <path fill="none" stroke="rgb(0,0,0)" stroke-width="40" stroke-linejoin="round" d="M 11301,16297 L 10500,16893 10500,15702 11301,16297 Z"/>
       </g>
      </g>
      <g class="com.sun.star.drawing.LineShape">
       <g id="id6">
        <rect class="BoundingBox" stroke="none" fill="none" x="9443" y="16102" width="1019" height="353"/>
        <path fill="none" stroke="rgb(0,0,0)" stroke-width="35" stroke-linejoin="round" d="M 9461,16278 L 9956,16278"/>
        <path fill="rgb(0,0,0)" stroke="none" d="M 10461,16278 L 9933,16102 9933,16454 10461,16278 Z"/>
       </g>
      </g>
      <g class="OLE2">
       <g id="id7">
        <rect class="BoundingBox" stroke="none" fill="none" x="9086" y="18154" width="446" height="467"/>
        <defs>
         <clipPath id="clip_path_3" clipPathUnits="userSpaceOnUse">
          <path d="M 9075,18150 L 9525,18150 9525,18627 9075,18627 9075,18150 Z"/>
         </clipPath>
        </defs>
        <g clip-path="url(#clip_path_3)">
         <text class="TextShape"><tspan class="TextParagraph" font-family="Liberation Serif, serif" font-size="422px" font-style="italic" font-weight="400"><tspan class="TextPosition" x="9192" y="18524"><tspan fill="rgb(0,0,0)" stroke="none">d</tspan></tspan></tspan></text>
        </g>
       </g>
      </g>
      <g class="Group">
       <g class="com.sun.star.drawing.CustomShape">
        <g id="id8">
         <rect class="BoundingBox" stroke="none" fill="none" x="8104" y="16176" width="1042" height="1042"/>
         <path fill="none" stroke="rgb(0,0,0)" stroke-width="40" stroke-linejoin="round" d="M 8624,16196 C 8907,16196 9124,16413 9124,16696 9124,16979 8907,17196 8624,17196 8341,17196 8124,16979 8124,16696 8124,16413 8341,16196 8624,16196 Z"/>
        </g>
       </g>
       <g class="OLE2">
        <g id="id9">
         <rect class="BoundingBox" stroke="none" fill="none" x="8379" y="16598" width="491" height="234"/>
         <defs>
          <clipPath id="clip_path_4" clipPathUnits="userSpaceOnUse">
           <path d="M 8387,16589 L 8864,16589 8864,16828 8387,16828 8387,16589 Z"/>
          </clipPath>
         </defs>
         <g clip-path="url(#clip_path_4)">
          <text class="TextShape"><tspan class="TextParagraph" font-family="OpenSymbol" font-size="422px" font-weight="400"><tspan class="TextPosition" x="8485" y="16836"><tspan fill="rgb(0,0,0)" stroke="none">+</tspan></tspan></tspan></text>
         </g>
        </g>
       </g>
      </g>
      <g class="com.sun.star.drawing.LineShape">
       <g id="id10">
        <rect class="BoundingBox" stroke="none" fill="none" x="8451" y="17256" width="353" height="1751"/>
        <path fill="none" stroke="rgb(0,0,0)" stroke-width="35" stroke-linejoin="round" d="M 8627,18771 L 8627,17761"/>
        <path fill="rgb(0,0,0)" stroke="none" d="M 8650,18757 L 8673,18763 8696,18775 8716,18791 8732,18811 8744,18834 8750,18857 8753,18880 8750,18903 8744,18927 8732,18949 8716,18969 8696,18985 8673,18996 8650,19004 8626,19006 8604,19004 8580,18996 8558,18985 8538,18969 8522,18949 8510,18927 8504,18903 8501,18880 8504,18857 8510,18834 8522,18811 8538,18791 8558,18775 8580,18763 8604,18757 8626,18754 8650,18757 Z"/>
        <path fill="rgb(0,0,0)" stroke="none" d="M 8627,17256 L 8451,17784 8803,17784 8627,17256 Z"/>
       </g>
      </g>
      <g class="com.sun.star.drawing.CustomShape">
       <g id="id11">
        <rect class="BoundingBox" stroke="none" fill="none" x="11296" y="16152" width="292" height="292"/>
        <path fill="none" stroke="rgb(0,0,0)" stroke-width="40" stroke-linejoin="round" d="M 11441,16172 C 11512,16172 11566,16226 11566,16297 11566,16368 11512,16422 11441,16422 11370,16422 11316,16368 11316,16297 11316,16226 11370,16172 11441,16172 Z"/>
       </g>
      </g>
      <g class="Group">
       <g class="com.sun.star.drawing.CustomShape">
        <g id="id12">
         <rect class="BoundingBox" stroke="none" fill="none" x="12430" y="18649" width="837" height="1237"/>
         <path fill="none" stroke="rgb(0,0,0)" stroke-width="35" stroke-linejoin="round" d="M 12848,19867 L 12448,19867 12448,18667 13248,18667 13248,19867 12848,19867 Z"/>
        </g>
       </g>
       <g class="com.sun.star.drawing.CustomShape">
        <g id="id13">
         <rect class="BoundingBox" stroke="none" fill="none" x="13028" y="19360" width="243" height="342"/>
         <path fill="none" stroke="rgb(0,0,0)" stroke-width="40" stroke-linejoin="round" d="M 13048,19531 L 13248,19380 13248,19681 13048,19531 Z"/>
        </g>
       </g>
      </g>
      <g class="com.sun.star.drawing.LineShape">
       <g id="id14">
        <rect class="BoundingBox" stroke="none" fill="none" x="11647" y="16121" width="1019" height="353"/>
        <path fill="none" stroke="rgb(0,0,0)" stroke-width="35" stroke-linejoin="round" d="M 11665,16297 L 12160,16297"/>
        <path fill="rgb(0,0,0)" stroke="none" d="M 12665,16297 L 12137,16121 12137,16473 12665,16297 Z"/>
       </g>
      </g>
      <g class="com.sun.star.drawing.LineShape">
       <g id="id15">
        <rect class="BoundingBox" stroke="none" fill="none" x="9447" y="16965" width="3219" height="353"/>
        <path fill="none" stroke="rgb(0,0,0)" stroke-width="35" stroke-linejoin="round" d="M 9465,17141 L 12160,17141"/>
        <path fill="rgb(0,0,0)" stroke="none" d="M 12665,17141 L 12137,16965 12137,17317 12665,17141 Z"/>
       </g>
      </g>
      <g class="com.sun.star.drawing.LineShape">
       <g id="id16">
        <rect class="BoundingBox" stroke="none" fill="none" x="9123" y="16520" width="525" height="353"/>
        <path fill="none" stroke="rgb(0,0,0)" stroke-width="35" stroke-linejoin="round" d="M 9141,16696 L 9318,16696"/>
        <path fill="rgb(0,0,0)" stroke="none" d="M 9299,16664 L 9308,16632 9324,16600 9346,16571 9375,16549 9407,16533 9439,16524 9471,16520 9503,16524 9536,16533 9568,16549 9596,16571 9618,16600 9634,16632 9644,16664 9647,16697 9644,16728 9634,16761 9618,16792 9596,16821 9568,16843 9536,16859 9503,16868 9471,16872 9439,16868 9407,16859 9375,16843 9346,16821 9324,16792 9308,16761 9299,16728 9295,16697 9299,16664 Z"/>
       </g>
      </g>
      <g class="com.sun.star.drawing.LineShape">
       <g id="id17">
        <rect class="BoundingBox" stroke="none" fill="none" x="9455" y="16246" width="37" height="937"/>
        <path fill="none" stroke="rgb(0,0,0)" stroke-width="35" stroke-linejoin="round" d="M 9473,17164 L 9473,16264"/>
       </g>
      </g>
      <g class="com.sun.star.drawing.LineShape">
       <g id="id18">
        <rect class="BoundingBox" stroke="none" fill="none" x="13678" y="16678" width="437" height="37"/>
        <path fill="none" stroke="rgb(0,0,0)" stroke-width="35" stroke-linejoin="round" d="M 13696,16696 L 14096,16696"/>
       </g>
      </g>
      <g class="com.sun.star.drawing.LineShape">
       <g id="id19">
        <rect class="BoundingBox" stroke="none" fill="none" x="14065" y="16687" width="37" height="2208"/>
        <path fill="none" stroke="rgb(0,0,0)" stroke-width="35" stroke-linejoin="round" d="M 14083,18876 L 14083,16705"/>
       </g>
      </g>
      <g class="com.sun.star.drawing.LineShape">
       <g id="id20">
        <rect class="BoundingBox" stroke="none" fill="none" x="13299" y="18694" width="819" height="354"/>
        <path fill="none" stroke="rgb(0,0,0)" stroke-width="35" stroke-linejoin="round" d="M 14099,18870 L 13804,18870"/>
        <path fill="rgb(0,0,0)" stroke="none" d="M 13299,18870 L 13827,19046 13827,18694 13299,18870 Z"/>
       </g>
      </g>
      <g class="Group">
       <g class="com.sun.star.drawing.CustomShape">
        <g id="id21">
         <rect class="BoundingBox" stroke="none" fill="none" x="10673" y="18649" width="837" height="1237"/>
         <path fill="none" stroke="rgb(0,0,0)" stroke-width="35" stroke-linejoin="round" d="M 11091,19867 L 10691,19867 10691,18667 11491,18667 11491,19867 11091,19867 Z"/>
        </g>
       </g>
       <g class="com.sun.star.drawing.CustomShape">
        <g id="id22">
         <rect class="BoundingBox" stroke="none" fill="none" x="11271" y="19360" width="243" height="342"/>
         <path fill="none" stroke="rgb(0,0,0)" stroke-width="40" stroke-linejoin="round" d="M 11291,19531 L 11491,19380 11491,19681 11291,19531 Z"/>
        </g>
       </g>
      </g>
      <g class="com.sun.star.drawing.LineShape">
       <g id="id23">
        <rect class="BoundingBox" stroke="none" fill="none" x="11520" y="18694" width="919" height="354"/>
        <path fill="none" stroke="rgb(0,0,0)" stroke-width="35" stroke-linejoin="round" d="M 12420,18870 L 12025,18870"/>
        <path fill="rgb(0,0,0)" stroke="none" d="M 11520,18870 L 12048,19046 12048,18694 11520,18870 Z"/>
       </g>
      </g>
      <g class="Group">
       <g class="com.sun.star.drawing.CustomShape">
        <g id="id24">
         <rect class="BoundingBox" stroke="none" fill="none" x="8877" y="18649" width="837" height="1237"/>
         <path fill="none" stroke="rgb(0,0,0)" stroke-width="35" stroke-linejoin="round" d="M 9295,19867 L 8895,19867 8895,18667 9695,18667 9695,19867 9295,19867 Z"/>
        </g>
       </g>
       <g class="com.sun.star.drawing.CustomShape">
        <g id="id25">
         <rect class="BoundingBox" stroke="none" fill="none" x="9475" y="19360" width="242" height="342"/>
         <path fill="none" stroke="rgb(0,0,0)" stroke-width="40" stroke-linejoin="round" d="M 9495,19531 L 9695,19380 9695,19681 9495,19531 Z"/>
        </g>
       </g>
      </g>
      <g class="com.sun.star.drawing.LineShape">
       <g id="id26">
        <rect class="BoundingBox" stroke="none" fill="none" x="9743" y="18694" width="919" height="354"/>
        <path fill="none" stroke="rgb(0,0,0)" stroke-width="35" stroke-linejoin="round" d="M 10643,18870 L 10248,18870"/>
        <path fill="rgb(0,0,0)" stroke="none" d="M 9743,18870 L 10271,19046 10271,18694 9743,18870 Z"/>
       </g>
      </g>
      <g class="Group">
       <g class="com.sun.star.drawing.CustomShape">
        <g id="id27">
         <rect class="BoundingBox" stroke="none" fill="none" x="7082" y="18649" width="837" height="1237"/>
         <path fill="none" stroke="rgb(0,0,0)" stroke-width="35" stroke-linejoin="round" d="M 7500,19867 L 7100,19867 7100,18667 7900,18667 7900,19867 7500,19867 Z"/>
        </g>
       </g>
       <g class="com.sun.star.drawing.CustomShape">
        <g id="id28">
         <rect class="BoundingBox" stroke="none" fill="none" x="7680" y="19360" width="242" height="342"/>
         <path fill="none" stroke="rgb(0,0,0)" stroke-width="40" stroke-linejoin="round" d="M 7700,19531 L 7900,19380 7900,19681 7700,19531 Z"/>
        </g>
       </g>
      </g>
      <g class="com.sun.star.drawing.LineShape">
       <g id="id29">
        <rect class="BoundingBox" stroke="none" fill="none" x="7948" y="18694" width="919" height="354"/>
        <path fill="none" stroke="rgb(0,0,0)" stroke-width="35" stroke-linejoin="round" d="M 8848,18870 L 8453,18870"/>
        <path fill="rgb(0,0,0)" stroke="none" d="M 7948,18870 L 8476,19046 8476,18694 7948,18870 Z"/>
       </g>
      </g>
      <g class="Group">
       <g class="com.sun.star.drawing.CustomShape">
        <g id="id30">
         <rect class="BoundingBox" stroke="none" fill="none" x="5286" y="18649" width="837" height="1237"/>
         <path fill="none" stroke="rgb(0,0,0)" stroke-width="35" stroke-linejoin="round" d="M 5704,19867 L 5304,19867 5304,18667 6104,18667 6104,19867 5704,19867 Z"/>
        </g>
       </g>
       <g class="com.sun.star.drawing.CustomShape">
        <g id="id31">
         <rect class="BoundingBox" stroke="none" fill="none" x="5884" y="19360" width="242" height="342"/>
         <path fill="none" stroke="rgb(0,0,0)" stroke-width="40" stroke-linejoin="round" d="M 5904,19531 L 6104,19380 6104,19681 5904,19531 Z"/>
        </g>
       </g>
      </g>
      <g class="com.sun.star.drawing.LineShape">
       <g id="id32">
        <rect class="BoundingBox" stroke="none" fill="none" x="6152" y="18694" width="919" height="354"/>
        <path fill="none" stroke="rgb(0,0,0)" stroke-width="35" stroke-linejoin="round" d="M 7052,18870 L 6657,18870"/>
        <path fill="rgb(0,0,0)" stroke="none" d="M 6152,18870 L 6680,19046 6680,18694 6152,18870 Z"/>
       </g>
      </g>
      <g class="Group">
       <g class="com.sun.star.drawing.CustomShape">
        <g id="id33">
         <rect class="BoundingBox" stroke="none" fill="none" x="3490" y="18649" width="837" height="1237"/>
         <path fill="none" stroke="rgb(0,0,0)" stroke-width="35" stroke-linejoin="round" d="M 3908,19867 L 3508,19867 3508,18667 4308,18667 4308,19867 3908,19867 Z"/>
        </g>
       </g>
       <g class="com.sun.star.drawing.CustomShape">
        <g id="id34">
         <rect class="BoundingBox" stroke="none" fill="none" x="4088" y="19360" width="242" height="342"/>
         <path fill="none" stroke="rgb(0,0,0)" stroke-width="40" stroke-linejoin="round" d="M 4108,19531 L 4308,19380 4308,19681 4108,19531 Z"/>
        </g>
       </g>
      </g>
      <g class="com.sun.star.drawing.LineShape">
       <g id="id35">
        <rect class="BoundingBox" stroke="none" fill="none" x="4356" y="18694" width="919" height="354"/>
        <path fill="none" stroke="rgb(0,0,0)" stroke-width="35" stroke-linejoin="round" d="M 5256,18870 L 4861,18870"/>
        <path fill="rgb(0,0,0)" stroke="none" d="M 4356,18870 L 4884,19046 4884,18694 4356,18870 Z"/>
       </g>
      </g>
      <g class="Group">
       <g class="com.sun.star.drawing.CustomShape">
        <g id="id36">
         <rect class="BoundingBox" stroke="none" fill="none" x="1694" y="18649" width="837" height="1237"/>
         <path fill="none" stroke="rgb(0,0,0)" stroke-width="35" stroke-linejoin="round" d="M 2112,19867 L 1712,19867 1712,18667 2512,18667 2512,19867 2112,19867 Z"/>
        </g>
       </g>
       <g class="com.sun.star.drawing.CustomShape">
        <g id="id37">
         <rect class="BoundingBox" stroke="none" fill="none" x="2292" y="19360" width="242" height="342"/>
         <path fill="none" stroke="rgb(0,0,0)" stroke-width="40" stroke-linejoin="round" d="M 2312,19531 L 2512,19380 2512,19681 2312,19531 Z"/>
        </g>
       </g>
      </g>
      <g class="com.sun.star.drawing.LineShape">
       <g id="id38">
        <rect class="BoundingBox" stroke="none" fill="none" x="2561" y="18694" width="919" height="354"/>
        <path fill="none" stroke="rgb(0,0,0)" stroke-width="35" stroke-linejoin="round" d="M 3461,18870 L 3066,18870"/>
        <path fill="rgb(0,0,0)" stroke="none" d="M 2561,18870 L 3089,19046 3089,18694 2561,18870 Z"/>
       </g>
      </g>
      <g class="com.sun.star.drawing.LineShape">
       <g id="id39">
        <rect class="BoundingBox" stroke="none" fill="none" x="1205" y="18852" width="437" height="37"/>
        <path fill="none" stroke="rgb(0,0,0)" stroke-width="35" stroke-linejoin="round" d="M 1623,18870 L 1223,18870"/>
       </g>
      </g>
      <g class="com.sun.star.drawing.LineShape">
       <g id="id40">
        <rect class="BoundingBox" stroke="none" fill="none" x="1218" y="16672" width="37" height="2208"/>
        <path fill="none" stroke="rgb(0,0,0)" stroke-width="35" stroke-linejoin="round" d="M 1236,16690 L 1236,18861"/>
       </g>
      </g>
      <g class="com.sun.star.drawing.LineShape">
       <g id="id41">
        <rect class="BoundingBox" stroke="none" fill="none" x="1202" y="16520" width="3234" height="353"/>
        <path fill="none" stroke="rgb(0,0,0)" stroke-width="35" stroke-linejoin="round" d="M 1220,16696 L 3930,16696"/>
        <path fill="rgb(0,0,0)" stroke="none" d="M 4435,16696 L 3907,16520 3907,16872 4435,16696 Z"/>
       </g>
      </g>
      <g class="OLE2">
       <g id="id42">
        <rect class="BoundingBox" stroke="none" fill="none" x="12774" y="16058" width="412" height="467"/>
        <defs>
         <clipPath id="clip_path_5" clipPathUnits="userSpaceOnUse">
          <path d="M 12779,16060 L 13176,16060 13176,16536 12779,16536 12779,16060 Z"/>
         </clipPath>
        </defs>
        <g clip-path="url(#clip_path_5)">
         <text class="TextShape"><tspan class="TextParagraph" font-family="Liberation Serif, serif" font-size="422px" font-weight="400"><tspan class="TextPosition" x="12880" y="16428"><tspan fill="rgb(0,0,0)" stroke="none">1</tspan></tspan></tspan></text>
        </g>
       </g>
      </g>
      <g class="OLE2">
       <g id="id43">
        <rect class="BoundingBox" stroke="none" fill="none" x="12774" y="16909" width="429" height="467"/>
        <defs>
         <clipPath id="clip_path_6" clipPathUnits="userSpaceOnUse">
          <path d="M 12779,16907 L 13203,16907 13203,17383 12779,17383 12779,16907 Z"/>
         </clipPath>
        </defs>
        <g clip-path="url(#clip_path_6)">
         <text class="TextShape"><tspan class="TextParagraph" font-family="Liberation Serif, serif" font-size="422px" font-weight="400"><tspan class="TextPosition" x="12880" y="17279"><tspan fill="rgb(0,0,0)" stroke="none">0</tspan></tspan></tspan></text>
        </g>
       </g>
      </g>
      <g class="com.sun.star.drawing.LineShape">
       <g id="id44">
        <rect class="BoundingBox" stroke="none" fill="none" x="4894" y="17256" width="353" height="1751"/>
        <path fill="none" stroke="rgb(0,0,0)" stroke-width="35" stroke-linejoin="round" d="M 5070,18771 L 5070,17761"/>
        <path fill="rgb(0,0,0)" stroke="none" d="M 5093,18757 L 5116,18763 5139,18775 5159,18791 5175,18811 5187,18834 5193,18857 5196,18880 5193,18903 5187,18927 5175,18949 5159,18969 5139,18985 5116,18996 5093,19004 5069,19006 5047,19004 5023,18996 5001,18985 4981,18969 4965,18949 4953,18927 4947,18903 4944,18880 4947,18857 4953,18834 4965,18811 4981,18791 5001,18775 5023,18763 5047,18757 5069,18754 5093,18757 Z"/>
        <path fill="rgb(0,0,0)" stroke="none" d="M 5070,17256 L 4894,17784 5246,17784 5070,17256 Z"/>
       </g>
      </g>
      <g class="Group">
       <g class="com.sun.star.drawing.CustomShape">
        <g id="id45">
         <rect class="BoundingBox" stroke="none" fill="none" x="4517" y="16147" width="1042" height="1042"/>
         <path fill="none" stroke="rgb(0,0,0)" stroke-width="40" stroke-linejoin="round" d="M 5037,16167 C 5320,16167 5537,16384 5537,16667 5537,16950 5320,17167 5037,17167 4754,17167 4537,16950 4537,16667 4537,16384 4754,16167 5037,16167 Z"/>
        </g>
       </g>
       <g class="OLE2">
        <g id="id46">
         <rect class="BoundingBox" stroke="none" fill="none" x="4792" y="16569" width="491" height="234"/>
         <defs>
          <clipPath id="clip_path_7" clipPathUnits="userSpaceOnUse">
           <path d="M 4789,16563 L 5292,16563 5292,16801 4789,16801 4789,16563 Z"/>
          </clipPath>
         </defs>
         <g clip-path="url(#clip_path_7)">
          <text class="TextShape"><tspan class="TextParagraph" font-family="OpenSymbol" font-size="422px" font-weight="400"><tspan class="TextPosition" x="4898" y="16807"><tspan fill="rgb(0,0,0)" stroke="none">+</tspan></tspan></tspan></text>
         </g>
        </g>
       </g>
      </g>
      <g class="com.sun.star.drawing.LineShape">
       <g id="id47">
        <rect class="BoundingBox" stroke="none" fill="none" x="5612" y="16491" width="2469" height="353"/>
        <path fill="none" stroke="rgb(0,0,0)" stroke-width="35" stroke-linejoin="round" d="M 5630,16667 L 7575,16667"/>
        <path fill="rgb(0,0,0)" stroke="none" d="M 8080,16667 L 7552,16491 7552,16843 8080,16667 Z"/>
       </g>
      </g>
      <g class="OLE2">
       <g id="id48">
        <rect class="BoundingBox" stroke="none" fill="none" x="5500" y="18154" width="412" height="467"/>
        <defs>
         <clipPath id="clip_path_8" clipPathUnits="userSpaceOnUse">
          <path d="M 5503,18150 L 5900,18150 5900,18627 5503,18627 5503,18150 Z"/>
         </clipPath>
        </defs>
        <g clip-path="url(#clip_path_8)">
         <text class="TextShape"><tspan class="TextParagraph" font-family="Liberation Serif, serif" font-size="422px" font-style="italic" font-weight="400"><tspan class="TextPosition" x="5606" y="18524"><tspan fill="rgb(0,0,0)" stroke="none">e</tspan></tspan></tspan></text>
        </g>
       </g>
      </g>
      <g class="com.sun.star.drawing.TextShape">
       <g id="id49">
        <rect class="BoundingBox" stroke="none" fill="none" x="11358" y="15209" width="3876" height="1124"/>
        <text class="TextShape"><tspan class="TextParagraph" font-family="Liberation Mono, monospace" font-size="388px" font-weight="400"><tspan class="TextPosition" x="11608" y="15656"><tspan fill="rgb(0,0,0)" stroke="none">invert_output</tspan></tspan></tspan></text>
       </g>
      </g>
      <g class="com.sun.star.drawing.CustomShape">
       <g id="id50">
        <rect class="BoundingBox" stroke="none" fill="none" x="12728" y="15938" width="867" height="1542"/>
        <path fill="none" stroke="rgb(0,0,0)" stroke-width="40" stroke-linejoin="round" d="M 12749,17459 L 12749,15959 13573,16334 13573,17084 12749,17459 Z"/>
       </g>
      </g>
      <g class="com.sun.star.drawing.LineShape">
       <g id="id51">
        <rect class="BoundingBox" stroke="none" fill="none" x="13166" y="15739" width="37" height="455"/>
        <path fill="none" stroke="rgb(0,0,0)" stroke-width="35" stroke-linejoin="round" d="M 13184,16175 L 13184,15757"/>
       </g>
      </g>
      <g class="Group">
       <g class="com.sun.star.drawing.CustomShape">
        <g id="id52">
         <rect class="BoundingBox" stroke="none" fill="none" x="5180" y="21079" width="703" height="703"/>
         <path fill="none" stroke="rgb(178,178,178)" stroke-width="40" stroke-linejoin="round" d="M 5531,21761 L 5200,21761 5200,21099 5862,21099 5862,21761 5531,21761 Z"/>
        </g>
       </g>
       <g class="com.sun.star.drawing.CustomShape">
        <g id="id53">
         <rect class="BoundingBox" stroke="none" fill="none" x="5845" y="21079" width="703" height="703"/>
         <path fill="none" stroke="rgb(178,178,178)" stroke-width="40" stroke-linejoin="round" d="M 6196,21761 L 5865,21761 5865,21099 6527,21099 6527,21761 6196,21761 Z"/>
        </g>
       </g>
       <g class="com.sun.star.drawing.CustomShape">
        <g id="id54">
         <rect class="BoundingBox" stroke="none" fill="none" x="6510" y="21079" width="703" height="703"/>
         <path fill="none" stroke="rgb(178,178,178)" stroke-width="40" stroke-linejoin="round" d="M 6861,21761 L 6530,21761 6530,21099 7192,21099 7192,21761 6861,21761 Z"/>
        </g>
       </g>
       <g class="com.sun.star.drawing.CustomShape">
        <g id="id55">
         <rect class="BoundingBox" stroke="none" fill="none" x="7175" y="21079" width="703" height="703"/>
         <path fill="none" stroke="rgb(178,178,178)" stroke-width="40" stroke-linejoin="round" d="M 7526,21761 L 7195,21761 7195,21099 7857,21099 7857,21761 7526,21761 Z"/>
        </g>
       </g>
       <g class="com.sun.star.drawing.CustomShape">
        <g id="id56">
         <rect class="BoundingBox" stroke="none" fill="none" x="7840" y="21079" width="703" height="703"/>
         <path fill="none" stroke="rgb(178,178,178)" stroke-width="40" stroke-linejoin="round" d="M 8191,21761 L 7860,21761 7860,21099 8522,21099 8522,21761 8191,21761 Z"/>
        </g>
       </g>
       <g class="com.sun.star.drawing.CustomShape">
        <g id="id57">
         <rect class="BoundingBox" stroke="none" fill="none" x="8505" y="21079" width="703" height="703"/>
         <path fill="none" stroke="rgb(178,178,178)" stroke-width="40" stroke-linejoin="round" d="M 8856,21761 L 8525,21761 8525,21099 9187,21099 9187,21761 8856,21761 Z"/>
        </g>
       </g>
       <g class="com.sun.star.drawing.CustomShape">
        <g id="id58">
         <rect class="BoundingBox" stroke="none" fill="none" x="9170" y="21079" width="703" height="703"/>
         <path fill="none" stroke="rgb(178,178,178)" stroke-width="40" stroke-linejoin="round" d="M 9521,21761 L 9190,21761 9190,21099 9852,21099 9852,21761 9521,21761 Z"/>
        </g>
       </g>
      </g>
      <g class="com.sun.star.drawing.LineShape">
       <g id="id59">
        <rect class="BoundingBox" stroke="none" fill="none" x="10066" y="20056" width="2777" height="1079"/>
        <path fill="none" stroke="rgb(178,178,178)" stroke-width="40" stroke-linejoin="round" d="M 12822,20076 L 10467,20980"/>
        <path fill="rgb(178,178,178)" stroke="none" d="M 10066,21134 L 10540,21113 10432,20833 10066,21134 Z"/>
       </g>
      </g>
      <g class="com.sun.star.drawing.LineShape">
       <g id="id60">
        <rect class="BoundingBox" stroke="none" fill="none" x="2107" y="20056" width="2777" height="1079"/>
        <path fill="none" stroke="rgb(178,178,178)" stroke-width="40" stroke-linejoin="round" d="M 2127,20076 L 4482,20980"/>
        <path fill="rgb(178,178,178)" stroke="none" d="M 4883,21134 L 4517,20833 4409,21113 4883,21134 Z"/>
       </g>
      </g>
      <g class="com.sun.star.drawing.LineShape">
       <g id="id61">
        <rect class="BoundingBox" stroke="none" fill="none" x="4037" y="20056" width="1895" height="969"/>
        <path fill="none" stroke="rgb(178,178,178)" stroke-width="40" stroke-linejoin="round" d="M 4057,20076 L 5547,20830"/>
        <path fill="rgb(178,178,178)" stroke="none" d="M 5931,21024 L 5597,20687 5462,20955 5931,21024 Z"/>
       </g>
      </g>
      <g class="com.sun.star.drawing.LineShape">
       <g id="id62">
        <rect class="BoundingBox" stroke="none" fill="none" x="9019" y="20056" width="1895" height="969"/>
        <path fill="none" stroke="rgb(178,178,178)" stroke-width="40" stroke-linejoin="round" d="M 10893,20076 L 9403,20830"/>
        <path fill="rgb(178,178,178)" stroke="none" d="M 9019,21024 L 9488,20955 9353,20687 9019,21024 Z"/>
       </g>
      </g>
      <g class="com.sun.star.drawing.LineShape">
       <g id="id63">
        <rect class="BoundingBox" stroke="none" fill="none" x="5845" y="20056" width="925" height="948"/>
        <path fill="none" stroke="rgb(178,178,178)" stroke-width="40" stroke-linejoin="round" d="M 5865,20076 L 6469,20695"/>
        <path fill="rgb(178,178,178)" stroke="none" d="M 6769,21003 L 6562,20576 6347,20786 6769,21003 Z"/>
       </g>
      </g>
      <g class="com.sun.star.drawing.LineShape">
       <g id="id64">
        <rect class="BoundingBox" stroke="none" fill="none" x="8269" y="20056" width="925" height="948"/>
        <path fill="none" stroke="rgb(178,178,178)" stroke-width="40" stroke-linejoin="round" d="M 9173,20076 L 8569,20695"/>
        <path fill="rgb(178,178,178)" stroke="none" d="M 8269,21003 L 8691,20786 8476,20576 8269,21003 Z"/>
       </g>
      </g>
      <g class="com.sun.star.drawing.LineShape">
       <g id="id65">
        <rect class="BoundingBox" stroke="none" fill="none" x="7391" y="20056" width="301" height="961"/>
        <path fill="none" stroke="rgb(178,178,178)" stroke-width="40" stroke-linejoin="round" d="M 7541,20076 L 7541,20586"/>
        <path fill="rgb(178,178,178)" stroke="none" d="M 7541,21016 L 7691,20566 7391,20566 7541,21016 Z"/>
       </g>
      </g>
      <g class="com.sun.star.drawing.TextShape">
       <g id="id66">
        <rect class="BoundingBox" stroke="none" fill="none" x="6041" y="21873" width="3064" height="688"/>
        <text class="TextShape"><tspan class="TextParagraph" font-family="Liberation Mono, monospace" font-size="388px" font-weight="400"><tspan class="TextPosition" x="6291" y="22320"><tspan fill="rgb(178,178,178)" stroke="none">data_output</tspan></tspan></tspan></text>
       </g>
      </g>
      <g class="com.sun.star.drawing.TextShape">
       <g id="id67">
        <rect class="BoundingBox" stroke="none" fill="none" x="3593" y="21476" width="2074" height="1560"/>
        <text class="TextShape"><tspan class="TextParagraph" font-family="Liberation Sans, sans-serif" font-size="318px" font-weight="400"><tspan class="TextPosition" x="4212" y="21885"><tspan fill="rgb(178,178,178)" stroke="none">Most </tspan></tspan><tspan class="TextPosition" x="3843" y="22233"><tspan fill="rgb(178,178,178)" stroke="none">significant </tspan></tspan><tspan class="TextPosition" x="4387" y="22581"><tspan fill="rgb(178,178,178)" stroke="none">bit</tspan></tspan></tspan></text>
       </g>
      </g>
      <g class="com.sun.star.drawing.TextShape">
       <g id="id68">
        <rect class="BoundingBox" stroke="none" fill="none" x="9481" y="21476" width="2074" height="1560"/>
        <text class="TextShape"><tspan class="TextParagraph" font-family="Liberation Sans, sans-serif" font-size="318px" font-weight="400"><tspan class="TextPosition" x="10053" y="21885"><tspan fill="rgb(178,178,178)" stroke="none">Least </tspan></tspan><tspan class="TextPosition" x="9731" y="22233"><tspan fill="rgb(178,178,178)" stroke="none">significant </tspan></tspan><tspan class="TextPosition" x="10275" y="22581"><tspan fill="rgb(178,178,178)" stroke="none">bit</tspan></tspan></tspan></text>
       </g>
      </g>
     </g>
    </g>
   </g>
  </g>
 </g>
</svg>