<?xml version="1.0" encoding="UTF-8" standalone="no"?>
<!DOCTYPE svg PUBLIC "-//W3C//DTD SVG 1.1//EN" "http://www.w3.org/Graphics/SVG/1.1/DTD/svg11.dtd">
<!-- Generated by Microsoft Visio, SVG Export polyphase_synchronisation_stages.svg Page-1 -->
<svg xmlns="http://www.w3.org/2000/svg" xmlns:xlink="http://www.w3.org/1999/xlink" xmlns:ev="http://www.w3.org/2001/xml-events"
		xmlns:v="http://schemas.microsoft.com/visio/2003/SVGExtensions/" width="6.85734in" height="4.73135in"
		viewBox="0 0 493.728 340.657" xml:space="preserve" color-interpolation-filters="sRGB" class="st8">
	<v:documentProperties v:langID="2057" v:metric="true" v:viewMarkup="false"/>

	<style type="text/css">
	<![CDATA[
		.st1 {fill:#5b9bd5;stroke:#c7c8c8;stroke-width:0.25}
		.st2 {fill:#feffff;font-family:Calibri;font-size:1.00001em}
		.st3 {font-size:1em}
		.st4 {marker-end:url(#mrkr4-27);stroke:#5b9bd5;stroke-linecap:round;stroke-linejoin:round;stroke-width:3.5}
		.st5 {fill:#5b9bd5;fill-opacity:1;stroke:#5b9bd5;stroke-opacity:1;stroke-width:0.58139534883721}
		.st6 {fill:none;stroke:none;stroke-width:0.25}
		.st7 {fill:#41719c;font-family:Calibri;font-size:1.5em}
		.st8 {fill:none;fill-rule:evenodd;font-size:12px;overflow:visible;stroke-linecap:square;stroke-miterlimit:3}
	]]>
	</style>

	<defs id="Markers">
		<g id="lend4">
			<path d="M 2 1 L 0 0 L 2 -1 L 2 1 " style="stroke:none"/>
		</g>
		<marker id="mrkr4-27" class="st5" v:arrowType="4" v:arrowSize="2" v:setback="3.44" refX="-3.44" orient="auto"
				markerUnits="strokeWidth" overflow="visible">
			<use xlink:href="#lend4" transform="scale(-1.72,-1.72) "/>
		</marker>
	</defs>
	<g v:mID="0" v:index="1" v:groupContext="foregroundPage">
		<title>Page-1</title>
		<v:pageProperties v:drawingScale="0.0393701" v:pageScale="0.0393701" v:drawingUnits="24" v:shadowOffsetX="8.50394"
				v:shadowOffsetY="-8.50394"/>
		<v:layer v:name="Connector" v:index="0"/>
		<g id="shape1-1" v:mID="1" v:groupContext="shape" transform="translate(95.2106,-141.982)">
			<title>Rectangle</title>
			<desc>Combined Matched Filter + Polyphase Interpolation Filter</desc>
			<v:userDefs>
				<v:ud v:nameU="visVersion" v:val="VT0(15):26"/>
			</v:userDefs>
			<v:textBlock v:margins="rect(4,4,4,4)" v:tabSpace="42.5197"/>
			<v:textRect cx="56.6929" cy="298.138" width="113.39" height="85.0394"/>
			<rect x="0" y="255.618" width="113.386" height="85.0394" class="st1"/>
			<text x="31.72" y="272.94" class="st2" v:langID="2057"><v:paragraph v:horizAlign="1"/><v:tabList/>Combined <v:lf/><tspan
						x="20.9" dy="1.2em" class="st3">Matched Filter<v:lf/></tspan><tspan x="52.35" dy="1.2em" class="st3"> </tspan>+<v:lf/><tspan
						x="31.83" dy="1.2em" class="st3">Polyphase </tspan><tspan x="10.72" dy="1.2em" class="st3">Interpolation Filter</tspan></text>		</g>
		<g id="shape2-8" v:mID="2" v:groupContext="shape" transform="translate(269.946,-141.982)">
			<title>Rectangle.2</title>
			<desc>Gardner loop (Timing Error Detection)</desc>
			<v:userDefs>
				<v:ud v:nameU="visVersion" v:val="VT0(15):26"/>
			</v:userDefs>
			<v:textBlock v:margins="rect(4,4,4,4)" v:tabSpace="42.5197"/>
			<v:textRect cx="56.6929" cy="298.138" width="113.39" height="85.0394"/>
			<rect x="0" y="255.618" width="113.386" height="85.0394" class="st1"/>
			<text x="24.35" y="287.34" class="st2" v:langID="2057"><v:paragraph v:horizAlign="1"/><v:tabList/>Gardner loop<v:newlineChar/><tspan
						x="24.7" dy="1.2em" class="st3">(</tspan>Timing Error <tspan x="30.96" dy="1.2em" class="st3">Detection</tspan>)  </text>		</g>
		<g id="shape3-13" v:mID="3" v:groupContext="shape" transform="translate(269.946,-0.25)">
			<title>Rectangle.3</title>
			<desc>Loop filter</desc>
			<v:userDefs>
				<v:ud v:nameU="visVersion" v:val="VT0(15):26"/>
			</v:userDefs>
			<v:textBlock v:margins="rect(4,4,4,4)" v:tabSpace="42.5197"/>
			<v:textRect cx="56.6929" cy="298.138" width="113.39" height="85.0394"/>
			<rect x="0" y="255.618" width="113.386" height="85.0394" class="st1"/>
			<text x="31.66" y="301.74" class="st2" v:langID="2057"><v:paragraph v:horizAlign="1"/><v:tabList/>Loop filter</text>		</g>
		<g id="shape4-16" v:mID="4" v:groupContext="shape" transform="translate(95.2106,-0.25)">
			<title>Rectangle.4</title>
			<desc>Sub-symbols selection (Interpolation control)</desc>
			<v:userDefs>
				<v:ud v:nameU="visVersion" v:val="VT0(15):26"/>
			</v:userDefs>
			<v:textBlock v:margins="rect(4,4,4,4)" v:tabSpace="42.5197"/>
			<v:textRect cx="56.6929" cy="298.138" width="113.39" height="85.0394"/>
			<rect x="0" y="255.618" width="113.386" height="85.0394" class="st1"/>
			<text x="25.9" y="280.14" class="st2" v:langID="2057"><v:paragraph v:horizAlign="1"/><v:tabList/>Sub-symbols <tspan
						x="34.76" dy="1.2em" class="st3">selection<v:newlineChar/></tspan><tspan x="22.85" dy="1.2em" class="st3">(</tspan>Interpolation <tspan
						x="37.38" dy="1.2em" class="st3">control</tspan>)</text>		</g>
		<g id="shape5-22" v:mID="5" v:groupContext="shape" v:layerMember="0" transform="translate(208.596,-177.415)">
			<title>Dynamic connector</title>
			<path d="M0 333.57 L49.31 333.57" class="st4"/>
		</g>
		<g id="shape6-28" v:mID="6" v:groupContext="shape" v:layerMember="0" transform="translate(319.553,-141.982)">
			<title>Dynamic connector.6</title>
			<path d="M7.09 340.66 L7.09 385.31" class="st4"/>
		</g>
		<g id="shape7-33" v:mID="7" v:groupContext="shape" v:layerMember="0" transform="translate(269.946,-35.6831)">
			<title>Dynamic connector.7</title>
			<path d="M0 333.57 L-49.31 333.57" class="st4"/>
		</g>
		<g id="shape8-38" v:mID="8" v:groupContext="shape" v:layerMember="0" transform="translate(144.817,-85.2894)">
			<title>Dynamic connector.8</title>
			<path d="M7.09 340.66 L7.09 296" class="st4"/>
		</g>
		<g id="shape9-43" v:mID="9" v:groupContext="shape" v:layerMember="0" transform="translate(73.9508,-177.415)">
			<title>Dynamic connector.9</title>
			<path d="M0 333.57 L9.22 333.57" class="st4"/>
		</g>
		<g id="shape30-48" v:mID="30" v:groupContext="shape" transform="translate(419.778,-280.171)">
			<title>Rectangle.30</title>
			<desc>y(m)</desc>
			<v:userDefs>
				<v:ud v:nameU="visVersion" v:val="VT0(15):26"/>
			</v:userDefs>
			<v:textBlock v:margins="rect(4,4,4,4)" v:tabSpace="42.5197"/>
			<v:textRect cx="36.8504" cy="322.941" width="73.71" height="35.4331"/>
			<rect x="0" y="305.224" width="73.7008" height="35.4331" class="st6"/>
			<text x="4" y="328.34" class="st7" v:langID="2057"><v:paragraph/><v:tabList/>y(m)</text>		</g>
		<g id="shape31-51" v:mID="31" v:groupContext="shape" transform="translate(0.25,-166.785)">
			<title>Rectangle.31</title>
			<desc>x(n)</desc>
			<v:userDefs>
				<v:ud v:nameU="visVersion" v:val="VT0(15):26"/>
			</v:userDefs>
			<v:textBlock v:margins="rect(4,4,4,4)" v:tabSpace="42.5197"/>
			<v:textRect cx="36.8504" cy="322.941" width="73.71" height="35.4331"/>
			<rect x="0" y="305.224" width="73.7008" height="35.4331" class="st6"/>
			<text x="41.53" y="328.34" class="st7" v:langID="2057"><v:paragraph v:horizAlign="2"/><v:tabList/>x(n)</text>		</g>
		<g id="shape32-54" v:mID="32" v:groupContext="shape" transform="translate(269.946,-255.368)">
			<title>Rectangle.32</title>
			<desc>Downsample x2 (Sample select)</desc>
			<v:userDefs>
				<v:ud v:nameU="visVersion" v:val="VT0(15):26"/>
			</v:userDefs>
			<v:textBlock v:margins="rect(4,4,4,4)" v:tabSpace="42.5197"/>
			<v:textRect cx="56.6929" cy="298.138" width="113.39" height="85.0394"/>
			<rect x="0" y="255.618" width="113.386" height="85.0394" class="st1"/>
			<text x="17.87" y="294.54" class="st2" v:langID="2057"><v:paragraph v:horizAlign="1"/><v:tabList/>Downsample x2 <tspan
						x="19.52" dy="1.2em" class="st3">(</tspan>Sample select)</text>		</g>
		<g id="shape33-58" v:mID="33" v:groupContext="shape" v:layerMember="0" transform="translate(208.596,-184.502)">
			<title>Dynamic connector.33</title>
			<path d="M0 340.66 L10.63 340.66 L10.63 227.27 L49.31 227.27" class="st4"/>
		</g>
		<g id="shape34-63" v:mID="34" v:groupContext="shape" v:layerMember="0" transform="translate(383.332,-290.801)">
			<title>Dynamic connector.34</title>
			<path d="M0 333.57 L24.41 333.57" class="st4"/>
		</g>
	</g>
</svg>
