<?xml version="1.0" encoding="UTF-8" standalone="no"?>
<!DOCTYPE svg PUBLIC "-//W3C//DTD SVG 1.1//EN" "http://www.w3.org/Graphics/SVG/1.1/DTD/svg11.dtd">
<!-- Generated by Microsoft Visio, SVG Export fft_design_diagram.svg Page-1 -->
<svg xmlns="http://www.w3.org/2000/svg" xmlns:xlink="http://www.w3.org/1999/xlink" xmlns:ev="http://www.w3.org/2001/xml-events"
		width="11.5966in" height="1.7911in" viewBox="0 0 834.953 128.959" xml:space="preserve" color-interpolation-filters="sRGB"
		class="st16">
	<style type="text/css">
	<![CDATA[
		.st1 {fill:#5b9bd5;stroke:#c7c8c8;stroke-width:0.250001}
		.st2 {fill:#feffff;font-family:Calibri;font-size:0.916672em}
		.st3 {font-size:1em}
		.st4 {fill:none}
		.st5 {stroke:#5b9bd5;stroke-linecap:round;stroke-linejoin:round;stroke-width:2.25001}
		.st6 {fill:#5b9bd5;stroke:none;stroke-width:2.25001}
		.st7 {fill:none;stroke:#000000;stroke-dasharray:10.5,7.5;stroke-width:1.5}
		.st8 {fill:none;stroke:none;stroke-linecap:butt;stroke-width:0.75}
		.st9 {fill:#000000;font-family:Calibri;font-size:0.833336em;font-weight:bold}
		.st10 {font-size:1em;text-decoration:underline}
		.st11 {fill:none;stroke:#000000;stroke-dasharray:5.25001,3.75001;stroke-width:0.750002}
		.st12 {fill:none;stroke:none;stroke-width:0.250001}
		.st13 {fill:#000000;font-family:Calibri;font-size:1.00001em}
		.st14 {fill:none;stroke:none;stroke-width:0.25}
		.st15 {fill:#feffff;font-family:Calibri;font-size:0.833336em}
		.st16 {fill:none;fill-rule:evenodd;font-size:12px;overflow:visible;stroke-linecap:square;stroke-miterlimit:3}
	]]>
	</style>

	<g>
		<title>Page-1</title>
		<g id="shape160-1" transform="translate(652.084,-34.3418)">
			<title>Sheet.160</title>
			<desc>Metadata Inserter</desc>
			<rect x="0" y="58.093" width="70.8663" height="70.8663" class="st1"/>
			<text x="13.52" y="90.23" class="st2">Metadata <tspan x="17.86" dy="1.2em" class="st3">Inserter</tspan></text>		</g>
		<g id="group162-5" transform="translate(167.069,-69.7736)">
			<title>Dynamic connector.19</title>
			<g id="group163-6">
				<title>Sheet.163</title>
				<g id="shape164-7">
					<title>Sheet.164</title>
					<path d="M0 128.96 L24.27 128.9 L0 128.96 Z" class="st4"/>
					<path d="M0 128.96 L24.27 128.9" class="st5"/>
				</g>
				<g id="group165-10" transform="translate(23.9043,4.71056) rotate(-0.170185)">
					<title>mrkr4-18</title>
					<g id="shape166-11" transform="translate(9.54002,248.378) rotate(180)">
						<title>Sheet.166</title>
						<path d="M9.54 128.96 L0 124.19 L9.54 119.42 L9.54 128.96 Z" class="st6"/>
					</g>
				</g>
			</g>
		</g>
		<g id="group167-13" transform="translate(253.784,-69.7736)">
			<title>Dynamic connector</title>
			<g id="group168-14">
				<title>Sheet.168</title>
				<g id="shape169-15">
					<title>Sheet.169</title>
					<path d="M0 128.96 L34.4 128.96 L0 128.96 Z" class="st4"/>
					<path d="M0 128.96 L34.4 128.96" class="st5"/>
				</g>
				<g id="group170-18" transform="translate(34.4,4.77001)">
					<title>mrkr4-18</title>
					<g id="shape171-19" transform="translate(9.54002,248.378) rotate(180)">
						<title>Sheet.171</title>
						<path d="M9.54 128.96 L0 124.19 L9.54 119.42 L9.54 128.96 Z" class="st6"/>
					</g>
				</g>
			</g>
		</g>
		<g id="group172-21" transform="translate(300.297,-24.4193)">
			<title>Rectangle.9</title>
			<desc>Open Source FFT Core</desc>
			<g id="shape173-22">
				<title>Sheet.173</title>
				<path d="M0 128.96 L323.15 128.96 L323.15 43.92 L0 43.92 L0 128.96 Z" class="st7"/>
			</g>
			<g id="shape174-24" transform="translate(124.283,-69.04)">
				<title>Sheet.174</title>
				<desc>Open Source FFT Core</desc>
				<rect x="0" y="116.959" width="164.028" height="12" class="st8"/>
				<text x="0" y="125.96" class="st9"><tspan class="st10">Open Source FFT Core</tspan></text>			</g>
		</g>
		<g id="group184-28" transform="translate(362.659,-66.7366)">
			<title>Dynamic connector.6</title>
			<g id="group185-29">
				<title>Sheet.185</title>
				<g id="shape186-30">
					<title>Sheet.186</title>
					<path d="M0 128.96 L34.19 128.96 L0 128.96 Z" class="st4"/>
					<path d="M0 128.96 L34.19 128.96" class="st5"/>
				</g>
				<g id="group187-33" transform="translate(34.19,4.77001)">
					<title>mrkr4-18</title>
					<g id="shape188-34" transform="translate(9.54002,248.378) rotate(180)">
						<title>Sheet.188</title>
						<path d="M9.54 128.96 L0 124.19 L9.54 119.42 L9.54 128.96 Z" class="st6"/>
					</g>
				</g>
			</g>
		</g>
		<g id="group189-36" transform="translate(505.52,-66.7366)">
			<title>Dynamic connector.7</title>
			<g id="group190-37">
				<title>Sheet.190</title>
				<g id="shape191-38">
					<title>Sheet.191</title>
					<path d="M0 128.96 L31.76 128.96 L0 128.96 Z" class="st4"/>
					<path d="M0 128.96 L31.76 128.96" class="st5"/>
				</g>
				<g id="group192-41" transform="translate(31.76,4.77001)">
					<title>mrkr4-18</title>
					<g id="shape193-42" transform="translate(9.54002,248.378) rotate(180)">
						<title>Sheet.193</title>
						<path d="M9.54 128.96 L0 124.19 L9.54 119.42 L9.54 128.96 Z" class="st6"/>
					</g>
				</g>
			</g>
		</g>
		<g id="group194-44" transform="translate(589.431,-66.7366)">
			<title>Dynamic connector.11</title>
			<g id="group195-45">
				<title>Sheet.195</title>
				<g id="shape196-46">
					<title>Sheet.196</title>
					<path d="M0 128.96 L51.87 128.96 L59.25 128.96 L0 128.96 Z" class="st4"/>
					<path d="M0 128.96 L51.87 128.96 L59.25 128.96" class="st5"/>
				</g>
				<g id="group197-49" transform="translate(49.7099,4.77001)">
					<title>mrkr4-36</title>
					<g id="shape198-50" transform="translate(9.54002,248.378) rotate(180)">
						<title>Sheet.198</title>
						<path d="M9.54 128.96 L0 124.19 L9.54 119.42 L9.54 128.96 Z" class="st6"/>
					</g>
				</g>
			</g>
		</g>
		<g id="group199-52" transform="translate(646.124,-18.75)">
			<title>Rectangle.20</title>
			<desc>Optional</desc>
			<g id="shape200-53">
				<title>Sheet.200</title>
				<path d="M0 128.96 L80.18 128.96 L80.18 38.25 L0 38.25 L0 128.96 Z" class="st11"/>
			</g>
			<g id="shape201-55" transform="translate(21.8107,-3.99999)">
				<title>Sheet.201</title>
				<desc>Optional</desc>
				<rect x="0" y="116.959" width="80.8179" height="12" class="st8"/>
				<text x="0" y="125.96" class="st9">Optional</text>			</g>
		</g>
		<g id="group202-58" transform="translate(748.171,-58.435)">
			<title>Sheet.202</title>
			<desc>Samples Out</desc>
			<g id="shape203-59">
				<title>Sheet.203</title>
				<rect x="0" y="108.959" width="39.4679" height="20.0001" class="st12"/>
			</g>
			<g id="shape204-61" transform="translate(2.00091,-2.80136)">
				<title>Sheet.204</title>
				<desc>Samples Out</desc>
				<rect x="0" y="114.559" width="66.0306" height="14.4001" class="st8"/>
				<text x="0" y="125.36" class="st13">Samples Out</text>			</g>
		</g>
		<g id="group205-64" transform="translate(706.489,-68.3551)">
			<title>Sheet.205</title>
			<g id="group206-65">
				<title>Sheet.206</title>
				<g id="shape207-66">
					<title>Sheet.207</title>
					<path d="M0 128.88 L29.37 128.94 L38.01 128.96 L0 128.88 Z" class="st4"/>
					<path d="M0 128.88 L29.37 128.94 L38.01 128.96" class="st5"/>
				</g>
				<g id="group208-69" transform="translate(28.7575,4.74826) rotate(0.132629)">
					<title>mrkr4-36</title>
					<g id="shape209-70" transform="translate(9.54002,248.378) rotate(180)">
						<title>Sheet.209</title>
						<path d="M9.54 128.96 L0 124.19 L9.54 119.42 L9.54 128.96 Z" class="st6"/>
					</g>
				</g>
			</g>
		</g>
		<g id="shape214-72" transform="translate(18.25,-62.6083)">
			<title>Sheet.214</title>
			<desc>Samples In</desc>
			<rect x="0" y="108.959" width="76.5354" height="20" class="st14"/>
			<text x="11.96" y="122.56" class="st13">Samples In</text>		</g>
		<g id="group215-75" transform="translate(88.9374,-72.5483)">
			<title>Dynamic connector.215</title>
			<g id="group216-76">
				<title>Sheet.216</title>
				<g id="shape217-77">
					<title>Sheet.217</title>
					<path d="M0 128.96 L10.1 128.9 L0 128.96 Z" class="st4"/>
					<path d="M0 128.96 L10.1 128.9" class="st5"/>
				</g>
				<g id="group218-80" transform="translate(9.73112,4.71056) rotate(-0.170185)">
					<title>mrkr4-18</title>
					<g id="shape219-81" transform="translate(9.54002,248.378) rotate(180)">
						<title>Sheet.219</title>
						<path d="M9.54 128.96 L0 124.19 L9.54 119.42 L9.54 128.96 Z" class="st6"/>
					</g>
				</g>
			</g>
		</g>
		<g id="group181-83" transform="translate(546.323,-47.0965)">
			<title>Rectangle.3</title>
			<desc>Bit Reversal</desc>
			<g id="shape182-84">
				<title>Sheet.182</title>
				<rect x="0" y="86.4395" width="70.8663" height="42.5198" class="st1"/>
			</g>
			<g id="shape183-86" transform="translate(11.57,-15.2614)">
				<title>Sheet.183</title>
				<desc>Bit Reversal</desc>
				<rect x="0" y="116.959" width="120" height="12" class="st8"/>
				<text x="0" y="125.96" class="st15">Bit Reversal</text>			</g>
		</g>
		<g id="shape210-89" transform="translate(109.475,-37.1751)">
			<title>Sheet.210</title>
			<desc>Sample to FFT Frame Creator</desc>
			<rect x="0" y="58.093" width="70.8663" height="70.8663" class="st1"/>
			<text x="4.03" y="90.23" class="st2">Sample to FFT <tspan x="3.1" dy="1.2em" class="st3">Frame Creator</tspan></text>		</g>
		<g id="shape161-93" transform="translate(201.085,-35.7579)">
			<title>Sheet.161</title>
			<desc>Apply Gain Factor</desc>
			<rect x="0" y="58.093" width="70.8663" height="70.8663" class="st1"/>
			<text x="11.22" y="90.23" class="st2">Apply Gain <tspan x="21.29" dy="1.2em" class="st3">Factor</tspan></text>		</g>
		<g id="group175-97" transform="translate(304.79,-47.0965)">
			<title>Rectangle</title>
			<desc>Bit Reversal</desc>
			<g id="shape176-98">
				<title>Sheet.176</title>
				<rect x="0" y="86.4395" width="70.8663" height="42.5198" class="st1"/>
			</g>
			<g id="shape177-100" transform="translate(11.57,-15.2614)">
				<title>Sheet.177</title>
				<desc>Bit Reversal</desc>
				<rect x="0" y="116.959" width="120" height="12" class="st8"/>
				<text x="0" y="125.96" class="st15">Bit Reversal</text>			</g>
		</g>
		<g id="group178-103" transform="translate(404.628,-47.0965)">
			<title>Rectangle.2</title>
			<desc>Butterfly Algorithm</desc>
			<g id="shape179-104">
				<title>Sheet.179</title>
				<rect x="0" y="86.4395" width="113.386" height="42.5198" class="st1"/>
			</g>
			<g id="shape180-106" transform="translate(17.48,-15.2614)">
				<title>Sheet.180</title>
				<desc>Butterfly Algorithm</desc>
				<rect x="0" y="116.959" width="190.001" height="12" class="st8"/>
				<text x="0" y="125.96" class="st15">Butterfly Algorithm</text>			</g>
		</g>
	</g>
</svg>
