<?xml version="1.0" encoding="UTF-8"?>
<!DOCTYPE svg PUBLIC "-//W3C//DTD SVG 1.1//EN" "http://www.w3.org/Graphics/SVG/1.1/DTD/svg11.dtd">
<svg version="1.2" width="157.51mm" height="28.93mm" viewBox="1000 1000 15751 2893" preserveAspectRatio="xMidYMid" fill-rule="evenodd" stroke-width="28.222" stroke-linejoin="round" xmlns="http://www.w3.org/2000/svg" xmlns:ooo="http://xml.openoffice.org/svg/export" xmlns:xlink="http://www.w3.org/1999/xlink" xmlns:presentation="http://sun.com/xmlns/staroffice/presentation" xmlns:smil="http://www.w3.org/2001/SMIL20/" xmlns:anim="urn:oasis:names:tc:opendocument:xmlns:animation:1.0" xml:space="preserve">
 <defs class="ClipPathGroup">
  <clipPath id="presentation_clip_path" clipPathUnits="userSpaceOnUse">
   <rect x="1000" y="1000" width="15751" height="2893"/>
  </clipPath>
  <clipPath id="presentation_clip_path_shrink" clipPathUnits="userSpaceOnUse">
   <rect x="1015" y="1002" width="15720" height="2888"/>
  </clipPath>
 </defs>
 <defs>
  <font id="EmbeddedFont_1" horiz-adv-x="2048">
   <font-face font-family="Liberation Mono embedded" units-per-em="2048" font-weight="normal" font-style="normal" ascent="1693" descent="609"/>
   <missing-glyph horiz-adv-x="2048" d="M 0,0 L 2047,0 2047,2047 0,2047 0,0 Z"/>
   <glyph unicode="u" horiz-adv-x="900" d="M 365,1082 L 365,396 C 365,343 369,299 377,264 384,229 397,200 415,179 432,157 455,142 484,133 512,124 547,119 589,119 632,119 670,127 705,142 739,157 768,178 793,207 817,235 836,270 849,312 862,353 868,401 868,455 L 868,1082 1049,1082 1049,231 C 1049,208 1049,185 1050,160 1050,135 1050,111 1051,89 1052,66 1052,47 1053,31 1054,15 1054,5 1055,0 L 885,0 C 884,3 884,12 883,27 882,42 882,59 881,78 880,97 879,116 878,136 877,155 877,172 877,185 L 874,185 C 857,154 838,125 817,100 796,75 772,53 745,36 718,18 686,4 651,-6 616,-15 575,-20 528,-20 468,-20 416,-13 373,2 330,17 294,39 266,70 238,101 218,140 205,189 192,237 185,294 185,361 L 185,1082 365,1082 Z"/>
   <glyph unicode="t" horiz-adv-x="848" d="M 190,940 L 190,1082 360,1082 418,1364 538,1364 538,1082 970,1082 970,940 538,940 538,288 C 538,235 552,196 581,171 609,146 655,133 720,133 747,133 774,134 803,137 831,139 858,142 885,145 911,148 936,152 959,156 982,160 1001,164 1017,167 L 1017,30 C 1002,26 983,21 960,16 937,11 911,6 882,1 853,-4 821,-8 787,-11 753,-14 718,-16 682,-16 574,-16 493,7 439,53 385,98 358,170 358,269 L 358,940 190,940 Z"/>
   <glyph unicode="s" horiz-adv-x="900" d="M 1060,309 C 1060,258 1050,213 1031,172 1011,131 982,97 945,69 908,40 862,18 808,3 753,-12 691,-20 621,-20 558,-20 502,-15 452,-7 401,3 357,17 319,38 281,59 249,86 224,121 198,155 179,197 167,248 L 326,279 C 334,242 347,213 365,192 382,170 404,153 429,142 454,131 482,123 515,120 548,116 583,114 621,114 660,114 696,117 729,123 762,128 790,138 814,152 838,165 857,183 871,205 884,226 891,253 891,285 891,318 883,345 866,366 849,386 825,403 796,417 767,431 732,443 692,453 651,463 607,474 560,487 517,498 475,511 433,524 391,537 354,555 321,577 288,598 261,626 241,659 220,692 210,735 210,786 210,884 245,961 316,1016 387,1071 489,1099 623,1099 676,1099 725,1094 771,1085 817,1075 858,1060 894,1039 930,1018 960,991 985,958 1009,925 1026,885 1035,839 L 873,819 C 868,849 858,873 843,892 828,911 809,926 787,937 764,948 739,955 711,959 683,963 654,965 623,965 460,965 378,915 378,814 378,783 385,759 400,740 414,721 434,705 460,692 486,679 517,669 553,660 589,651 629,640 672,629 715,618 760,606 806,592 851,578 893,559 931,536 968,513 999,483 1024,447 1048,410 1060,364 1060,309 Z"/>
   <glyph unicode="r" horiz-adv-x="821" d="M 1045,918 C 1014,923 981,928 947,932 912,935 874,937 833,937 777,937 727,926 682,903 637,880 600,850 569,811 538,772 515,726 499,674 482,622 474,567 474,508 L 474,0 294,0 294,701 C 294,738 292,776 288,815 284,854 279,890 274,925 269,959 263,990 257,1017 251,1044 246,1066 242,1082 L 413,1082 C 418,1066 423,1048 428,1027 433,1006 437,985 442,963 447,940 451,918 454,895 457,872 460,851 461,832 L 466,832 C 485,873 504,911 525,944 546,977 570,1006 599,1029 627,1052 660,1070 699,1083 738,1096 784,1102 839,1102 876,1102 913,1100 949,1097 985,1094 1017,1090 1045,1085 L 1045,918 Z"/>
   <glyph unicode="p" horiz-adv-x="927" d="M 1090,546 C 1090,464 1083,388 1070,319 1057,250 1035,190 1004,140 973,90 933,51 883,23 833,-6 771,-20 698,-20 661,-20 626,-17 593,-10 560,-3 529,7 500,22 471,37 446,56 424,79 401,102 382,131 367,164 L 362,164 C 363,163 363,157 364,147 364,136 364,123 365,108 365,93 365,75 366,56 366,37 366,17 366,-2 L 366,-425 185,-425 185,858 C 185,885 185,910 185,935 184,960 184,982 183,1002 182,1021 182,1038 181,1052 180,1066 180,1076 179,1082 L 354,1082 C 355,1080 356,1073 357,1061 358,1048 359,1033 360,1016 361,999 362,980 363,960 364,940 364,921 364,904 L 368,904 C 385,939 404,969 425,994 446,1019 469,1040 496,1057 523,1073 553,1085 586,1093 619,1100 657,1104 698,1104 771,1104 833,1091 883,1064 933,1037 973,1000 1004,951 1035,902 1057,843 1070,774 1083,705 1090,629 1090,546 Z M 904,546 C 904,613 900,672 892,724 884,776 870,820 851,856 831,891 805,918 773,937 740,956 700,965 651,965 612,965 575,959 540,947 505,934 475,912 450,880 424,847 404,802 389,745 374,688 366,614 366,524 366,447 372,383 385,331 397,278 415,236 439,204 463,171 493,148 528,134 563,120 604,113 649,113 698,113 738,123 771,142 804,161 830,188 850,225 869,262 883,307 892,361 900,415 904,477 904,546 Z"/>
   <glyph unicode="o" horiz-adv-x="1006" d="M 1097,542 C 1097,447 1086,365 1064,295 1041,224 1009,166 967,119 925,72 874,38 814,15 753,-8 685,-20 609,-20 536,-20 471,-9 412,14 353,37 302,71 261,118 219,165 187,223 164,294 141,364 130,447 130,542 130,728 172,868 257,962 341,1055 460,1102 615,1102 778,1102 899,1056 978,963 1057,870 1097,730 1097,542 Z M 908,542 C 908,626 901,695 887,750 872,805 852,848 827,881 801,914 770,937 735,950 700,963 661,969 618,969 575,969 535,962 498,949 461,935 430,912 404,879 377,846 357,802 342,747 327,692 319,624 319,542 319,458 327,389 343,334 358,279 379,235 406,202 432,169 463,146 498,133 533,120 569,113 607,113 650,113 691,120 728,133 765,146 796,168 823,201 850,234 871,278 886,333 901,388 908,458 908,542 Z"/>
   <glyph unicode="n" horiz-adv-x="900" d="M 868,0 L 868,695 C 868,748 863,792 852,827 841,861 825,888 806,909 786,929 763,943 736,951 709,959 680,963 648,963 609,963 572,956 538,941 503,926 473,904 448,876 422,847 402,812 387,771 372,729 365,681 365,627 L 365,0 185,0 185,851 C 185,874 185,898 185,923 184,948 184,971 183,994 182,1016 182,1035 181,1051 180,1067 180,1077 179,1082 L 349,1082 C 350,1079 350,1070 351,1055 352,1040 353,1024 354,1005 355,986 355,966 356,947 357,927 357,910 357,897 L 360,897 C 376,928 395,957 417,982 438,1007 463,1029 492,1047 520,1064 552,1078 587,1088 622,1097 662,1102 706,1102 761,1102 810,1095 853,1080 896,1065 932,1043 961,1012 990,981 1012,942 1027,894 1042,846 1049,788 1049,721 L 1049,0 868,0 Z"/>
   <glyph unicode="m" horiz-adv-x="1060" d="M 531,0 L 531,686 C 531,739 529,783 525,818 521,853 515,882 506,904 497,925 485,941 471,950 456,959 438,963 417,963 395,963 375,955 358,938 341,921 326,897 313,866 300,835 291,797 284,754 277,710 274,661 274,607 L 274,0 105,0 105,851 C 105,874 105,898 105,923 104,948 104,971 103,994 102,1016 102,1035 101,1051 100,1067 100,1077 99,1082 L 248,1082 C 249,1079 249,1070 250,1057 251,1043 251,1027 252,1010 253,992 253,974 254,955 254,936 254,920 254,907 L 256,907 C 265,933 275,958 287,982 299,1005 314,1026 331,1044 348,1062 368,1076 391,1087 414,1097 441,1102 472,1102 531,1102 575,1086 604,1054 633,1022 653,973 666,906 L 668,906 C 680,937 693,965 708,990 722,1014 738,1034 757,1051 776,1068 797,1080 821,1089 845,1098 873,1102 904,1102 945,1102 979,1095 1007,1080 1035,1065 1058,1043 1075,1012 1092,981 1105,942 1113,894 1120,846 1124,788 1124,721 L 1124,0 956,0 956,686 C 956,739 954,783 950,818 946,853 940,882 931,904 922,925 910,941 896,950 881,959 863,963 842,963 798,963 763,935 738,879 712,823 699,739 699,627 L 699,0 531,0 Z"/>
   <glyph unicode="l" horiz-adv-x="980" d="M 736,142 L 1116,142 1116,0 134,0 134,142 556,142 556,1342 267,1342 267,1484 736,1484 736,142 Z"/>
   <glyph unicode="i" horiz-adv-x="1007" d="M 745,142 L 1125,142 1125,0 143,0 143,142 565,142 565,940 246,940 246,1082 745,1082 745,142 Z M 545,1292 L 545,1484 745,1484 745,1292 545,1292 Z"/>
   <glyph unicode="e" horiz-adv-x="980" d="M 322,503 C 322,446 328,394 341,347 354,299 373,258 398,224 423,189 455,163 493,144 530,125 574,115 623,115 660,115 694,119 725,128 756,136 783,147 808,162 833,177 853,194 870,215 887,235 899,257 907,281 L 1065,236 C 1054,206 1038,176 1017,146 996,115 967,88 932,64 897,39 854,19 803,4 752,-12 692,-20 623,-20 546,-20 478,-8 417,16 356,40 305,76 263,123 221,170 189,230 167,301 144,372 133,454 133,548 133,652 146,739 173,810 199,881 234,938 279,981 324,1024 375,1055 434,1074 492,1093 553,1102 617,1102 704,1102 778,1088 839,1060 899,1032 948,993 986,943 1024,892 1052,832 1069,761 1086,690 1094,612 1094,527 L 1094,503 322,503 Z M 619,969 C 588,969 556,964 523,955 489,945 458,928 429,903 400,878 376,845 357,803 337,760 326,706 324,641 L 908,641 C 903,704 891,756 874,798 857,840 835,874 810,899 784,924 755,942 722,953 689,964 655,969 619,969 Z"/>
   <glyph unicode="c" horiz-adv-x="980" d="M 130,542 C 130,651 144,741 173,813 202,885 240,942 287,985 334,1028 387,1058 447,1076 507,1093 569,1102 632,1102 697,1102 756,1094 807,1077 858,1060 903,1038 940,1009 977,980 1007,945 1030,906 1053,867 1069,824 1078,779 L 886,765 C 875,826 849,874 806,909 763,944 703,961 624,961 567,961 519,952 480,934 441,915 409,889 386,854 362,819 345,775 335,724 324,672 319,613 319,546 319,479 324,420 335,367 345,314 362,269 386,232 409,195 441,167 480,148 519,129 566,119 623,119 695,119 755,137 802,172 849,207 879,261 890,334 L 1080,322 C 1074,277 1060,234 1037,193 1014,152 984,115 946,84 908,53 863,28 810,9 757,-10 698,-20 631,-20 540,-20 462,-6 399,23 335,52 283,91 244,142 204,192 175,251 157,320 139,388 130,462 130,542 Z"/>
   <glyph unicode="a" horiz-adv-x="1059" d="M 1101,111 C 1111,111 1121,112 1131,113 1141,114 1151,116 1160,118 L 1160,6 C 1137,1 1115,-3 1093,-6 1070,-9 1046,-10 1021,-10 987,-10 958,-5 934,4 909,13 889,26 874,45 859,63 847,86 839,113 831,140 826,171 824,207 L 818,207 C 799,172 779,141 756,113 733,85 707,61 678,42 649,22 615,7 577,-4 539,-15 495,-20 446,-20 341,-20 261,9 208,66 155,123 128,202 128,302 128,373 141,432 168,478 194,523 228,559 271,585 314,611 362,629 417,640 471,650 526,655 582,656 L 818,660 818,719 C 818,764 814,802 805,833 796,864 782,890 764,909 745,928 722,943 694,952 666,961 633,965 596,965 563,965 533,963 506,958 479,953 455,944 436,931 417,918 401,900 389,878 376,855 368,827 364,793 L 176,810 C 183,853 195,892 214,928 232,963 258,994 291,1020 324,1046 366,1066 417,1081 467,1095 528,1102 599,1102 732,1102 833,1071 900,1009 967,946 1000,856 1000,738 L 1000,272 C 1000,219 1007,179 1021,152 1035,125 1062,111 1101,111 Z M 492,117 C 547,117 595,128 636,149 677,170 711,196 738,228 765,260 785,295 798,334 811,373 818,410 818,445 L 818,534 628,530 C 591,529 555,527 518,522 481,517 447,506 418,490 388,474 364,451 345,421 326,390 317,350 317,299 317,244 332,200 362,167 391,134 435,117 492,117 Z"/>
   <glyph unicode="_" horiz-adv-x="1271" d="M -5,-220 L -5,-124 1233,-124 1233,-220 -5,-220 Z"/>
   <glyph unicode=":" horiz-adv-x="266" d="M 496,0 L 496,299 731,299 731,0 496,0 Z M 496,783 L 496,1082 731,1082 731,783 496,783 Z"/>
   <glyph unicode="6" horiz-adv-x="980" d="M 1096,446 C 1096,379 1086,318 1067,261 1047,204 1018,154 980,113 941,71 894,38 837,15 780,-8 715,-20 641,-20 559,-20 487,-4 426,27 365,58 314,102 273,159 232,216 202,286 182,368 161,449 151,541 151,642 151,760 163,864 186,955 209,1046 242,1122 285,1183 328,1244 381,1291 444,1323 506,1354 576,1370 655,1370 703,1370 748,1365 790,1355 832,1345 870,1329 905,1307 939,1284 969,1255 995,1218 1021,1181 1042,1136 1057,1083 L 885,1052 C 866,1113 837,1157 796,1184 755,1211 707,1224 653,1224 604,1224 559,1213 519,1190 479,1167 445,1133 417,1088 389,1043 368,988 353,923 338,857 330,781 330,695 363,756 409,802 468,834 527,865 595,881 672,881 736,881 794,871 847,850 899,829 944,800 981,762 1018,724 1046,678 1066,625 1086,572 1096,512 1096,446 Z M 913,438 C 913,483 907,524 895,561 883,598 865,630 841,657 817,684 787,705 752,720 717,735 676,742 629,742 596,742 563,737 530,726 497,715 467,698 440,677 413,655 391,628 374,595 357,562 348,524 348,481 348,433 355,388 368,345 381,302 401,264 426,231 451,198 481,173 516,154 551,135 591,125 635,125 678,125 717,133 752,148 786,163 815,184 839,211 863,238 881,271 894,310 907,349 913,391 913,438 Z"/>
   <glyph unicode="5" horiz-adv-x="1006" d="M 1099,444 C 1099,377 1088,316 1067,259 1046,202 1014,153 972,112 930,71 878,38 816,15 753,-8 681,-20 599,-20 525,-20 461,-11 406,6 351,23 304,47 266,78 228,108 198,143 176,184 153,225 137,268 128,315 L 310,336 C 317,309 328,284 341,259 354,234 373,211 396,192 419,172 447,156 481,145 514,133 555,127 603,127 650,127 692,134 730,149 768,163 801,183 828,210 855,237 875,270 890,309 905,348 912,391 912,440 912,480 905,517 891,552 877,586 857,616 831,641 805,666 773,686 736,701 698,715 655,722 607,722 577,722 549,719 524,714 499,709 475,701 454,692 432,683 412,672 395,660 377,647 360,634 345,621 L 169,621 216,1349 1017,1349 1017,1204 382,1204 353,779 C 385,804 425,825 473,843 521,860 578,869 644,869 714,869 777,858 833,837 889,816 937,786 976,749 1015,711 1046,666 1067,614 1088,562 1099,505 1099,444 Z"/>
   <glyph unicode="4" horiz-adv-x="1060" d="M 937,319 L 937,0 757,0 757,319 103,319 103,459 738,1349 937,1349 937,461 1125,461 1125,319 937,319 Z M 757,1154 L 257,461 757,461 757,1154 Z"/>
   <glyph unicode="3" horiz-adv-x="1006" d="M 1099,370 C 1099,309 1089,255 1068,207 1047,158 1016,117 976,84 935,51 885,25 826,7 767,-11 698,-20 621,-20 534,-20 461,-9 401,13 341,34 292,63 253,99 214,134 185,175 166,221 147,266 134,313 128,362 L 314,379 C 319,342 329,308 344,277 358,246 377,220 402,198 427,176 457,159 494,147 530,135 572,129 621,129 712,129 783,150 835,192 886,234 912,295 912,376 912,421 901,459 878,489 855,519 826,543 792,561 757,578 720,591 680,598 639,605 602,609 568,609 L 466,609 466,765 564,765 C 598,765 633,769 670,778 707,786 740,799 771,818 801,836 826,860 846,890 865,919 875,955 875,997 875,1068 853,1123 809,1163 764,1202 698,1222 611,1222 532,1222 468,1202 419,1161 370,1120 341,1063 333,989 L 152,1003 C 159,1065 176,1119 203,1165 230,1211 264,1249 305,1280 346,1310 392,1333 445,1348 498,1363 554,1370 613,1370 692,1370 760,1361 817,1342 873,1323 919,1298 955,1266 991,1234 1018,1197 1035,1154 1052,1111 1060,1065 1060,1016 1060,979 1054,944 1042,910 1029,875 1011,844 987,815 962,786 932,761 895,740 858,719 814,703 765,693 L 765,689 C 820,683 868,670 910,650 951,630 986,606 1014,577 1042,548 1063,515 1078,480 1092,445 1099,408 1099,370 Z"/>
   <glyph unicode="2" horiz-adv-x="954" d="M 144,0 L 144,117 C 173,182 212,241 260,296 308,351 359,402 414,451 468,499 523,545 578,589 633,633 682,677 727,720 771,763 807,806 835,851 863,895 877,942 877,991 877,1031 871,1066 858,1095 845,1124 826,1148 803,1167 779,1186 751,1200 719,1209 686,1218 650,1222 611,1222 575,1222 542,1217 511,1207 480,1197 452,1182 429,1162 406,1142 387,1117 372,1088 357,1058 348,1023 343,984 L 159,1001 C 165,1052 179,1099 200,1144 221,1189 251,1228 288,1262 325,1295 370,1322 424,1341 478,1360 540,1370 611,1370 681,1370 744,1362 800,1346 855,1330 903,1307 942,1276 981,1245 1010,1206 1031,1160 1052,1114 1062,1061 1062,1002 1062,939 1048,881 1019,828 990,774 954,723 909,675 864,627 814,581 759,538 704,495 651,452 599,409 547,366 500,324 457,281 414,238 382,193 361,146 L 1084,146 1084,0 144,0 Z"/>
   <glyph unicode="1" horiz-adv-x="1007" d="M 157,0 L 157,145 596,145 596,1166 C 583,1139 561,1114 529,1091 497,1067 460,1046 419,1029 377,1012 332,998 285,988 238,977 192,972 148,972 L 148,1120 C 197,1120 246,1126 294,1137 341,1148 386,1164 427,1185 468,1205 505,1229 537,1257 569,1285 594,1316 611,1349 L 777,1349 777,145 1130,145 1130,0 157,0 Z"/>
   <glyph unicode="0" horiz-adv-x="1006" d="M 1103,675 C 1103,545 1090,436 1065,348 1039,259 1004,188 960,133 915,78 863,39 803,16 743,-8 679,-20 611,-20 542,-20 478,-8 419,16 360,39 308,78 265,133 221,187 187,258 162,347 137,436 124,545 124,675 124,811 137,924 162,1013 187,1102 221,1174 265,1227 309,1280 361,1317 421,1338 481,1359 546,1370 617,1370 684,1370 748,1359 807,1338 866,1317 917,1280 961,1227 1005,1174 1040,1102 1065,1013 1090,924 1103,811 1103,675 Z M 920,675 C 920,781 913,869 900,940 887,1011 867,1067 841,1109 815,1151 783,1181 746,1198 708,1215 665,1224 617,1224 566,1224 522,1215 483,1198 444,1180 412,1150 386,1108 359,1066 339,1010 326,940 313,869 306,781 306,675 306,572 313,486 327,416 340,346 360,290 387,247 413,204 445,174 483,155 521,136 564,127 613,127 660,127 703,136 741,155 779,174 811,204 838,247 864,290 884,346 899,416 913,486 920,572 920,675 Z M 496,555 L 496,804 731,804 731,555 496,555 Z"/>
   <glyph unicode=" " horiz-adv-x="1217"/>
  </font>
 </defs>
 <defs class="TextShapeIndex">
  <g ooo:slide="id1" ooo:id-list="id3 id4 id5 id6 id7 id8 id9 id10 id11 id12 id13 id14 id15 id16 id17 id18 id19 id20 id21 id22 id23 id24 id25 id26 id27 id28 id29 id30 id31 id32 id33 id34 id35 id36 id37 id38 id39 id40 id41 id42 id43 id44 id45 id46 id47"/>
 </defs>
 <defs class="EmbeddedBulletChars">
  <g id="bullet-char-template(57356)" transform="scale(0.00048828125,-0.00048828125)">
   <path d="M 580,1141 L 1163,571 580,0 -4,571 580,1141 Z"/>
  </g>
  <g id="bullet-char-template(57354)" transform="scale(0.00048828125,-0.00048828125)">
   <path d="M 8,1128 L 1137,1128 1137,0 8,0 8,1128 Z"/>
  </g>
  <g id="bullet-char-template(10146)" transform="scale(0.00048828125,-0.00048828125)">
   <path d="M 174,0 L 602,739 174,1481 1456,739 174,0 Z M 1358,739 L 309,1346 659,739 1358,739 Z"/>
  </g>
  <g id="bullet-char-template(10132)" transform="scale(0.00048828125,-0.00048828125)">
   <path d="M 2015,739 L 1276,0 717,0 1260,543 174,543 174,936 1260,936 717,1481 1274,1481 2015,739 Z"/>
  </g>
  <g id="bullet-char-template(10007)" transform="scale(0.00048828125,-0.00048828125)">
   <path d="M 0,-2 C -7,14 -16,27 -25,37 L 356,567 C 262,823 215,952 215,954 215,979 228,992 255,992 264,992 276,990 289,987 310,991 331,999 354,1012 L 381,999 492,748 772,1049 836,1024 860,1049 C 881,1039 901,1025 922,1006 886,937 835,863 770,784 769,783 710,716 594,584 L 774,223 C 774,196 753,168 711,139 L 727,119 C 717,90 699,76 672,76 641,76 570,178 457,381 L 164,-76 C 142,-110 111,-127 72,-127 30,-127 9,-110 8,-76 1,-67 -2,-52 -2,-32 -2,-23 -1,-13 0,-2 Z"/>
  </g>
  <g id="bullet-char-template(10004)" transform="scale(0.00048828125,-0.00048828125)">
   <path d="M 285,-33 C 182,-33 111,30 74,156 52,228 41,333 41,471 41,549 55,616 82,672 116,743 169,778 240,778 293,778 328,747 346,684 L 369,508 C 377,444 397,411 428,410 L 1163,1116 C 1174,1127 1196,1133 1229,1133 1271,1133 1292,1118 1292,1087 L 1292,965 C 1292,929 1282,901 1262,881 L 442,47 C 390,-6 338,-33 285,-33 Z"/>
  </g>
  <g id="bullet-char-template(9679)" transform="scale(0.00048828125,-0.00048828125)">
   <path d="M 813,0 C 632,0 489,54 383,161 276,268 223,411 223,592 223,773 276,916 383,1023 489,1130 632,1184 813,1184 992,1184 1136,1130 1245,1023 1353,916 1407,772 1407,592 1407,412 1353,268 1245,161 1136,54 992,0 813,0 Z"/>
  </g>
  <g id="bullet-char-template(8226)" transform="scale(0.00048828125,-0.00048828125)">
   <path d="M 346,457 C 273,457 209,483 155,535 101,586 74,649 74,723 74,796 101,859 155,911 209,963 273,989 346,989 419,989 480,963 531,910 582,859 608,796 608,723 608,648 583,586 532,535 482,483 420,457 346,457 Z"/>
  </g>
  <g id="bullet-char-template(8211)" transform="scale(0.00048828125,-0.00048828125)">
   <path d="M -4,459 L 1135,459 1135,606 -4,606 -4,459 Z"/>
  </g>
  <g id="bullet-char-template(61548)" transform="scale(0.00048828125,-0.00048828125)">
   <path d="M 173,740 C 173,903 231,1043 346,1159 462,1274 601,1332 765,1332 928,1332 1067,1274 1183,1159 1299,1043 1357,903 1357,740 1357,577 1299,437 1183,322 1067,206 928,148 765,148 601,148 462,206 346,322 231,437 173,577 173,740 Z"/>
  </g>
 </defs>
 <defs class="TextEmbeddedBitmaps"/>
 <g class="SlideGroup">
  <g>
   <g id="container-id1">
    <g id="id1" class="Slide" clip-path="url(#presentation_clip_path)">
     <g class="Page">
      <g class="Group">
       <g class="com.sun.star.drawing.TextShape">
        <g id="id3">
         <rect class="BoundingBox" stroke="none" fill="none" x="1000" y="2084" width="14896" height="570"/>
         <text class="TextShape"><tspan class="TextParagraph" font-family="Liberation Mono, monospace" font-size="282px" font-weight="400"><tspan class="TextPosition" x="1250" y="2442"><tspan fill="rgb(0,0,0)" stroke="none">sample_counter: 0 1 2 3 4 5 6 0</tspan><tspan fill="rgb(0,0,0)" stroke="none"> 1 2 3 4 5 6 0 1 2 3 4 5 6 0 1 2 3 4 5 6 0 1 2 3 4 5 6</tspan></tspan></tspan></text>
        </g>
       </g>
       <g class="com.sun.star.drawing.LineShape">
        <g id="id4">
         <rect class="BoundingBox" stroke="none" fill="none" x="3731" y="1835" width="13021" height="301"/>
         <path fill="none" stroke="rgb(0,0,0)" stroke-width="40" stroke-linejoin="round" d="M 3751,1985 L 16321,1985"/>
         <path fill="rgb(0,0,0)" stroke="none" d="M 16751,1985 L 16301,1835 16301,2135 16751,1985 Z"/>
        </g>
       </g>
       <g class="com.sun.star.drawing.LineShape">
        <g id="id5">
         <rect class="BoundingBox" stroke="none" fill="none" x="3914" y="1000" width="261" height="1021"/>
         <path fill="none" stroke="rgb(0,0,0)" stroke-width="40" stroke-linejoin="round" d="M 4044,2000 L 4044,1243"/>
         <path fill="rgb(0,0,0)" stroke="none" d="M 4020,1257 L 3997,1250 3973,1239 3952,1222 3935,1201 3924,1177 3917,1154 3914,1130 3917,1106 3924,1082 3935,1058 3952,1038 3973,1021 3997,1010 4020,1002 4045,1000 4068,1002 4092,1010 4115,1021 4136,1038 4153,1058 4164,1082 4171,1106 4174,1130 4171,1154 4164,1177 4153,1201 4136,1222 4115,1239 4092,1250 4068,1257 4045,1260 4020,1257 Z"/>
        </g>
       </g>
       <g class="com.sun.star.drawing.LineShape">
        <g id="id6">
         <rect class="BoundingBox" stroke="none" fill="none" x="4252" y="1000" width="261" height="1021"/>
         <path fill="none" stroke="rgb(0,0,0)" stroke-width="40" stroke-linejoin="round" d="M 4382,2000 L 4382,1243"/>
         <path fill="rgb(0,0,0)" stroke="none" d="M 4358,1257 L 4335,1250 4311,1239 4290,1222 4273,1201 4262,1177 4255,1154 4252,1130 4255,1106 4262,1082 4273,1058 4290,1038 4311,1021 4335,1010 4358,1002 4383,1000 4406,1002 4430,1010 4453,1021 4474,1038 4491,1058 4502,1082 4509,1106 4512,1130 4509,1154 4502,1177 4491,1201 4474,1222 4453,1239 4430,1250 4406,1257 4383,1260 4358,1257 Z"/>
        </g>
       </g>
       <g class="com.sun.star.drawing.LineShape">
        <g id="id7">
         <rect class="BoundingBox" stroke="none" fill="none" x="4591" y="1000" width="261" height="1021"/>
         <path fill="none" stroke="rgb(0,0,0)" stroke-width="40" stroke-linejoin="round" d="M 4721,2000 L 4721,1243"/>
         <path fill="rgb(0,0,0)" stroke="none" d="M 4697,1257 L 4674,1250 4650,1239 4629,1222 4612,1201 4601,1177 4594,1154 4591,1130 4594,1106 4601,1082 4612,1058 4629,1038 4650,1021 4674,1010 4697,1002 4722,1000 4745,1002 4769,1010 4792,1021 4813,1038 4830,1058 4841,1082 4848,1106 4851,1130 4848,1154 4841,1177 4830,1201 4813,1222 4792,1239 4769,1250 4745,1257 4722,1260 4697,1257 Z"/>
        </g>
       </g>
       <g class="com.sun.star.drawing.LineShape">
        <g id="id8">
         <rect class="BoundingBox" stroke="none" fill="none" x="4929" y="1000" width="261" height="1021"/>
         <path fill="none" stroke="rgb(43,43,210)" stroke-width="40" stroke-linejoin="round" d="M 5059,2000 L 5059,1243"/>
         <path fill="rgb(43,43,210)" stroke="none" d="M 5035,1257 L 5012,1250 4988,1239 4967,1222 4950,1201 4939,1177 4932,1154 4929,1130 4932,1106 4939,1082 4950,1058 4967,1038 4988,1021 5012,1010 5035,1002 5060,1000 5083,1002 5107,1010 5130,1021 5151,1038 5168,1058 5179,1082 5186,1106 5189,1130 5186,1154 5179,1177 5168,1201 5151,1222 5130,1239 5107,1250 5083,1257 5060,1260 5035,1257 Z"/>
        </g>
       </g>
       <g class="com.sun.star.drawing.LineShape">
        <g id="id9">
         <rect class="BoundingBox" stroke="none" fill="none" x="5267" y="1000" width="261" height="1021"/>
         <path fill="none" stroke="rgb(0,0,0)" stroke-width="40" stroke-linejoin="round" d="M 5397,2000 L 5397,1243"/>
         <path fill="rgb(0,0,0)" stroke="none" d="M 5373,1257 L 5350,1250 5326,1239 5305,1222 5288,1201 5277,1177 5270,1154 5267,1130 5270,1106 5277,1082 5288,1058 5305,1038 5326,1021 5350,1010 5373,1002 5398,1000 5421,1002 5445,1010 5468,1021 5489,1038 5506,1058 5517,1082 5524,1106 5527,1130 5524,1154 5517,1177 5506,1201 5489,1222 5468,1239 5445,1250 5421,1257 5398,1260 5373,1257 Z"/>
        </g>
       </g>
       <g class="com.sun.star.drawing.LineShape">
        <g id="id10">
         <rect class="BoundingBox" stroke="none" fill="none" x="5606" y="1000" width="261" height="1021"/>
         <path fill="none" stroke="rgb(0,0,0)" stroke-width="40" stroke-linejoin="round" d="M 5736,2000 L 5736,1243"/>
         <path fill="rgb(0,0,0)" stroke="none" d="M 5712,1257 L 5689,1250 5665,1239 5644,1222 5627,1201 5616,1177 5609,1154 5606,1130 5609,1106 5616,1082 5627,1058 5644,1038 5665,1021 5689,1010 5712,1002 5737,1000 5760,1002 5784,1010 5807,1021 5828,1038 5845,1058 5856,1082 5863,1106 5866,1130 5863,1154 5856,1177 5845,1201 5828,1222 5807,1239 5784,1250 5760,1257 5737,1260 5712,1257 Z"/>
        </g>
       </g>
       <g class="com.sun.star.drawing.LineShape">
        <g id="id11">
         <rect class="BoundingBox" stroke="none" fill="none" x="6280" y="1858" width="262" height="261"/>
         <path fill="rgb(0,0,0)" stroke="none" d="M 6383,2114 L 6359,2107 6336,2094 6315,2077 6299,2055 6288,2032 6282,2008 6280,1984 6284,1960 6291,1936 6304,1913 6321,1893 6343,1877 6366,1866 6390,1859 6415,1858 6438,1861 6462,1869 6484,1881 6505,1899 6521,1920 6532,1943 6538,1968 6540,1991 6536,2016 6529,2039 6517,2062 6499,2083 6478,2099 6455,2110 6430,2116 6407,2118 6383,2114 Z"/>
        </g>
       </g>
       <g class="com.sun.star.drawing.LineShape">
        <g id="id12">
         <rect class="BoundingBox" stroke="none" fill="none" x="6619" y="1858" width="262" height="261"/>
         <path fill="rgb(0,0,0)" stroke="none" d="M 6722,2114 L 6698,2107 6675,2094 6654,2077 6638,2055 6627,2032 6621,2008 6619,1984 6623,1960 6630,1936 6643,1913 6660,1893 6682,1877 6705,1866 6729,1859 6754,1858 6777,1861 6801,1869 6823,1881 6844,1899 6860,1920 6871,1943 6877,1968 6879,1991 6875,2016 6868,2039 6856,2062 6838,2083 6817,2099 6794,2110 6769,2116 6746,2118 6722,2114 Z"/>
        </g>
       </g>
       <g class="com.sun.star.drawing.LineShape">
        <g id="id13">
         <rect class="BoundingBox" stroke="none" fill="none" x="6957" y="1858" width="262" height="261"/>
         <path fill="rgb(0,0,0)" stroke="none" d="M 7060,2114 L 7036,2107 7013,2094 6992,2077 6976,2055 6965,2032 6959,2008 6957,1984 6961,1960 6968,1936 6981,1913 6998,1893 7020,1877 7043,1866 7067,1859 7092,1858 7115,1861 7139,1869 7161,1881 7182,1899 7198,1920 7209,1943 7215,1968 7217,1991 7213,2016 7206,2039 7194,2062 7176,2083 7155,2099 7132,2110 7107,2116 7084,2118 7060,2114 Z"/>
        </g>
       </g>
       <g class="com.sun.star.drawing.LineShape">
        <g id="id14">
         <rect class="BoundingBox" stroke="none" fill="none" x="7296" y="1858" width="262" height="261"/>
         <path fill="rgb(43,43,210)" stroke="none" d="M 7399,2114 L 7375,2107 7352,2094 7331,2077 7315,2055 7304,2032 7298,2008 7296,1984 7300,1960 7307,1936 7320,1913 7337,1893 7359,1877 7382,1866 7406,1859 7431,1858 7454,1861 7478,1869 7500,1881 7521,1899 7537,1920 7548,1943 7554,1968 7556,1991 7552,2016 7545,2039 7533,2062 7515,2083 7494,2099 7471,2110 7446,2116 7423,2118 7399,2114 Z"/>
        </g>
       </g>
       <g class="com.sun.star.drawing.LineShape">
        <g id="id15">
         <rect class="BoundingBox" stroke="none" fill="none" x="7634" y="1858" width="262" height="261"/>
         <path fill="rgb(0,0,0)" stroke="none" d="M 7737,2114 L 7713,2107 7690,2094 7669,2077 7653,2055 7642,2032 7636,2008 7634,1984 7638,1960 7645,1936 7658,1913 7675,1893 7697,1877 7720,1866 7744,1859 7769,1858 7792,1861 7816,1869 7838,1881 7859,1899 7875,1920 7886,1943 7892,1968 7894,1991 7890,2016 7883,2039 7871,2062 7853,2083 7832,2099 7809,2110 7784,2116 7761,2118 7737,2114 Z"/>
        </g>
       </g>
       <g class="com.sun.star.drawing.LineShape">
        <g id="id16">
         <rect class="BoundingBox" stroke="none" fill="none" x="7972" y="1858" width="262" height="261"/>
         <path fill="rgb(0,0,0)" stroke="none" d="M 8075,2114 L 8051,2107 8028,2094 8007,2077 7991,2055 7980,2032 7974,2008 7972,1984 7976,1960 7983,1936 7996,1913 8013,1893 8035,1877 8058,1866 8082,1859 8107,1858 8130,1861 8154,1869 8176,1881 8197,1899 8213,1920 8224,1943 8230,1968 8232,1991 8228,2016 8221,2039 8209,2062 8191,2083 8170,2099 8147,2110 8122,2116 8099,2118 8075,2114 Z"/>
        </g>
       </g>
       <g class="com.sun.star.drawing.LineShape">
        <g id="id17">
         <rect class="BoundingBox" stroke="none" fill="none" x="9666" y="1000" width="261" height="1021"/>
         <path fill="none" stroke="rgb(43,43,210)" stroke-width="40" stroke-linejoin="round" d="M 9796,2000 L 9796,1243"/>
         <path fill="rgb(43,43,210)" stroke="none" d="M 9772,1257 L 9749,1250 9725,1239 9704,1222 9687,1201 9676,1177 9669,1154 9666,1130 9669,1106 9676,1082 9687,1058 9704,1038 9725,1021 9749,1010 9772,1002 9797,1000 9820,1002 9844,1010 9867,1021 9888,1038 9905,1058 9916,1082 9923,1106 9926,1130 9923,1154 9916,1177 9905,1201 9888,1222 9867,1239 9844,1250 9820,1257 9797,1260 9772,1257 Z"/>
        </g>
       </g>
       <g class="com.sun.star.drawing.LineShape">
        <g id="id18">
         <rect class="BoundingBox" stroke="none" fill="none" x="10004" y="1000" width="261" height="1021"/>
         <path fill="none" stroke="rgb(0,0,0)" stroke-width="40" stroke-linejoin="round" d="M 10134,2000 L 10134,1243"/>
         <path fill="rgb(0,0,0)" stroke="none" d="M 10110,1257 L 10087,1250 10063,1239 10042,1222 10025,1201 10014,1177 10007,1154 10004,1130 10007,1106 10014,1082 10025,1058 10042,1038 10063,1021 10087,1010 10110,1002 10135,1000 10158,1002 10182,1010 10205,1021 10226,1038 10243,1058 10254,1082 10261,1106 10264,1130 10261,1154 10254,1177 10243,1201 10226,1222 10205,1239 10182,1250 10158,1257 10135,1260 10110,1257 Z"/>
        </g>
       </g>
       <g class="com.sun.star.drawing.LineShape">
        <g id="id19">
         <rect class="BoundingBox" stroke="none" fill="none" x="10343" y="1000" width="261" height="1021"/>
         <path fill="none" stroke="rgb(0,0,0)" stroke-width="40" stroke-linejoin="round" d="M 10473,2000 L 10473,1243"/>
         <path fill="rgb(0,0,0)" stroke="none" d="M 10449,1257 L 10426,1250 10402,1239 10381,1222 10364,1201 10353,1177 10346,1154 10343,1130 10346,1106 10353,1082 10364,1058 10381,1038 10402,1021 10426,1010 10449,1002 10474,1000 10497,1002 10521,1010 10544,1021 10565,1038 10582,1058 10593,1082 10600,1106 10603,1130 10600,1154 10593,1177 10582,1201 10565,1222 10544,1239 10521,1250 10497,1257 10474,1260 10449,1257 Z"/>
        </g>
       </g>
       <g class="com.sun.star.drawing.LineShape">
        <g id="id20">
         <rect class="BoundingBox" stroke="none" fill="none" x="10681" y="1000" width="261" height="1021"/>
         <path fill="none" stroke="rgb(0,0,0)" stroke-width="40" stroke-linejoin="round" d="M 10811,2000 L 10811,1243"/>
         <path fill="rgb(0,0,0)" stroke="none" d="M 10787,1257 L 10764,1250 10740,1239 10719,1222 10702,1201 10691,1177 10684,1154 10681,1130 10684,1106 10691,1082 10702,1058 10719,1038 10740,1021 10764,1010 10787,1002 10812,1000 10835,1002 10859,1010 10882,1021 10903,1038 10920,1058 10931,1082 10938,1106 10941,1130 10938,1154 10931,1177 10920,1201 10903,1222 10882,1239 10859,1250 10835,1257 10812,1260 10787,1257 Z"/>
        </g>
       </g>
       <g class="com.sun.star.drawing.LineShape">
        <g id="id21">
         <rect class="BoundingBox" stroke="none" fill="none" x="11019" y="1000" width="261" height="1021"/>
         <path fill="none" stroke="rgb(0,0,0)" stroke-width="40" stroke-linejoin="round" d="M 11149,2000 L 11149,1243"/>
         <path fill="rgb(0,0,0)" stroke="none" d="M 11125,1257 L 11102,1250 11078,1239 11057,1222 11040,1201 11029,1177 11022,1154 11019,1130 11022,1106 11029,1082 11040,1058 11057,1038 11078,1021 11102,1010 11125,1002 11150,1000 11173,1002 11197,1010 11220,1021 11241,1038 11258,1058 11269,1082 11276,1106 11279,1130 11276,1154 11269,1177 11258,1201 11241,1222 11220,1239 11197,1250 11173,1257 11150,1260 11125,1257 Z"/>
        </g>
       </g>
       <g class="com.sun.star.drawing.LineShape">
        <g id="id22">
         <rect class="BoundingBox" stroke="none" fill="none" x="11358" y="1000" width="261" height="1021"/>
         <path fill="none" stroke="rgb(0,0,0)" stroke-width="40" stroke-linejoin="round" d="M 11488,2000 L 11488,1243"/>
         <path fill="rgb(0,0,0)" stroke="none" d="M 11464,1257 L 11441,1250 11417,1239 11396,1222 11379,1201 11368,1177 11361,1154 11358,1130 11361,1106 11368,1082 11379,1058 11396,1038 11417,1021 11441,1010 11464,1002 11489,1000 11512,1002 11536,1010 11559,1021 11580,1038 11597,1058 11608,1082 11615,1106 11618,1130 11615,1154 11608,1177 11597,1201 11580,1222 11559,1239 11536,1250 11512,1257 11489,1260 11464,1257 Z"/>
        </g>
       </g>
       <g class="com.sun.star.drawing.LineShape">
        <g id="id23">
         <rect class="BoundingBox" stroke="none" fill="none" x="11696" y="1000" width="261" height="1021"/>
         <path fill="none" stroke="rgb(0,0,0)" stroke-width="40" stroke-linejoin="round" d="M 11826,2000 L 11826,1243"/>
         <path fill="rgb(0,0,0)" stroke="none" d="M 11802,1257 L 11779,1250 11755,1239 11734,1222 11717,1201 11706,1177 11699,1154 11696,1130 11699,1106 11706,1082 11717,1058 11734,1038 11755,1021 11779,1010 11802,1002 11827,1000 11850,1002 11874,1010 11897,1021 11918,1038 11935,1058 11946,1082 11953,1106 11956,1130 11953,1154 11946,1177 11935,1201 11918,1222 11897,1239 11874,1250 11850,1257 11827,1260 11802,1257 Z"/>
        </g>
       </g>
       <g class="com.sun.star.drawing.LineShape">
        <g id="id24">
         <rect class="BoundingBox" stroke="none" fill="none" x="12034" y="1000" width="261" height="1021"/>
         <path fill="none" stroke="rgb(43,43,210)" stroke-width="40" stroke-linejoin="round" d="M 12164,2000 L 12164,1243"/>
         <path fill="rgb(43,43,210)" stroke="none" d="M 12140,1257 L 12117,1250 12093,1239 12072,1222 12055,1201 12044,1177 12037,1154 12034,1130 12037,1106 12044,1082 12055,1058 12072,1038 12093,1021 12117,1010 12140,1002 12165,1000 12188,1002 12212,1010 12235,1021 12256,1038 12273,1058 12284,1082 12291,1106 12294,1130 12291,1154 12284,1177 12273,1201 12256,1222 12235,1239 12212,1250 12188,1257 12165,1260 12140,1257 Z"/>
        </g>
       </g>
       <g class="com.sun.star.drawing.LineShape">
        <g id="id25">
         <rect class="BoundingBox" stroke="none" fill="none" x="12373" y="1000" width="261" height="1021"/>
         <path fill="none" stroke="rgb(0,0,0)" stroke-width="40" stroke-linejoin="round" d="M 12503,2000 L 12503,1243"/>
         <path fill="rgb(0,0,0)" stroke="none" d="M 12479,1257 L 12456,1250 12432,1239 12411,1222 12394,1201 12383,1177 12376,1154 12373,1130 12376,1106 12383,1082 12394,1058 12411,1038 12432,1021 12456,1010 12479,1002 12504,1000 12527,1002 12551,1010 12574,1021 12595,1038 12612,1058 12623,1082 12630,1106 12633,1130 12630,1154 12623,1177 12612,1201 12595,1222 12574,1239 12551,1250 12527,1257 12504,1260 12479,1257 Z"/>
        </g>
       </g>
       <g class="com.sun.star.drawing.LineShape">
        <g id="id26">
         <rect class="BoundingBox" stroke="none" fill="none" x="12711" y="1000" width="261" height="1021"/>
         <path fill="none" stroke="rgb(0,0,0)" stroke-width="40" stroke-linejoin="round" d="M 12841,2000 L 12841,1243"/>
         <path fill="rgb(0,0,0)" stroke="none" d="M 12817,1257 L 12794,1250 12770,1239 12749,1222 12732,1201 12721,1177 12714,1154 12711,1130 12714,1106 12721,1082 12732,1058 12749,1038 12770,1021 12794,1010 12817,1002 12842,1000 12865,1002 12889,1010 12912,1021 12933,1038 12950,1058 12961,1082 12968,1106 12971,1130 12968,1154 12961,1177 12950,1201 12933,1222 12912,1239 12889,1250 12865,1257 12842,1260 12817,1257 Z"/>
        </g>
       </g>
       <g class="com.sun.star.drawing.LineShape">
        <g id="id27">
         <rect class="BoundingBox" stroke="none" fill="none" x="13050" y="1000" width="261" height="1021"/>
         <path fill="none" stroke="rgb(0,0,0)" stroke-width="40" stroke-linejoin="round" d="M 13180,2000 L 13180,1243"/>
         <path fill="rgb(0,0,0)" stroke="none" d="M 13156,1257 L 13133,1250 13109,1239 13088,1222 13071,1201 13060,1177 13053,1154 13050,1130 13053,1106 13060,1082 13071,1058 13088,1038 13109,1021 13133,1010 13156,1002 13181,1000 13204,1002 13228,1010 13251,1021 13272,1038 13289,1058 13300,1082 13307,1106 13310,1130 13307,1154 13300,1177 13289,1201 13272,1222 13251,1239 13228,1250 13204,1257 13181,1260 13156,1257 Z"/>
        </g>
       </g>
       <g class="com.sun.star.drawing.LineShape">
        <g id="id28">
         <rect class="BoundingBox" stroke="none" fill="none" x="9328" y="1000" width="261" height="1021"/>
         <path fill="none" stroke="rgb(0,0,0)" stroke-width="40" stroke-linejoin="round" d="M 9458,2000 L 9458,1243"/>
         <path fill="rgb(0,0,0)" stroke="none" d="M 9434,1257 L 9411,1250 9387,1239 9366,1222 9349,1201 9338,1177 9331,1154 9328,1130 9331,1106 9338,1082 9349,1058 9366,1038 9387,1021 9411,1010 9434,1002 9459,1000 9482,1002 9506,1010 9529,1021 9550,1038 9567,1058 9578,1082 9585,1106 9588,1130 9585,1154 9578,1177 9567,1201 9550,1222 9529,1239 9506,1250 9482,1257 9459,1260 9434,1257 Z"/>
        </g>
       </g>
       <g class="com.sun.star.drawing.LineShape">
        <g id="id29">
         <rect class="BoundingBox" stroke="none" fill="none" x="13724" y="1858" width="262" height="261"/>
         <path fill="rgb(0,0,0)" stroke="none" d="M 13827,2114 L 13803,2107 13780,2094 13759,2077 13743,2055 13732,2032 13726,2008 13724,1984 13728,1960 13735,1936 13748,1913 13765,1893 13787,1877 13810,1866 13834,1859 13859,1858 13882,1861 13906,1869 13928,1881 13949,1899 13965,1920 13976,1943 13982,1968 13984,1991 13980,2016 13973,2039 13961,2062 13943,2083 13922,2099 13899,2110 13874,2116 13851,2118 13827,2114 Z"/>
        </g>
       </g>
       <g class="com.sun.star.drawing.LineShape">
        <g id="id30">
         <rect class="BoundingBox" stroke="none" fill="none" x="14063" y="1858" width="262" height="261"/>
         <path fill="rgb(0,0,0)" stroke="none" d="M 14166,2114 L 14142,2107 14119,2094 14098,2077 14082,2055 14071,2032 14065,2008 14063,1984 14067,1960 14074,1936 14087,1913 14104,1893 14126,1877 14149,1866 14173,1859 14198,1858 14221,1861 14245,1869 14267,1881 14288,1899 14304,1920 14315,1943 14321,1968 14323,1991 14319,2016 14312,2039 14300,2062 14282,2083 14261,2099 14238,2110 14213,2116 14190,2118 14166,2114 Z"/>
        </g>
       </g>
       <g class="com.sun.star.drawing.LineShape">
        <g id="id31">
         <rect class="BoundingBox" stroke="none" fill="none" x="14401" y="1858" width="262" height="261"/>
         <path fill="rgb(43,43,210)" stroke="none" d="M 14504,2114 L 14480,2107 14457,2094 14436,2077 14420,2055 14409,2032 14403,2008 14401,1984 14405,1960 14412,1936 14425,1913 14442,1893 14464,1877 14487,1866 14511,1859 14536,1858 14559,1861 14583,1869 14605,1881 14626,1899 14642,1920 14653,1943 14659,1968 14661,1991 14657,2016 14650,2039 14638,2062 14620,2083 14599,2099 14576,2110 14551,2116 14528,2118 14504,2114 Z"/>
        </g>
       </g>
       <g class="com.sun.star.drawing.LineShape">
        <g id="id32">
         <rect class="BoundingBox" stroke="none" fill="none" x="14739" y="1858" width="262" height="261"/>
         <path fill="rgb(0,0,0)" stroke="none" d="M 14842,2114 L 14818,2107 14795,2094 14774,2077 14758,2055 14747,2032 14741,2008 14739,1984 14743,1960 14750,1936 14763,1913 14780,1893 14802,1877 14825,1866 14849,1859 14874,1858 14897,1861 14921,1869 14943,1881 14964,1899 14980,1920 14991,1943 14997,1968 14999,1991 14995,2016 14988,2039 14976,2062 14958,2083 14937,2099 14914,2110 14889,2116 14866,2118 14842,2114 Z"/>
        </g>
       </g>
       <g class="com.sun.star.drawing.LineShape">
        <g id="id33">
         <rect class="BoundingBox" stroke="none" fill="none" x="15078" y="1858" width="262" height="261"/>
         <path fill="rgb(0,0,0)" stroke="none" d="M 15181,2114 L 15157,2107 15134,2094 15113,2077 15097,2055 15086,2032 15080,2008 15078,1984 15082,1960 15089,1936 15102,1913 15119,1893 15141,1877 15164,1866 15188,1859 15213,1858 15236,1861 15260,1869 15282,1881 15303,1899 15319,1920 15330,1943 15336,1968 15338,1991 15334,2016 15327,2039 15315,2062 15297,2083 15276,2099 15253,2110 15228,2116 15205,2118 15181,2114 Z"/>
        </g>
       </g>
       <g class="com.sun.star.drawing.LineShape">
        <g id="id34">
         <rect class="BoundingBox" stroke="none" fill="none" x="15416" y="1858" width="262" height="261"/>
         <path fill="rgb(0,0,0)" stroke="none" d="M 15519,2114 L 15495,2107 15472,2094 15451,2077 15435,2055 15424,2032 15418,2008 15416,1984 15420,1960 15427,1936 15440,1913 15457,1893 15479,1877 15502,1866 15526,1859 15551,1858 15574,1861 15598,1869 15620,1881 15641,1899 15657,1920 15668,1943 15674,1968 15676,1991 15672,2016 15665,2039 15653,2062 15635,2083 15614,2099 15591,2110 15566,2116 15543,2118 15519,2114 Z"/>
        </g>
       </g>
       <g class="com.sun.star.drawing.LineShape">
        <g id="id35">
         <rect class="BoundingBox" stroke="none" fill="none" x="5944" y="1000" width="261" height="1021"/>
         <path fill="none" stroke="rgb(0,0,0)" stroke-width="40" stroke-linejoin="round" d="M 6074,2000 L 6074,1243"/>
         <path fill="rgb(0,0,0)" stroke="none" d="M 6050,1257 L 6027,1250 6003,1239 5982,1222 5965,1201 5954,1177 5947,1154 5944,1130 5947,1106 5954,1082 5965,1058 5982,1038 6003,1021 6027,1010 6050,1002 6075,1000 6098,1002 6122,1010 6145,1021 6166,1038 6183,1058 6194,1082 6201,1106 6204,1130 6201,1154 6194,1177 6183,1201 6166,1222 6145,1239 6122,1250 6098,1257 6075,1260 6050,1257 Z"/>
        </g>
       </g>
       <g class="com.sun.star.drawing.LineShape">
        <g id="id36">
         <rect class="BoundingBox" stroke="none" fill="none" x="8311" y="1858" width="262" height="261"/>
         <path fill="rgb(0,0,0)" stroke="none" d="M 8414,2114 L 8390,2107 8367,2094 8346,2077 8330,2055 8319,2032 8313,2008 8311,1984 8315,1960 8322,1936 8335,1913 8352,1893 8374,1877 8397,1866 8421,1859 8446,1858 8469,1861 8493,1869 8515,1881 8536,1899 8552,1920 8563,1943 8569,1968 8571,1991 8567,2016 8560,2039 8548,2062 8530,2083 8509,2099 8486,2110 8461,2116 8438,2118 8414,2114 Z"/>
        </g>
       </g>
       <g class="com.sun.star.drawing.LineShape">
        <g id="id37">
         <rect class="BoundingBox" stroke="none" fill="none" x="8989" y="1000" width="261" height="1021"/>
         <path fill="none" stroke="rgb(0,0,0)" stroke-width="40" stroke-linejoin="round" d="M 9119,2000 L 9119,1243"/>
         <path fill="rgb(0,0,0)" stroke="none" d="M 9095,1257 L 9072,1250 9048,1239 9027,1222 9010,1201 8999,1177 8992,1154 8989,1130 8992,1106 8999,1082 9010,1058 9027,1038 9048,1021 9072,1010 9095,1002 9120,1000 9143,1002 9167,1010 9190,1021 9211,1038 9228,1058 9239,1082 9246,1106 9249,1130 9246,1154 9239,1177 9228,1201 9211,1222 9190,1239 9167,1250 9143,1257 9120,1260 9095,1257 Z"/>
        </g>
       </g>
       <g class="com.sun.star.drawing.LineShape">
        <g id="id38">
         <rect class="BoundingBox" stroke="none" fill="none" x="8651" y="1000" width="261" height="1021"/>
         <path fill="none" stroke="rgb(0,0,0)" stroke-width="40" stroke-linejoin="round" d="M 8781,2000 L 8781,1243"/>
         <path fill="rgb(0,0,0)" stroke="none" d="M 8757,1257 L 8734,1250 8710,1239 8689,1222 8672,1201 8661,1177 8654,1154 8651,1130 8654,1106 8661,1082 8672,1058 8689,1038 8710,1021 8734,1010 8757,1002 8782,1000 8805,1002 8829,1010 8852,1021 8873,1038 8890,1058 8901,1082 8908,1106 8911,1130 8908,1154 8901,1177 8890,1201 8873,1222 8852,1239 8829,1250 8805,1257 8782,1260 8757,1257 Z"/>
        </g>
       </g>
       <g class="com.sun.star.drawing.LineShape">
        <g id="id39">
         <rect class="BoundingBox" stroke="none" fill="none" x="13386" y="1858" width="262" height="261"/>
         <path fill="rgb(0,0,0)" stroke="none" d="M 13489,2114 L 13465,2107 13442,2094 13421,2077 13405,2055 13394,2032 13388,2008 13386,1984 13390,1960 13397,1936 13410,1913 13427,1893 13449,1877 13472,1866 13496,1859 13521,1858 13544,1861 13568,1869 13590,1881 13611,1899 13627,1920 13638,1943 13644,1968 13646,1991 13642,2016 13635,2039 13623,2062 13605,2083 13584,2099 13561,2110 13536,2116 13513,2118 13489,2114 Z"/>
        </g>
       </g>
       <g class="com.sun.star.drawing.TextShape">
        <g id="id40">
         <rect class="BoundingBox" stroke="none" fill="none" x="2017" y="1194" width="1667" height="688"/>
         <text class="TextShape"><tspan class="TextParagraph" font-family="Liberation Mono, monospace" font-size="388px" font-weight="400"><tspan class="TextPosition" x="2267" y="1641"><tspan fill="rgb(0,0,0)" stroke="none">input</tspan></tspan></tspan></text>
        </g>
       </g>
       <g class="com.sun.star.drawing.LineShape">
        <g id="id41">
         <rect class="BoundingBox" stroke="none" fill="none" x="3694" y="3593" width="13021" height="301"/>
         <path fill="none" stroke="rgb(0,0,0)" stroke-width="40" stroke-linejoin="round" d="M 3714,3743 L 16284,3743"/>
         <path fill="rgb(0,0,0)" stroke="none" d="M 16714,3743 L 16264,3593 16264,3893 16714,3743 Z"/>
        </g>
       </g>
       <g class="com.sun.star.drawing.LineShape">
        <g id="id42">
         <rect class="BoundingBox" stroke="none" fill="none" x="4892" y="2758" width="261" height="1021"/>
         <path fill="none" stroke="rgb(43,43,210)" stroke-width="40" stroke-linejoin="round" d="M 5022,3758 L 5022,3001"/>
         <path fill="rgb(43,43,210)" stroke="none" d="M 4998,3015 L 4975,3008 4951,2997 4930,2980 4913,2959 4902,2935 4895,2912 4892,2888 4895,2864 4902,2840 4913,2816 4930,2796 4951,2779 4975,2768 4998,2760 5023,2758 5046,2760 5070,2768 5093,2779 5114,2796 5131,2816 5142,2840 5149,2864 5152,2888 5149,2912 5142,2935 5131,2959 5114,2980 5093,2997 5070,3008 5046,3015 5023,3018 4998,3015 Z"/>
        </g>
       </g>
       <g class="com.sun.star.drawing.LineShape">
        <g id="id43">
         <rect class="BoundingBox" stroke="none" fill="none" x="7259" y="3616" width="262" height="261"/>
         <path fill="rgb(43,43,210)" stroke="none" d="M 7362,3872 L 7338,3865 7315,3852 7294,3835 7278,3813 7267,3790 7261,3766 7259,3742 7263,3718 7270,3694 7283,3671 7300,3651 7322,3635 7345,3624 7369,3617 7394,3616 7417,3619 7441,3627 7463,3639 7484,3657 7500,3678 7511,3701 7517,3726 7519,3749 7515,3774 7508,3797 7496,3820 7478,3841 7457,3857 7434,3868 7409,3874 7386,3876 7362,3872 Z"/>
        </g>
       </g>
       <g class="com.sun.star.drawing.LineShape">
        <g id="id44">
         <rect class="BoundingBox" stroke="none" fill="none" x="9629" y="2758" width="261" height="1021"/>
         <path fill="none" stroke="rgb(43,43,210)" stroke-width="40" stroke-linejoin="round" d="M 9759,3758 L 9759,3001"/>
         <path fill="rgb(43,43,210)" stroke="none" d="M 9735,3015 L 9712,3008 9688,2997 9667,2980 9650,2959 9639,2935 9632,2912 9629,2888 9632,2864 9639,2840 9650,2816 9667,2796 9688,2779 9712,2768 9735,2760 9760,2758 9783,2760 9807,2768 9830,2779 9851,2796 9868,2816 9879,2840 9886,2864 9889,2888 9886,2912 9879,2935 9868,2959 9851,2980 9830,2997 9807,3008 9783,3015 9760,3018 9735,3015 Z"/>
        </g>
       </g>
       <g class="com.sun.star.drawing.LineShape">
        <g id="id45">
         <rect class="BoundingBox" stroke="none" fill="none" x="11997" y="2758" width="261" height="1021"/>
         <path fill="none" stroke="rgb(43,43,210)" stroke-width="40" stroke-linejoin="round" d="M 12127,3758 L 12127,3001"/>
         <path fill="rgb(43,43,210)" stroke="none" d="M 12103,3015 L 12080,3008 12056,2997 12035,2980 12018,2959 12007,2935 12000,2912 11997,2888 12000,2864 12007,2840 12018,2816 12035,2796 12056,2779 12080,2768 12103,2760 12128,2758 12151,2760 12175,2768 12198,2779 12219,2796 12236,2816 12247,2840 12254,2864 12257,2888 12254,2912 12247,2935 12236,2959 12219,2980 12198,2997 12175,3008 12151,3015 12128,3018 12103,3015 Z"/>
        </g>
       </g>
       <g class="com.sun.star.drawing.LineShape">
        <g id="id46">
         <rect class="BoundingBox" stroke="none" fill="none" x="14364" y="3616" width="262" height="261"/>
         <path fill="rgb(43,43,210)" stroke="none" d="M 14467,3872 L 14443,3865 14420,3852 14399,3835 14383,3813 14372,3790 14366,3766 14364,3742 14368,3718 14375,3694 14388,3671 14405,3651 14427,3635 14450,3624 14474,3617 14499,3616 14522,3619 14546,3627 14568,3639 14589,3657 14605,3678 14616,3701 14622,3726 14624,3749 14620,3774 14613,3797 14601,3820 14583,3841 14562,3857 14539,3868 14514,3874 14491,3876 14467,3872 Z"/>
        </g>
       </g>
       <g class="com.sun.star.drawing.TextShape">
        <g id="id47">
         <rect class="BoundingBox" stroke="none" fill="none" x="1784" y="2952" width="1900" height="688"/>
         <text class="TextShape"><tspan class="TextParagraph" font-family="Liberation Mono, monospace" font-size="388px" font-weight="400"><tspan class="TextPosition" x="2034" y="3399"><tspan fill="rgb(0,0,0)" stroke="none">output</tspan></tspan></tspan></text>
        </g>
       </g>
      </g>
     </g>
    </g>
   </g>
  </g>
 </g>
</svg>