<?xml version="1.0" encoding="UTF-8" standalone="no"?>
<svg
   xmlns:dc="http://purl.org/dc/elements/1.1/"
   xmlns:cc="http://creativecommons.org/ns#"
   xmlns:rdf="http://www.w3.org/1999/02/22-rdf-syntax-ns#"
   xmlns:svg="http://www.w3.org/2000/svg"
   xmlns="http://www.w3.org/2000/svg"
   xmlns:sodipodi="http://sodipodi.sourceforge.net/DTD/sodipodi-0.dtd"
   xmlns:inkscape="http://www.inkscape.org/namespaces/inkscape"
   version="1.2"
   width="78.414513mm"
   height="63.260914mm"
   viewBox="0 0 7841.451 6326.091"
   preserveAspectRatio="xMidYMid"
   xml:space="preserve"
   id="svg10925"
   sodipodi:docname="symbol_mapper_uc_l.svg"
   style="fill-rule:evenodd;stroke-width:28.22200012;stroke-linejoin:round"
   inkscape:version="0.92.2 (5c3e80d, 2017-08-06)"><metadata
     id="metadata10929"><rdf:RDF><cc:Work
         rdf:about=""><dc:format>image/svg+xml</dc:format><dc:type
           rdf:resource="http://purl.org/dc/dcmitype/StillImage" /><dc:title></dc:title></cc:Work></rdf:RDF></metadata><sodipodi:namedview
     pagecolor="#ffffff"
     bordercolor="#666666"
     borderopacity="1"
     objecttolerance="10"
     gridtolerance="10"
     guidetolerance="10"
     inkscape:pageopacity="0"
     inkscape:pageshadow="2"
     inkscape:window-width="1920"
     inkscape:window-height="872"
     id="namedview10927"
     showgrid="false"
     fit-margin-top="0"
     fit-margin-left="0"
     fit-margin-right="0"
     fit-margin-bottom="0"
     inkscape:zoom="1.3970159"
     inkscape:cx="126.01469"
     inkscape:cy="128.08989"
     inkscape:window-x="0"
     inkscape:window-y="28"
     inkscape:window-maximized="1"
     inkscape:current-layer="svg10925" /><defs
     class="ClipPathGroup"
     id="defs9306" /><defs
     id="defs9337" /><defs
     id="defs9366" /><defs
     id="defs9383" /><defs
     id="defs9400" /><defs
     id="defs9419" /><defs
     id="defs9430" /><defs
     class="TextShapeIndex"
     id="defs9434" /><defs
     class="EmbeddedBulletChars"
     id="defs9466" /><defs
     class="TextEmbeddedBitmaps"
     id="defs9468" /><g
     id="g13872"
     transform="translate(7097.0699,2106.272)"><g
       transform="translate(-8972.6812,-2138.7736)"
       class="com.sun.star.drawing.PolyPolygonShape"
       id="g9536"><g
         id="id13"><path
           d="m 8757,2289 -827,-275 v 552 z"
           id="path9533"
           inkscape:connector-curvature="0"
           style="fill:#000000;stroke:none" /><path
           d="m 7193,2289 h 774"
           id="path9521"
           inkscape:connector-curvature="0"
           style="fill:none;stroke:#000000;stroke-width:55;stroke-linejoin:round" /></g></g><g
       style="display:inline"
       transform="translate(-8972.6812,-2138.7736)"
       class="com.sun.star.drawing.PolyPolygonShape"
       id="g9594"><g
         id="id23"><path
           d="m 6666,4286 -275,827 h 552 z"
           id="path9591"
           inkscape:connector-curvature="0"
           style="fill:#000000;stroke:none" /><path
           d="M 6666,5849 V 5075"
           id="path9579"
           inkscape:connector-curvature="0"
           style="fill:none;stroke:#000000;stroke-width:55;stroke-linejoin:round" /></g></g><g
       style="display:inline"
       transform="translate(-8972.6812,-2138.7736)"
       class="com.sun.star.drawing.PolyPolygonShape"
       id="g9648"><g
         id="id33"><path
           d="M 5687,716 4860,439 v 552 z"
           id="path9645"
           inkscape:connector-curvature="0"
           style="fill:#000000;stroke:none" /><path
           d="m 4123,714 h 774"
           id="path9633"
           inkscape:connector-curvature="0"
           style="fill:none;stroke:#000000;stroke-width:55;stroke-linejoin:round" /></g></g><g
       style="display:inline"
       transform="translate(-8972.6812,-2138.7736)"
       class="com.sun.star.drawing.PolyPolygonShape"
       id="g9677"><g
         id="id38"><path
           d="m 4150,1911 h 774"
           id="path9662"
           inkscape:connector-curvature="0"
           style="fill:none;stroke:#000000;stroke-width:55;stroke-linejoin:round" /><path
           d="m 5715,1911 -827,-275 v 552 z"
           id="path9674"
           inkscape:connector-curvature="0"
           style="fill:#000000;stroke:none" /></g></g><g
       style="display:inline"
       transform="translate(-8972.6812,-2138.7736)"
       class="com.sun.star.drawing.PolyPolygonShape"
       id="g9694"><g
         id="id41"><path
           d="M 5805,64 V 4516 L 7095,3962 V 618 Z"
           id="path9691"
           inkscape:connector-curvature="0"
           style="fill:none;stroke:#000000;stroke-width:63;stroke-linejoin:round" /></g></g><g
       style="display:inline"
       transform="translate(-8972.6812,-2138.7736)"
       class="com.sun.star.drawing.PolyPolygonShape"
       id="g9738"><g
         id="id49"><path
           d="m 5683,3758 -827,-277 v 552 z"
           id="path9735"
           inkscape:connector-curvature="0"
           style="fill:#000000;stroke:none" /><path
           d="m 4119,3756 h 774"
           id="path9723"
           inkscape:connector-curvature="0"
           style="fill:none;stroke:#000000;stroke-width:55;stroke-linejoin:round" /></g></g><g
       transform="translate(-8972.6812,-2138.7736)"
       class="com.sun.star.drawing.TextShape"
       id="g10837"><g
         id="id224"><text
           class="TextShape"
           id="text10834"><tspan
             class="TextParagraph"
             font-size="423px"
             font-weight="400"
             id="tspan10832"
             style="font-weight:400;font-size:423px;font-family:'Liberation Mono', monospace"><tspan
               class="TextPosition"
               x="1850"
               y="3778"
               id="tspan10830"><tspan
                 id="tspan10828"
                 style="fill:#000000;stroke:none">N_symbol</tspan></tspan></tspan></text>
<text
           class="TextShape"
           id="text10821"><tspan
             class="TextParagraph"
             font-size="423px"
             font-weight="400"
             id="tspan10819"
             style="font-weight:400;font-size:423px;font-family:'Liberation Mono', monospace"><tspan
               class="TextPosition"
               x="1850"
               y="1976"
               id="tspan10817"><tspan
                 id="tspan10815"
                 style="fill:#000000;stroke:none">1_symbol</tspan></tspan></tspan></text>
<text
           class="TextShape"
           id="text10808"><tspan
             class="TextParagraph"
             font-size="423px"
             font-weight="400"
             id="tspan10806"
             style="font-weight:400;font-size:423px;font-family:'Liberation Mono', monospace"><tspan
               class="TextPosition"
               x="1850"
               y="778"
               id="tspan10804"><tspan
                 id="tspan10802"
                 style="fill:#000000;stroke:none">0_symbol</tspan></tspan></tspan></text>
</g></g><g
       transform="translate(-8972.6812,-2138.7736)"
       class="com.sun.star.drawing.TextShape"
       id="g10863"><g
         id="id226"><text
           class="TextShape"
           id="text10873"><tspan
             class="TextParagraph"
             font-size="423px"
             font-weight="400"
             id="tspan10871"
             style="font-weight:400;font-size:423px;font-family:'Liberation Mono', monospace"><tspan
               class="TextPosition"
               x="5950"
               y="3876"
               id="tspan10869"><tspan
                 id="tspan10867"
                 style="fill:#000000;stroke:none">N</tspan></tspan></tspan></text>
<text
           class="TextShape"
           id="text10886"><tspan
             class="TextParagraph"
             font-size="494px"
             font-weight="400"
             id="tspan10884"
             style="font-weight:400;font-size:494px;font-family:'Liberation Sans', sans-serif"><tspan
               class="TextPosition"
               x="5950"
               y="3070"
               id="tspan10882"><tspan
                 id="tspan10880"
                 style="fill:#000000;stroke:none">...</tspan></tspan></tspan></text>
<text
           class="TextShape"
           id="text10860"><tspan
             class="TextParagraph"
             font-size="423px"
             font-weight="400"
             id="tspan10858"
             style="font-weight:400;font-size:423px;font-family:'Liberation Mono', monospace"><tspan
               class="TextPosition"
               x="5950"
               y="1978"
               id="tspan10856"><tspan
                 id="tspan10854"
                 style="fill:#000000;stroke:none">1</tspan></tspan></tspan></text>
<text
           class="TextShape"
           id="text10847"><tspan
             class="TextParagraph"
             font-size="423px"
             font-weight="400"
             id="tspan10845"
             style="font-weight:400;font-size:423px;font-family:'Liberation Mono', monospace"><tspan
               class="TextPosition"
               x="5950"
               y="778"
               id="tspan10843"><tspan
                 id="tspan10841"
                 style="fill:#000000;stroke:none">0</tspan></tspan></tspan></text>
</g></g><g
       transform="translate(-8972.6812,-2138.7736)"
       class="com.sun.star.drawing.TextShape"
       id="g10902"><g
         id="id229"><text
           class="TextShape"
           id="text10899"><tspan
             class="TextParagraph"
             font-size="423px"
             font-style="italic"
             font-weight="400"
             id="tspan10897"
             style="font-style:italic;font-weight:400;font-size:423px;font-family:'Liberation Serif', serif"><tspan
               class="TextPosition"
               x="6250"
               y="6302"
               id="tspan10895"><tspan
                 id="tspan10893"
                 style="fill:#000000;stroke:none">x[n]</tspan></tspan></tspan></text>
</g></g><g
       style="display:inline"
       class="com.sun.star.drawing.TextShape"
       id="g10915"
       transform="translate(-11914.681,-2008.5024)"><g
         id="id230"><text
           class="TextShape"
           id="text10912"><tspan
             class="TextParagraph"
             font-size="423px"
             font-style="italic"
             font-weight="400"
             id="tspan10910"
             style="font-style:italic;font-weight:400;font-size:423px;font-family:'Liberation Serif', serif"><tspan
               class="TextPosition"
               x="11950"
               y="2302"
               id="tspan10908"><tspan
                 id="tspan10906"
                 style="fill:#000000;stroke:none">y[n]</tspan></tspan></tspan></text>
</g></g></g></svg>