<?xml version="1.0" encoding="UTF-8"?>
<!DOCTYPE svg PUBLIC "-//W3C//DTD SVG 1.1//EN" "http://www.w3.org/Graphics/SVG/1.1/DTD/svg11.dtd">
<svg version="1.2" width="118.51mm" height="15.4mm" viewBox="5049 8780 11851 1540" preserveAspectRatio="xMidYMid" fill-rule="evenodd" stroke-width="28.222" stroke-linejoin="round" xmlns="http://www.w3.org/2000/svg" xmlns:ooo="http://xml.openoffice.org/svg/export" xmlns:xlink="http://www.w3.org/1999/xlink" xmlns:presentation="http://sun.com/xmlns/staroffice/presentation" xmlns:smil="http://www.w3.org/2001/SMIL20/" xmlns:anim="urn:oasis:names:tc:opendocument:xmlns:animation:1.0" xml:space="preserve">
 <defs class="ClipPathGroup">
  <clipPath id="presentation_clip_path" clipPathUnits="userSpaceOnUse">
   <rect x="5049" y="8780" width="11851" height="1540"/>
  </clipPath>
  <clipPath id="presentation_clip_path_shrink" clipPathUnits="userSpaceOnUse">
   <rect x="5060" y="8781" width="11828" height="1537"/>
  </clipPath>
 </defs>
 <defs>
  <font id="EmbeddedFont_1" horiz-adv-x="2048">
   <font-face font-family="Liberation Serif embedded" units-per-em="2048" font-weight="normal" font-style="normal" ascent="1799" descent="423"/>
   <missing-glyph horiz-adv-x="2048" d="M 0,0 L 2047,0 2047,2047 0,2047 0,0 Z"/>
   <glyph unicode="u" horiz-adv-x="980" d="M 313,268 C 313,213 326,170 351,141 376,111 416,96 473,96 510,96 549,99 589,104 629,109 668,116 705,127 L 705,870 563,895 563,940 870,940 870,70 989,45 989,0 715,0 707,76 C 688,65 665,54 638,43 611,32 584,21 555,12 526,3 496,-5 467,-11 438,-17 411,-20 387,-20 351,-20 318,-15 289,-5 260,5 235,21 214,43 193,65 176,94 165,129 153,164 147,206 147,256 L 147,870 27,895 27,940 313,940 313,268 Z"/>
   <glyph unicode="t" horiz-adv-x="557" d="M 334,-20 C 270,-20 222,-1 191,37 159,75 143,128 143,197 L 143,856 20,856 20,901 145,940 246,1153 309,1153 309,940 524,940 524,856 309,856 309,215 C 309,172 319,139 339,117 358,95 384,84 416,84 441,84 465,86 490,89 514,92 536,96 557,100 L 557,35 C 547,28 534,22 518,15 501,8 483,3 464,-3 444,-7 423,-12 401,-15 379,-18 357,-20 334,-20 Z"/>
   <glyph unicode="o" horiz-adv-x="901" d="M 946,475 C 946,316 910,193 839,108 768,23 657,-20 506,-20 365,-20 258,22 186,107 114,192 78,314 78,475 78,634 114,755 186,839 258,923 367,965 514,965 657,965 764,924 837,842 910,759 946,637 946,475 Z M 766,475 C 766,540 762,598 753,649 744,700 730,743 710,778 689,813 662,839 629,858 596,876 555,885 506,885 457,885 416,876 384,858 352,839 327,813 308,778 289,743 276,700 269,649 262,598 258,540 258,475 258,410 262,351 269,300 276,249 289,205 308,170 327,134 352,107 384,88 416,69 457,59 506,59 555,59 596,69 629,88 662,107 689,134 710,170 730,205 744,249 753,300 762,351 766,410 766,475 Z"/>
   <glyph unicode="n" horiz-adv-x="980" d="M 324,864 C 343,875 365,886 391,898 416,910 443,921 471,931 499,941 527,949 555,956 583,962 609,965 633,965 669,965 702,960 732,950 762,940 788,924 810,902 831,880 848,851 861,816 873,781 879,738 879,688 L 879,70 993,45 993,0 588,0 588,45 713,70 713,670 C 713,725 700,769 673,801 646,832 604,848 547,848 528,848 509,847 488,845 467,843 447,841 427,838 407,835 388,832 371,829 353,825 338,822 326,819 L 326,70 453,45 453,0 47,0 47,45 160,70 160,870 47,895 47,940 315,940 324,864 Z"/>
   <glyph unicode="d" horiz-adv-x="953" d="M 723,70 C 694,47 657,26 614,8 570,-11 518,-20 459,-20 202,-20 74,140 74,461 74,539 83,609 100,672 117,734 143,787 178,831 213,874 258,908 312,931 366,954 430,965 504,965 538,965 574,963 613,959 651,955 688,949 723,942 722,949 721,960 720,975 719,989 719,1004 719,1021 718,1037 718,1053 718,1069 717,1085 717,1098 717,1108 L 717,1352 559,1376 559,1421 883,1421 883,70 999,45 999,0 735,0 723,70 Z M 254,461 C 254,391 260,332 273,284 285,236 302,197 325,168 348,138 375,117 407,104 439,91 475,84 514,84 554,84 592,88 627,96 662,103 692,112 717,123 L 717,866 C 689,871 657,876 620,879 583,882 548,883 514,883 425,883 360,847 318,776 275,705 254,600 254,461 Z"/>
   <glyph unicode="R" horiz-adv-x="1324" d="M 424,588 L 424,80 627,53 627,0 72,0 72,53 231,80 231,1262 59,1288 59,1341 638,1341 C 732,1341 811,1333 874,1316 937,1299 987,1276 1025,1245 1063,1214 1090,1176 1106,1132 1122,1088 1130,1038 1130,983 1130,932 1123,886 1108,846 1093,805 1072,770 1047,739 1022,708 992,683 959,663 926,642 891,627 855,616 L 1218,80 1363,53 1363,0 1042,0 665,588 424,588 Z M 931,969 C 931,1022 925,1067 912,1103 899,1139 880,1168 853,1190 826,1212 791,1228 749,1237 706,1246 655,1251 595,1251 L 424,1251 424,678 601,678 C 662,678 714,684 756,695 798,706 832,723 858,747 884,770 903,800 914,837 925,874 931,918 931,969 Z"/>
  </font>
 </defs>
 <defs>
  <font id="EmbeddedFont_2" horiz-adv-x="2048">
   <font-face font-family="Liberation Serif embedded" units-per-em="2048" font-weight="normal" font-style="italic" ascent="1799" descent="423"/>
   <missing-glyph horiz-adv-x="2048" d="M 0,0 L 2047,0 2047,2047 0,2047 0,0 Z"/>
   <glyph unicode="y" horiz-adv-x="1112" d="M 52,940 L 308,940 453,208 688,614 C 710,653 726,688 737,721 747,753 752,782 752,807 752,832 745,851 731,866 717,881 702,890 686,895 L 694,940 884,940 C 890,935 896,926 902,915 907,904 910,891 910,877 910,856 904,828 893,793 882,758 860,713 827,657 L 431,-9 C 392,-76 355,-136 320,-189 285,-242 250,-288 215,-325 180,-362 143,-391 105,-411 66,-431 24,-441 -22,-441 -39,-441 -54,-441 -68,-441 -80,-441 -92,-440 -104,-438 -114,-437 -125,-435 -136,-433 -147,-430 -158,-428 -171,-424 L -134,-221 -89,-221 -73,-317 C -56,-332 -29,-340 9,-340 38,-340 66,-332 93,-315 120,-298 145,-277 170,-251 194,-224 217,-195 238,-163 259,-131 277,-100 294,-70 L 339,12 156,870 44,895 52,940 Z"/>
   <glyph unicode="x" horiz-adv-x="927" d="M 248,236 C 227,215 209,197 196,182 182,167 171,153 163,142 155,130 150,119 147,110 144,101 142,92 142,84 142,73 146,65 154,59 161,53 171,48 184,45 L 176,0 -9,0 C -13,3 -17,9 -20,17 -23,24 -25,33 -25,43 -25,52 -22,63 -18,74 -12,85 -5,97 6,111 17,125 31,141 48,159 65,177 87,198 112,221 L 385,475 213,870 106,895 114,940 362,940 507,582 631,700 C 674,741 704,773 721,796 738,819 747,839 747,856 747,861 745,866 742,870 738,874 733,878 727,881 721,884 715,886 708,889 701,891 694,893 688,895 L 696,940 873,940 C 879,935 884,930 888,923 892,916 894,907 894,897 894,858 848,794 756,707 L 542,506 734,66 850,45 842,0 586,0 419,400 248,236 Z"/>
   <glyph unicode="n" horiz-adv-x="901" d="M 755,748 C 755,778 747,802 731,821 715,840 690,849 655,849 627,849 598,843 569,830 540,817 511,800 484,779 457,758 431,735 408,709 385,682 365,656 349,630 L 239,0 73,0 226,871 108,896 116,941 394,941 367,749 C 392,782 419,811 447,838 474,865 503,887 533,906 562,925 593,939 624,950 655,960 686,965 718,965 749,965 777,961 802,953 827,945 848,932 866,915 883,898 897,876 907,849 916,822 921,791 921,754 921,746 920,735 919,722 917,708 915,693 912,677 909,661 907,645 904,628 901,611 899,595 896,580 L 808,69 939,45 931,0 630,0 732,582 C 735,597 737,612 740,628 743,644 745,660 748,675 750,690 752,704 753,717 754,730 755,740 755,748 Z"/>
   <glyph unicode="g" horiz-adv-x="980" d="M 418,104 C 441,104 464,108 488,117 511,125 534,136 557,149 580,162 601,177 622,194 642,211 660,227 676,243 L 786,861 C 770,865 756,869 743,872 730,875 718,878 706,880 693,882 680,884 666,885 652,886 636,886 618,886 565,886 515,871 470,840 425,809 386,769 353,718 320,667 294,609 276,543 257,477 248,409 248,339 248,306 252,275 259,246 266,217 276,193 290,172 304,151 322,134 343,122 364,110 389,104 418,104 Z M 662,160 C 649,145 631,128 608,107 585,86 559,67 530,48 501,29 471,12 439,-1 406,-14 374,-21 342,-21 298,-21 259,-13 225,4 191,20 163,43 140,72 117,101 99,137 87,178 75,219 69,264 69,313 69,372 76,430 89,485 102,540 121,591 146,640 171,688 200,732 235,772 269,811 307,845 349,874 391,903 436,925 485,941 533,956 583,964 636,964 659,964 684,963 713,961 742,958 771,955 801,952 831,948 860,944 889,939 917,934 942,928 964,923 L 796,-35 C 783,-107 765,-168 741,-220 716,-270 685,-312 648,-344 611,-376 566,-399 514,-414 462,-429 402,-436 334,-436 298,-436 263,-434 229,-429 195,-424 164,-418 135,-412 106,-404 80,-397 57,-389 34,-380 15,-372 1,-365 L 19,-137 64,-137 100,-263 C 124,-286 155,-305 194,-320 232,-335 278,-342 333,-342 382,-342 424,-335 459,-321 493,-306 521,-287 544,-263 566,-238 583,-210 596,-178 608,-145 617,-111 623,-75 L 662,160 Z"/>
   <glyph unicode="b" horiz-adv-x="927" d="M 305,1352 L 172,1376 180,1421 480,1421 406,980 C 404,967 402,952 399,935 396,918 392,900 389,883 385,865 381,848 378,831 374,814 370,799 367,787 392,812 418,836 445,858 472,879 499,898 526,914 553,930 581,943 608,952 635,961 662,965 687,965 726,965 762,958 796,944 829,929 858,908 883,880 908,852 927,817 941,776 955,734 962,686 962,631 962,574 956,518 943,464 930,409 912,358 889,310 866,261 837,217 804,177 770,136 732,102 690,73 648,44 602,21 553,5 504,-12 451,-20 396,-20 371,-20 346,-18 319,-16 292,-12 264,-8 237,-1 209,6 181,14 154,25 127,36 101,49 76,64 L 305,1352 Z M 248,107 C 267,91 291,79 318,71 345,63 376,59 409,59 464,59 515,75 561,106 606,137 646,179 679,230 712,281 737,339 756,405 774,470 783,537 783,605 783,680 768,738 737,779 706,820 664,840 612,840 591,840 570,837 548,830 526,823 504,813 482,800 460,787 438,773 417,756 395,739 374,721 354,701 L 248,107 Z"/>
   <glyph unicode="N" horiz-adv-x="1482" d="M 1170,1262 L 994,1288 1004,1341 1461,1341 1451,1288 1275,1262 1052,0 955,0 474,1206 275,80 451,53 441,0 -15,0 -5,53 170,80 379,1262 211,1288 221,1341 609,1341 1008,336 1170,1262 Z"/>
  </font>
 </defs>
 <defs>
  <font id="EmbeddedFont_3" horiz-adv-x="2048">
   <font-face font-family="OpenSymbol embedded" units-per-em="2048" font-weight="normal" font-style="normal" ascent="1402" descent="423"/>
   <missing-glyph horiz-adv-x="2048" d="M 0,0 L 2047,0 2047,2047 0,2047 0,0 Z"/>
   <glyph unicode="≫" horiz-adv-x="1853" d="M 885,0 L 885,111 1845,594 885,1073 885,1184 2068,592 885,0 Z M 223,0 L 223,111 1184,594 223,1073 223,1184 1407,592 223,0 Z"/>
   <glyph unicode="ℕ" horiz-adv-x="1404" d="M 365,0 L 365,1405 555,1405 1292,303 1292,1405 1470,1405 1470,0 1280,0 543,1104 543,0 365,0 Z M 270,1403 L 272,-10 96,-10 94,1403 270,1403 Z"/>
   <glyph unicode="]" horiz-adv-x="398" d="M 428,-403 L 74,-403 74,-330 330,-330 330,1553 74,1553 74,1622 428,1622 428,-403 Z"/>
   <glyph unicode="[" horiz-adv-x="372" d="M 150,-403 L 150,1622 504,1622 504,1552 248,1552 248,-332 504,-332 504,-403 150,-403 Z"/>
  </font>
 </defs>
 <defs class="TextShapeIndex">
  <g ooo:slide="id1" ooo:id-list="id3 id4 id5 id6 id7 id8 id9 id10 id11 id12 id13 id14 id15 id16 id17"/>
 </defs>
 <defs class="EmbeddedBulletChars">
  <g id="bullet-char-template(57356)" transform="scale(0.00048828125,-0.00048828125)">
   <path d="M 580,1141 L 1163,571 580,0 -4,571 580,1141 Z"/>
  </g>
  <g id="bullet-char-template(57354)" transform="scale(0.00048828125,-0.00048828125)">
   <path d="M 8,1128 L 1137,1128 1137,0 8,0 8,1128 Z"/>
  </g>
  <g id="bullet-char-template(10146)" transform="scale(0.00048828125,-0.00048828125)">
   <path d="M 174,0 L 602,739 174,1481 1456,739 174,0 Z M 1358,739 L 309,1346 659,739 1358,739 Z"/>
  </g>
  <g id="bullet-char-template(10132)" transform="scale(0.00048828125,-0.00048828125)">
   <path d="M 2015,739 L 1276,0 717,0 1260,543 174,543 174,936 1260,936 717,1481 1274,1481 2015,739 Z"/>
  </g>
  <g id="bullet-char-template(10007)" transform="scale(0.00048828125,-0.00048828125)">
   <path d="M 0,-2 C -7,14 -16,27 -25,37 L 356,567 C 262,823 215,952 215,954 215,979 228,992 255,992 264,992 276,990 289,987 310,991 331,999 354,1012 L 381,999 492,748 772,1049 836,1024 860,1049 C 881,1039 901,1025 922,1006 886,937 835,863 770,784 769,783 710,716 594,584 L 774,223 C 774,196 753,168 711,139 L 727,119 C 717,90 699,76 672,76 641,76 570,178 457,381 L 164,-76 C 142,-110 111,-127 72,-127 30,-127 9,-110 8,-76 1,-67 -2,-52 -2,-32 -2,-23 -1,-13 0,-2 Z"/>
  </g>
  <g id="bullet-char-template(10004)" transform="scale(0.00048828125,-0.00048828125)">
   <path d="M 285,-33 C 182,-33 111,30 74,156 52,228 41,333 41,471 41,549 55,616 82,672 116,743 169,778 240,778 293,778 328,747 346,684 L 369,508 C 377,444 397,411 428,410 L 1163,1116 C 1174,1127 1196,1133 1229,1133 1271,1133 1292,1118 1292,1087 L 1292,965 C 1292,929 1282,901 1262,881 L 442,47 C 390,-6 338,-33 285,-33 Z"/>
  </g>
  <g id="bullet-char-template(9679)" transform="scale(0.00048828125,-0.00048828125)">
   <path d="M 813,0 C 632,0 489,54 383,161 276,268 223,411 223,592 223,773 276,916 383,1023 489,1130 632,1184 813,1184 992,1184 1136,1130 1245,1023 1353,916 1407,772 1407,592 1407,412 1353,268 1245,161 1136,54 992,0 813,0 Z"/>
  </g>
  <g id="bullet-char-template(8226)" transform="scale(0.00048828125,-0.00048828125)">
   <path d="M 346,457 C 273,457 209,483 155,535 101,586 74,649 74,723 74,796 101,859 155,911 209,963 273,989 346,989 419,989 480,963 531,910 582,859 608,796 608,723 608,648 583,586 532,535 482,483 420,457 346,457 Z"/>
  </g>
  <g id="bullet-char-template(8211)" transform="scale(0.00048828125,-0.00048828125)">
   <path d="M -4,459 L 1135,459 1135,606 -4,606 -4,459 Z"/>
  </g>
  <g id="bullet-char-template(61548)" transform="scale(0.00048828125,-0.00048828125)">
   <path d="M 173,740 C 173,903 231,1043 346,1159 462,1274 601,1332 765,1332 928,1332 1067,1274 1183,1159 1299,1043 1357,903 1357,740 1357,577 1299,437 1183,322 1067,206 928,148 765,148 601,148 462,206 346,322 231,437 173,577 173,740 Z"/>
  </g>
 </defs>
 <defs class="TextEmbeddedBitmaps"/>
 <g class="SlideGroup">
  <g>
   <g id="container-id1">
    <g id="id1" class="Slide" clip-path="url(#presentation_clip_path)">
     <g class="Page">
      <g class="com.sun.star.drawing.LineShape">
       <g id="id3">
        <rect class="BoundingBox" stroke="none" fill="none" x="6013" y="9374" width="1219" height="353"/>
        <path fill="none" stroke="rgb(0,0,0)" stroke-width="35" stroke-linejoin="round" d="M 6031,9550 L 6726,9550"/>
        <path fill="rgb(0,0,0)" stroke="none" d="M 7231,9550 L 6703,9374 6703,9726 7231,9550 Z"/>
       </g>
      </g>
      <g class="OLE2">
       <g id="id4">
        <rect class="BoundingBox" stroke="none" fill="none" x="5049" y="9310" width="992" height="481"/>
        <defs>
         <clipPath id="clip_path_1" clipPathUnits="userSpaceOnUse">
          <path d="M 5054,9313 L 6033,9313 6033,9790 5054,9790 5054,9313 Z"/>
         </clipPath>
        </defs>
        <g clip-path="url(#clip_path_1)">
         <text class="TextShape"><tspan class="TextParagraph" font-family="Liberation Serif, serif" font-size="422px" font-style="italic" font-weight="400"><tspan class="TextPosition" x="5181" y="9680"><tspan fill="rgb(0,0,0)" stroke="none">x</tspan></tspan></tspan></text>
         <text class="TextShape"><tspan class="TextParagraph" font-family="OpenSymbol" font-size="422px" font-weight="400"><tspan class="TextPosition" x="5419" y="9680"><tspan fill="rgb(0,0,0)" stroke="none">[</tspan></tspan></tspan></text>
         <text class="TextShape"><tspan class="TextParagraph" font-family="Liberation Serif, serif" font-size="422px" font-style="italic" font-weight="400"><tspan class="TextPosition" x="5578" y="9680"><tspan fill="rgb(0,0,0)" stroke="none">n</tspan></tspan></tspan></text>
         <text class="TextShape"><tspan class="TextParagraph" font-family="OpenSymbol" font-size="422px" font-weight="400"><tspan class="TextPosition" x="5816" y="9680"><tspan fill="rgb(0,0,0)" stroke="none">]</tspan></tspan></tspan></text>
        </g>
       </g>
      </g>
      <g class="com.sun.star.drawing.CustomShape">
       <g id="id5">
        <rect class="BoundingBox" stroke="none" fill="none" x="7320" y="8780" width="1541" height="1541"/>
        <path fill="none" stroke="rgb(0,0,0)" stroke-width="40" stroke-linejoin="round" d="M 8090,10300 L 7340,10300 7340,8800 8840,8800 8840,10300 8090,10300 Z"/>
       </g>
      </g>
      <g class="OLE2">
       <g id="id6">
        <rect class="BoundingBox" stroke="none" fill="none" x="7540" y="9317" width="1129" height="467"/>
        <defs>
         <clipPath id="clip_path_2" clipPathUnits="userSpaceOnUse">
          <path d="M 7540,9313 L 8678,9313 8678,9790 7540,9790 7540,9313 Z"/>
         </clipPath>
        </defs>
        <g clip-path="url(#clip_path_2)">
         <text class="TextShape"><tspan class="TextParagraph" font-family="OpenSymbol" font-size="422px" font-weight="400"><tspan class="TextPosition" x="7701" y="9687"><tspan fill="rgb(0,0,0)" stroke="none">≫</tspan></tspan></tspan></text>
         <text class="TextShape"><tspan class="TextParagraph" font-family="Liberation Serif, serif" font-size="422px" font-style="italic" font-weight="400"><tspan class="TextPosition" x="8236" y="9687"><tspan fill="rgb(0,0,0)" stroke="none">N</tspan></tspan></tspan></text>
        </g>
       </g>
      </g>
      <g class="com.sun.star.drawing.LineShape">
       <g id="id7">
        <rect class="BoundingBox" stroke="none" fill="none" x="8913" y="9374" width="1219" height="353"/>
        <path fill="none" stroke="rgb(0,0,0)" stroke-width="35" stroke-linejoin="round" d="M 8931,9550 L 9626,9550"/>
        <path fill="rgb(0,0,0)" stroke="none" d="M 10131,9550 L 9603,9374 9603,9726 10131,9550 Z"/>
       </g>
      </g>
      <g class="OLE2">
       <g id="id8">
        <rect class="BoundingBox" stroke="none" fill="none" x="15874" y="9310" width="1027" height="481"/>
        <defs>
         <clipPath id="clip_path_3" clipPathUnits="userSpaceOnUse">
          <path d="M 15875,9313 L 16907,9313 16907,9790 15875,9790 15875,9313 Z"/>
         </clipPath>
        </defs>
        <g clip-path="url(#clip_path_3)">
         <text class="TextShape"><tspan class="TextParagraph" font-family="Liberation Serif, serif" font-size="422px" font-style="italic" font-weight="400"><tspan class="TextPosition" x="16033" y="9680"><tspan fill="rgb(0,0,0)" stroke="none">y</tspan></tspan></tspan></text>
         <text class="TextShape"><tspan class="TextParagraph" font-family="OpenSymbol" font-size="422px" font-weight="400"><tspan class="TextPosition" x="16271" y="9680"><tspan fill="rgb(0,0,0)" stroke="none">[</tspan></tspan></tspan></text>
         <text class="TextShape"><tspan class="TextParagraph" font-family="Liberation Serif, serif" font-size="422px" font-style="italic" font-weight="400"><tspan class="TextPosition" x="16430" y="9680"><tspan fill="rgb(0,0,0)" stroke="none">n</tspan></tspan></tspan></text>
         <text class="TextShape"><tspan class="TextParagraph" font-family="OpenSymbol" font-size="422px" font-weight="400"><tspan class="TextPosition" x="16694" y="9680"><tspan fill="rgb(0,0,0)" stroke="none">]</tspan></tspan></tspan></text>
        </g>
       </g>
      </g>
      <g class="com.sun.star.drawing.CustomShape">
       <g id="id9">
        <rect class="BoundingBox" stroke="none" fill="none" x="10180" y="8780" width="1541" height="1541"/>
        <path fill="none" stroke="rgb(0,0,0)" stroke-width="40" stroke-linejoin="round" d="M 10950,10300 L 10200,10300 10200,8800 11700,8800 11700,10300 10950,10300 Z"/>
       </g>
      </g>
      <g class="OLE2">
       <g id="id10">
        <rect class="BoundingBox" stroke="none" fill="none" x="10491" y="9288" width="919" height="525"/>
        <defs>
         <clipPath id="clip_path_4" clipPathUnits="userSpaceOnUse">
          <path d="M 10504,9287 L 11404,9287 11404,9816 10504,9816 10504,9287 Z"/>
         </clipPath>
        </defs>
        <g clip-path="url(#clip_path_4)">
         <text class="TextShape"><tspan class="TextParagraph" font-family="Liberation Serif, serif" font-size="422px" font-style="italic" font-weight="400"><tspan class="TextPosition" x="10598" y="9711"><tspan fill="rgb(0,0,0)" stroke="none">b</tspan></tspan></tspan></text>
         <text class="TextShape"><tspan class="TextParagraph" font-family="Liberation Serif, serif" font-size="253px" font-style="italic" font-weight="400"><tspan class="TextPosition" x="10838" y="9526"><tspan fill="rgb(0,0,0)" stroke="none">g</tspan></tspan></tspan></text>
         <text class="TextShape"><tspan class="TextParagraph" font-family="OpenSymbol" font-size="253px" font-weight="400"><tspan class="TextPosition" x="10999" y="9526"><tspan fill="rgb(0,0,0)" stroke="none">[</tspan></tspan></tspan></text>
         <text class="TextShape"><tspan class="TextParagraph" font-family="Liberation Serif, serif" font-size="253px" font-style="italic" font-weight="400"><tspan class="TextPosition" x="11078" y="9526"><tspan fill="rgb(0,0,0)" stroke="none">n</tspan></tspan></tspan></text>
         <text class="TextShape"><tspan class="TextParagraph" font-family="OpenSymbol" font-size="253px" font-weight="400"><tspan class="TextPosition" x="11239" y="9526"><tspan fill="rgb(0,0,0)" stroke="none">]</tspan></tspan></tspan></text>
        </g>
       </g>
      </g>
      <g class="com.sun.star.drawing.LineShape">
       <g id="id11">
        <rect class="BoundingBox" stroke="none" fill="none" x="11782" y="9374" width="1219" height="353"/>
        <path fill="none" stroke="rgb(0,0,0)" stroke-width="35" stroke-linejoin="round" d="M 11800,9550 L 12495,9550"/>
        <path fill="rgb(0,0,0)" stroke="none" d="M 13000,9550 L 12472,9374 12472,9726 13000,9550 Z"/>
       </g>
      </g>
      <g class="com.sun.star.drawing.CustomShape">
       <g id="id12">
        <rect class="BoundingBox" stroke="none" fill="none" x="13049" y="8780" width="1541" height="1541"/>
        <path fill="none" stroke="rgb(0,0,0)" stroke-width="40" stroke-linejoin="round" d="M 13819,10300 L 13069,10300 13069,8800 14569,8800 14569,10300 13819,10300 Z"/>
       </g>
      </g>
      <g class="Group">
       <g class="OLE2">
        <g id="id13">
         <rect class="BoundingBox" stroke="none" fill="none" x="13134" y="8900" width="1371" height="467"/>
         <defs>
          <clipPath id="clip_path_5" clipPathUnits="userSpaceOnUse">
           <path d="M 13124,8890 L 14499,8890 14499,9366 13124,9366 13124,8890 Z"/>
          </clipPath>
         </defs>
         <g clip-path="url(#clip_path_5)">
          <text class="TextShape"><tspan class="TextParagraph" font-family="Liberation Serif, serif" font-size="422px" font-weight="400"><tspan class="TextPosition" x="13241" y="9270"><tspan fill="rgb(0,0,0)" stroke="none">Round</tspan></tspan></tspan></text>
         </g>
        </g>
       </g>
       <g class="Group">
        <g class="OLE2">
         <g id="id14">
          <rect class="BoundingBox" stroke="none" fill="none" x="13537" y="9300" width="565" height="467"/>
          <defs>
           <clipPath id="clip_path_6" clipPathUnits="userSpaceOnUse">
            <path d="M 13547,9287 L 14102,9287 14102,9763 13547,9763 13547,9287 Z"/>
           </clipPath>
          </defs>
          <g clip-path="url(#clip_path_6)">
           <text class="TextShape"><tspan class="TextParagraph" font-family="Liberation Serif, serif" font-size="422px" font-weight="400"><tspan class="TextPosition" x="13670" y="9670"><tspan fill="rgb(0,0,0)" stroke="none">to</tspan></tspan></tspan></text>
          </g>
         </g>
        </g>
        <g class="OLE2">
         <g id="id15">
          <rect class="BoundingBox" stroke="none" fill="none" x="13551" y="9819" width="537" height="382"/>
          <defs>
           <clipPath id="clip_path_7" clipPathUnits="userSpaceOnUse">
            <path d="M 13547,9816 L 14076,9816 14076,10213 13547,10213 13547,9816 Z"/>
           </clipPath>
          </defs>
          <g clip-path="url(#clip_path_7)">
           <text class="TextShape"><tspan class="TextParagraph" font-family="OpenSymbol" font-size="422px" font-weight="400"><tspan class="TextPosition" x="13657" y="10110"><tspan fill="rgb(0,0,0)" stroke="none">ℕ</tspan></tspan></tspan></text>
          </g>
         </g>
        </g>
       </g>
      </g>
      <g class="com.sun.star.drawing.LineShape">
       <g id="id16">
        <rect class="BoundingBox" stroke="none" fill="none" x="14682" y="9374" width="1219" height="353"/>
        <path fill="none" stroke="rgb(0,0,0)" stroke-width="35" stroke-linejoin="round" d="M 14700,9550 L 15395,9550"/>
        <path fill="rgb(0,0,0)" stroke="none" d="M 15900,9550 L 15372,9374 15372,9726 15900,9550 Z"/>
       </g>
      </g>
      <g class="OLE2">
       <g id="id17">
        <rect class="BoundingBox" stroke="none" fill="none" x="9000" y="8900" width="1001" height="481"/>
        <defs>
         <clipPath id="clip_path_8" clipPathUnits="userSpaceOnUse">
          <path d="M 8996,8890 L 10001,8890 10001,9393 8996,9393 8996,8890 Z"/>
         </clipPath>
        </defs>
        <g clip-path="url(#clip_path_8)">
         <text class="TextShape"><tspan class="TextParagraph" font-family="Liberation Serif, serif" font-size="422px" font-style="italic" font-weight="400"><tspan class="TextPosition" x="9132" y="9270"><tspan fill="rgb(0,0,0)" stroke="none">g</tspan></tspan></tspan></text>
         <text class="TextShape"><tspan class="TextParagraph" font-family="OpenSymbol" font-size="422px" font-weight="400"><tspan class="TextPosition" x="9370" y="9270"><tspan fill="rgb(0,0,0)" stroke="none">[</tspan></tspan></tspan></text>
         <text class="TextShape"><tspan class="TextParagraph" font-family="Liberation Serif, serif" font-size="422px" font-style="italic" font-weight="400"><tspan class="TextPosition" x="9529" y="9270"><tspan fill="rgb(0,0,0)" stroke="none">n</tspan></tspan></tspan></text>
         <text class="TextShape"><tspan class="TextParagraph" font-family="OpenSymbol" font-size="422px" font-weight="400"><tspan class="TextPosition" x="9794" y="9270"><tspan fill="rgb(0,0,0)" stroke="none">]</tspan></tspan></tspan></text>
        </g>
       </g>
      </g>
     </g>
    </g>
   </g>
  </g>
 </g>
</svg>