<?xml version="1.0" encoding="UTF-8" standalone="no"?>
<!DOCTYPE svg PUBLIC "-//W3C//DTD SVG 1.1//EN" "http://www.w3.org/Graphics/SVG/1.1/DTD/svg11.dtd">
<!-- Generated by Microsoft Visio, SVG Export polyphase_example_application.svg Page-1 -->
<svg xmlns="http://www.w3.org/2000/svg" xmlns:xlink="http://www.w3.org/1999/xlink" xmlns:ev="http://www.w3.org/2001/xml-events"
		width="12.8928in" height="1.18805in" viewBox="0 0 928.28 85.5394" xml:space="preserve" color-interpolation-filters="sRGB"
		class="st10">
	<style type="text/css">
	<![CDATA[
		.st1 {fill:#5b9bd5;stroke:#c7c8c8;stroke-width:0.25}
		.st2 {fill:#feffff;font-family:Calibri;font-size:1.16666em}
		.st3 {font-size:1em}
		.st4 {fill:url(#ptrn2-14);shape-rendering:crispEdges;stroke:#c7c8c8;stroke-width:0.25}
		.st5 {font-size:0.714294em}
		.st6 {fill:none;stroke:none;stroke-width:0.25}
		.st7 {fill:#41719c;font-family:Calibri;font-size:1.16666em}
		.st8 {marker-end:url(#mrkr4-45);stroke:#5b9bd5;stroke-linecap:round;stroke-linejoin:round;stroke-width:4}
		.st9 {fill:#5b9bd5;fill-opacity:1;stroke:#5b9bd5;stroke-opacity:1;stroke-width:0.61349693251534}
		.st10 {fill:none;fill-rule:evenodd;font-size:12px;overflow:visible;stroke-linecap:square;stroke-miterlimit:3}
	]]>
	</style>

	<defs id="Patterns_And_Gradients">
		<pattern id="ptrn2-14" patternUnits="userSpaceOnUse" width="6" height="6" viewBox="0 0 64 64">
			<image x="0" y="0" width="64" height="64" image-rendering="optimizeSpeed"
					xlink:href="data:image/png;base64,iVBORw0KGgoAAAANSUhEUgAAAAgAAAAICAYAAADED76LAAAAAXNSR0IArs4c6QAAAARnQU1BAACxjwv8YQUAAAAJcEhZcwAADsMAAA7DAcdvqGQAAAA8SURBVChTY8hdevN/8crbGBgkHjvn6n8GfJIgGkMBsiSIj6IAXRJFATZJuAJckmAF+CTBCvBJ5i69+R8AdAS7eSIEdvcAAAAASUVORK5CYII="/>
		</pattern>
	</defs>
	<defs id="Markers">
		<g id="lend4">
			<path d="M 2 1 L 0 0 L 2 -1 L 2 1 " style="stroke:none"/>
		</g>
		<marker id="mrkr4-45" class="st9" refX="-3.26" orient="auto" markerUnits="strokeWidth" overflow="visible">
			<use xlink:href="#lend4" transform="scale(-1.63,-1.63) "/>
		</marker>
	</defs>
	<g>
		<title>Page-1</title>
		<g id="shape35-1" transform="translate(481.816,-0.25)">
			<title>Rectangle.35</title>
			<desc>Symbol Synchroniser</desc>
			<rect x="0" y="0.500002" width="85.0394" height="85.0394" class="st1"/>
			<text x="21.57" y="38.82" class="st2">Symbol <tspan x="5.74" dy="1.2em" class="st3">Synchroniser</tspan></text>		</g>
		<g id="shape36-5" transform="translate(241.033,-0.25)">
			<title>Rectangle.36</title>
			<desc>Discriminator</desc>
			<rect x="0" y="0.500002" width="85.0394" height="85.0394" class="st1"/>
			<text x="4.16" y="47.22" class="st2">Discriminator</text>		</g>
		<g id="shape37-8" transform="translate(120.641,-0.25)">
			<title>Rectangle.37</title>
			<desc>Gain Control</desc>
			<rect x="0" y="0.500002" width="85.0394" height="85.0394" class="st1"/>
			<text x="6.7" y="47.22" class="st2">Gain Control</text>		</g>
		<g id="shape38-11" transform="translate(602.207,-0.25)">
			<title>Rectangle.38</title>
			<desc>Symbol Equaliser (optional)</desc>
			<rect x="0" y="0.500002" width="85.0394" height="85.0394" class="st4"/>
			<text x="21.57" y="30.42" class="st2">Symbol <tspan x="16.52" dy="1.2em" class="st3">Equaliser </tspan><tspan x="22.6"
						dy="1.68em" class="st5">(</tspan><tspan class="st5">optional</tspan><tspan class="st5">)</tspan></text>		</g>
		<g id="shape39-20" transform="translate(361.424,-0.25)">
			<title>Rectangle.39</title>
			<desc>Sample Gain Control (optional)</desc>
			<rect x="0" y="0.500002" width="85.0394" height="85.0394" class="st4"/>
			<text x="6.96" y="30.42" class="st2">Sample Gain <tspan x="21.34" dy="1.2em" class="st3">Control </tspan><tspan
						x="22.6" dy="1.68em" class="st5">(</tspan><tspan class="st5">optional</tspan><tspan class="st5">)</tspan></text>		</g>
		<g id="shape40-28" transform="translate(0.25,-19.3839)">
			<title>Rectangle.76</title>
			<desc>Incoming Samples</desc>
			<rect x="0" y="38.7677" width="85.0394" height="46.7717" class="st6"/>
			<text x="28.51" y="57.95" class="st7">Incoming <tspan x="33.71" dy="1.2em" class="st3">Samples</tspan></text>		</g>
		<g id="shape41-32" transform="translate(842.99,-19.3839)">
			<title>Rectangle.41</title>
			<desc>Outgoing Data</desc>
			<rect x="0" y="38.7677" width="85.0394" height="46.7717" class="st6"/>
			<text x="4" y="57.95" class="st7">Outgoing <tspan x="4" dy="1.2em" class="st3">Data</tspan></text>		</g>
		<g id="shape42-36" transform="translate(722.599,-0.25)">
			<title>Rectangle.42</title>
			<desc>Symbol Mapper</desc>
			<rect x="0" y="0.500002" width="85.0394" height="85.0394" class="st1"/>
			<text x="21.57" y="38.82" class="st2">Symbol <tspan x="19.9" dy="1.2em" class="st3">Mapper</tspan></text>		</g>
		<g id="shape43-40" transform="translate(85.2894,-35.6831)">
			<title>Dynamic connector.43</title>
			<path d="M0 78.45 L22.31 78.45" class="st8"/>
		</g>
		<g id="shape44-46" transform="translate(205.681,-35.6831)">
			<title>Dynamic connector.44</title>
			<path d="M0 78.45 L22.31 78.45" class="st8"/>
		</g>
		<g id="shape45-51" transform="translate(326.072,-35.6831)">
			<title>Dynamic connector.45</title>
			<path d="M0 78.45 L22.31 78.45" class="st8"/>
		</g>
		<g id="shape46-56" transform="translate(446.464,-35.6831)">
			<title>Dynamic connector.46</title>
			<path d="M0 78.45 L22.31 78.45" class="st8"/>
		</g>
		<g id="shape47-61" transform="translate(566.855,-35.6831)">
			<title>Dynamic connector.47</title>
			<path d="M0 78.45 L22.31 78.45" class="st8"/>
		</g>
		<g id="shape48-66" transform="translate(687.247,-35.6831)">
			<title>Dynamic connector.48</title>
			<path d="M0 78.45 L22.31 78.45" class="st8"/>
		</g>
		<g id="shape49-71" transform="translate(807.638,-35.6831)">
			<title>Dynamic connector.49</title>
			<path d="M0 78.45 L22.31 78.45" class="st8"/>
		</g>
	</g>
</svg>
