<?xml version="1.0" encoding="UTF-8" standalone="no"?>
<!DOCTYPE svg PUBLIC "-//W3C//DTD SVG 1.1//EN" "http://www.w3.org/Graphics/SVG/1.1/DTD/svg11.dtd">
<!-- Generated by Microsoft Visio, SVG Export poly_dec_2.svg Page-1 -->
<svg xmlns="http://www.w3.org/2000/svg" xmlns:xlink="http://www.w3.org/1999/xlink" xmlns:ev="http://www.w3.org/2001/xml-events"
		width="14.7616in" height="3.70189in" viewBox="0 0 1062.83 266.536" xml:space="preserve" color-interpolation-filters="sRGB"
		class="st18">
	<style type="text/css">
	<![CDATA[
		.st1 {visibility:visible}
		.st2 {fill:#5b9bd5;fill-opacity:0.22;filter:url(#filter_2);stroke:#5b9bd5;stroke-opacity:0.22}
		.st3 {fill:#5b9bd5;stroke:#c7c8c8;stroke-width:0.25}
		.st4 {fill:#feffff;font-family:Calibri;font-size:1.99999em}
		.st5 {fill:none;filter:url(#filter_2);stroke:none}
		.st6 {fill:#5b9bd5;filter:url(#filter_2);font-family:Calibri;font-size:2.50001em;opacity:0.219608}
		.st7 {font-size:1em}
		.st8 {fill:none;stroke:none;stroke-width:0.25}
		.st9 {fill:#41719c;font-family:Calibri;font-size:2.50001em}
		.st10 {fill:#5b9bd5;fill-opacity:0.25;filter:url(#filter_2);stroke:#5b9bd5;stroke-opacity:0.25}
		.st11 {fill:#4f87bb;stroke:#40709c;stroke-width:0.75}
		.st12 {marker-end:url(#mrkr4-80);stroke:#5b9bd5;stroke-linecap:round;stroke-linejoin:round;stroke-width:3.75}
		.st13 {fill:#5b9bd5;fill-opacity:1;stroke:#5b9bd5;stroke-opacity:1;stroke-width:0.59808612440191}
		.st14 {stroke:#5b9bd5;stroke-linecap:round;stroke-linejoin:round;stroke-width:1}
		.st15 {marker-end:url(#mrkr4-98);stroke:#5b9bd5;stroke-linecap:round;stroke-linejoin:round;stroke-width:1}
		.st16 {fill:#5b9bd5;fill-opacity:1;stroke:#5b9bd5;stroke-opacity:1;stroke-width:0.28409090909091}
		.st17 {stroke:#ffffff;stroke-linecap:round;stroke-linejoin:round;stroke-width:3}
		.st18 {fill:none;fill-rule:evenodd;font-size:12px;overflow:visible;stroke-linecap:square;stroke-miterlimit:3}
	]]>
	</style>

	<defs id="Markers">
		<g id="lend4">
			<path d="M 2 1 L 0 0 L 2 -1 L 2 1 " style="stroke:none"/>
		</g>
		<marker id="mrkr4-80" class="st13" refX="-3.344" orient="auto" markerUnits="strokeWidth" overflow="visible">
			<use xlink:href="#lend4" transform="scale(-1.672,-1.672) "/>
		</marker>
		<marker id="mrkr4-98" class="st16" refX="-7.04" orient="auto" markerUnits="strokeWidth" overflow="visible">
			<use xlink:href="#lend4" transform="scale(-3.52,-3.52) "/>
		</marker>
	</defs>
	<defs id="Filters">
		<filter id="filter_2">
			<feGaussianBlur stdDeviation="2"/>
		</filter>
	</defs>
	<g>
		<title>Page-1</title>
		<g id="shape1-1" transform="translate(390.361,-199.443)">
			<title>Rectangle.31</title>
			<desc>FIR Branch 0</desc>
			<g id="shadow1-2" transform="matrix(1,0,0,1,0.345598,1.97279)" class="st1">
				<rect x="0" y="224.016" width="340.157" height="42.5197" class="st2"/>
			</g>
			<rect x="0" y="224.016" width="340.157" height="42.5197" class="st3"/>
			<text x="109.38" y="252.48" class="st4">FIR Branch 0</text>		</g>
		<g id="shape2-7" transform="translate(390.361,-142.75)">
			<title>Rectangle.35</title>
			<desc>FIR Branch 1</desc>
			<g id="shadow2-8" transform="matrix(1,0,0,1,0.345598,1.97279)" class="st1">
				<rect x="0" y="224.016" width="340.157" height="42.5197" class="st2"/>
			</g>
			<rect x="0" y="224.016" width="340.157" height="42.5197" class="st3"/>
			<text x="109.38" y="252.48" class="st4">FIR Branch 1</text>		</g>
		<g id="shape3-13" transform="translate(390.361,-86.0575)">
			<title>Rectangle.39</title>
			<desc>FIR Branch 2</desc>
			<g id="shadow3-14" transform="matrix(1,0,0,1,0.345598,1.97279)" class="st1">
				<rect x="0" y="224.016" width="340.157" height="42.5197" class="st2"/>
			</g>
			<rect x="0" y="224.016" width="340.157" height="42.5197" class="st3"/>
			<text x="109.38" y="252.48" class="st4">FIR Branch 2</text>		</g>
		<g id="shape4-19" transform="translate(390.361,-29.3646)">
			<title>Rectangle.171</title>
			<desc>FIR Branch 3</desc>
			<g id="shadow4-20" transform="matrix(1,0,0,1,0.345598,1.97279)" class="st1">
				<rect x="0" y="224.016" width="340.157" height="42.5197" class="st2"/>
			</g>
			<rect x="0" y="224.016" width="340.157" height="42.5197" class="st3"/>
			<text x="109.38" y="252.48" class="st4">FIR Branch 3</text>		</g>
		<g id="shape5-25" transform="translate(0.25,-111.569)">
			<title>Rectangle.47</title>
			<desc>Input Sample</desc>
			<g id="shadow5-26" transform="matrix(1,0,0,1,0.345598,1.97279)" class="st1">
				<rect x="0" y="219.765" width="120.82" height="46.7717" class="st5"/>
				<text x="51.93" y="234.15" class="st6">Input <tspan x="27.13" dy="1.2em" class="st7">Sample</tspan></text>			</g>
			<rect x="0" y="219.765" width="120.82" height="46.7717" class="st8"/>
			<text x="51.93" y="234.15" class="st9">Input <tspan x="27.13" dy="1.2em" class="st7">Sample</tspan></text>		</g>
		<g id="shape6-35" transform="translate(911.054,-111.569)">
			<title>Rectangle.48</title>
			<desc>Output Sample</desc>
			<g id="shadow6-36" transform="matrix(1,0,0,1,0.345598,1.97279)" class="st1">
				<rect x="0" y="219.765" width="151.528" height="46.7717" class="st5"/>
				<text x="4" y="234.15" class="st6">Output <tspan x="4" dy="1.2em" class="st7">Sample</tspan></text>			</g>
			<rect x="0" y="219.765" width="151.528" height="46.7717" class="st8"/>
			<text x="4" y="234.15" class="st9">Output <tspan x="4" dy="1.2em" class="st7">Sample</tspan></text>		</g>
		<g id="shape7-45" transform="translate(215.795,-61.9522) rotate(30)">
			<title>Circular Arrow.54</title>
			<g id="shadow7-46" transform="matrix(1,0,0,1,1.28569,1.53569)" class="st1">
				<path d="M177.47 200.39 L195.04 176.51 L183.15 175.6 A85.8493 85.7075 -180 0 0 107.95 83.91 A85.8493 85.7075 0 0
							 1 183.15 175.6 L171.27 174.69 L177.47 200.39 Z" class="st10"/>
			</g>
			<path d="M177.47 200.39 L195.04 176.51 L183.15 175.6 A85.8493 85.7075 -180 0 0 107.95 83.91 A85.8493 85.7075 0 0 1 183.15
						 175.6 L171.27 174.69 L177.47 200.39 Z" class="st11"/>
		</g>
		<g id="shape8-50" transform="translate(207.069,-125.743) scale(-1,1)">
			<title>Circle.28</title>
			<g id="shadow8-51" transform="matrix(1,0,0,1,-0.345598,1.97279)" class="st1">
				<path d="M0 257.11 A9.42523 9.42523 0 0 1 18.85 257.11 A9.42523 9.42523 0 1 1 0 257.11 Z" class="st2"/>
			</g>
			<path d="M0 257.11 A9.42523 9.42523 0 0 1 18.85 257.11 A9.42523 9.42523 0 1 1 0 257.11 Z" class="st3"/>
		</g>
		<g id="shape9-55" transform="translate(344.054,-210.782) scale(-1,1)">
			<title>Circle.32</title>
			<g id="shadow9-56" transform="matrix(1,0,0,1,-0.345598,1.97279)" class="st1">
				<path d="M0 257.11 A9.42523 9.42523 0 0 1 18.85 257.11 A9.42523 9.42523 0 1 1 0 257.11 Z" class="st2"/>
			</g>
			<path d="M0 257.11 A9.42523 9.42523 0 0 1 18.85 257.11 A9.42523 9.42523 0 1 1 0 257.11 Z" class="st3"/>
		</g>
		<g id="shape10-60" transform="translate(344.054,-154.089) scale(-1,1)">
			<title>Circle.36</title>
			<g id="shadow10-61" transform="matrix(1,0,0,1,-0.345598,1.97279)" class="st1">
				<path d="M0 257.11 A9.42523 9.42523 0 0 1 18.85 257.11 A9.42523 9.42523 0 1 1 0 257.11 Z" class="st2"/>
			</g>
			<path d="M0 257.11 A9.42523 9.42523 0 0 1 18.85 257.11 A9.42523 9.42523 0 1 1 0 257.11 Z" class="st3"/>
		</g>
		<g id="shape11-65" transform="translate(344.054,-97.3961) scale(-1,1)">
			<title>Circle.40</title>
			<g id="shadow11-66" transform="matrix(1,0,0,1,-0.345598,1.97279)" class="st1">
				<path d="M0 257.11 A9.42523 9.42523 0 0 1 18.85 257.11 A9.42523 9.42523 0 1 1 0 257.11 Z" class="st2"/>
			</g>
			<path d="M0 257.11 A9.42523 9.42523 0 0 1 18.85 257.11 A9.42523 9.42523 0 1 1 0 257.11 Z" class="st3"/>
		</g>
		<g id="shape12-70" transform="translate(344.054,-40.7032) scale(-1,1)">
			<title>Circle</title>
			<g id="shadow12-71" transform="matrix(1,0,0,1,-0.345598,1.97279)" class="st1">
				<path d="M0 257.11 A9.42523 9.42523 0 0 1 18.85 257.11 A9.42523 9.42523 0 1 1 0 257.11 Z" class="st2"/>
			</g>
			<path d="M0 257.11 A9.42523 9.42523 0 0 1 18.85 257.11 A9.42523 9.42523 0 1 1 0 257.11 Z" class="st3"/>
		</g>
		<g id="shape13-75" transform="translate(197.644,-135.168)">
			<title>Dynamic connector.46</title>
			<path d="M0 266.54 L119.57 194.63" class="st12"/>
		</g>
		<g id="shape14-81" transform="translate(390.361,-227.542)">
			<title>Dynamic connector</title>
			<path d="M0 273.37 L-46.31 273.87" class="st14"/>
		</g>
		<g id="shape15-84" transform="translate(390.361,-170.849)">
			<title>Dynamic connector.65</title>
			<path d="M0 273.37 L-46.31 273.87" class="st14"/>
		</g>
		<g id="shape16-87" transform="translate(390.361,-114.156)">
			<title>Dynamic connector.66</title>
			<path d="M0 273.37 L-46.31 273.87" class="st14"/>
		</g>
		<g id="shape17-90" transform="translate(390.361,-57.463)">
			<title>Dynamic connector.67</title>
			<path d="M0 273.37 L-46.31 273.87" class="st14"/>
		</g>
		<g id="shape18-93" transform="translate(121.07,-127.975)">
			<title>Dynamic connector.68</title>
			<path d="M0 259.56 L60.11 259.37" class="st15"/>
		</g>
		<g id="group19-99" transform="translate(799.085,-111.569)">
			<title>Sheet.19</title>
			<g id="shape20-100">
				<title>Circle</title>
				<g id="shadow20-101" transform="matrix(1,0,0,1,0.345598,1.97279)" class="st1">
					<path d="M0 243.15 A23.3858 23.3858 0 0 1 46.77 243.15 A23.3858 23.3858 0 1 1 0 243.15 Z" class="st2"/>
				</g>
				<path d="M0 243.15 A23.3858 23.3858 0 0 1 46.77 243.15 A23.3858 23.3858 0 1 1 0 243.15 Z" class="st3"/>
			</g>
			<g id="shape21-105" transform="translate(289.922,219.765) rotate(90)">
				<title>Sheet.21</title>
				<path d="M0 266.54 L46.77 266.54" class="st17"/>
			</g>
			<g id="shape22-108" transform="translate(0,-23.3858)">
				<title>Sheet.22</title>
				<path d="M0 266.54 L46.77 266.54" class="st17"/>
			</g>
		</g>
		<g id="shape23-111" transform="translate(730.518,-220.703)">
			<title>Dynamic connector.73</title>
			<path d="M0 266.54 L91.95 266.54 L91.95 328.9" class="st14"/>
		</g>
		<g id="shape24-114" transform="translate(730.518,-164.839)">
			<title>Dynamic connector.74</title>
			<path d="M0 267.36 L75.41 267.36 L75.41 279.88" class="st14"/>
		</g>
		<g id="shape25-117" transform="translate(730.518,-105.78)">
			<title>Dynamic connector.75</title>
			<path d="M0 265 L75.41 265 L75.41 253.9" class="st14"/>
		</g>
		<g id="shape26-120" transform="translate(730.518,-50.6244)">
			<title>Dynamic connector.76</title>
			<path d="M0 266.54 L91.95 266.54 L91.95 205.59" class="st14"/>
		</g>
		<g id="shape27-123" transform="translate(845.857,-127.869)">
			<title>Dynamic connector.77</title>
			<path d="M0 259.45 L65.2 259.45" class="st14"/>
		</g>
	</g>
</svg>
