<?xml version="1.0" encoding="UTF-8"?>
<!DOCTYPE svg PUBLIC "-//W3C//DTD SVG 1.1//EN" "http://www.w3.org/Graphics/SVG/1.1/DTD/svg11.dtd">
<svg version="1.2" width="52.21mm" height="39.93mm" viewBox="14123 8771 5221 3993" preserveAspectRatio="xMidYMid" fill-rule="evenodd" stroke-width="28.222" stroke-linejoin="round" xmlns="http://www.w3.org/2000/svg" xmlns:ooo="http://xml.openoffice.org/svg/export" xmlns:xlink="http://www.w3.org/1999/xlink" xmlns:presentation="http://sun.com/xmlns/staroffice/presentation" xmlns:smil="http://www.w3.org/2001/SMIL20/" xmlns:anim="urn:oasis:names:tc:opendocument:xmlns:animation:1.0" xml:space="preserve">
 <defs class="ClipPathGroup">
  <clipPath id="presentation_clip_path" clipPathUnits="userSpaceOnUse">
   <rect x="14123" y="8771" width="5221" height="3993"/>
  </clipPath>
  <clipPath id="presentation_clip_path_shrink" clipPathUnits="userSpaceOnUse">
   <rect x="14128" y="8774" width="5211" height="3986"/>
  </clipPath>
 </defs>
 <defs>
  <font id="EmbeddedFont_1" horiz-adv-x="2048">
   <font-face font-family="Liberation Serif embedded" units-per-em="2048" font-weight="normal" font-style="normal" ascent="1799" descent="423"/>
   <missing-glyph horiz-adv-x="2048" d="M 0,0 L 2047,0 2047,2047 0,2047 0,0 Z"/>
   <glyph unicode="y" horiz-adv-x="1033" d="M 918,874 L 551,-58 C 530,-112 508,-163 486,-209 464,-256 440,-296 413,-331 386,-365 355,-392 320,-412 285,-431 245,-441 199,-441 182,-441 167,-441 154,-441 141,-441 128,-440 117,-438 106,-437 94,-435 83,-433 72,-430 59,-428 45,-424 L 45,-221 92,-221 125,-317 C 146,-332 174,-340 211,-340 240,-340 266,-334 289,-321 312,-308 334,-290 354,-268 373,-244 391,-217 407,-186 423,-155 438,-120 453,-82 L 479,-10 121,870 25,895 25,940 461,940 461,895 313,868 567,211 813,870 666,895 666,940 1016,940 1016,895 918,874 Z"/>
   <glyph unicode="r" horiz-adv-x="636" d="M 664,965 L 664,711 621,711 563,821 C 544,821 524,820 503,817 482,814 460,811 439,807 418,802 397,797 378,791 358,785 341,779 326,772 L 326,70 487,45 487,0 41,0 41,45 160,70 160,870 41,895 41,940 315,940 324,823 C 339,836 360,850 387,867 414,883 443,898 474,913 505,928 536,940 567,950 598,960 625,965 649,965 L 664,965 Z"/>
   <glyph unicode="n" horiz-adv-x="980" d="M 324,864 C 343,875 365,886 391,898 416,910 443,921 471,931 499,941 527,949 555,956 583,962 609,965 633,965 669,965 702,960 732,950 762,940 788,924 810,902 831,880 848,851 861,816 873,781 879,738 879,688 L 879,70 993,45 993,0 588,0 588,45 713,70 713,670 C 713,725 700,769 673,801 646,832 604,848 547,848 528,848 509,847 488,845 467,843 447,841 427,838 407,835 388,832 371,829 353,825 338,822 326,819 L 326,70 453,45 453,0 47,0 47,45 160,70 160,870 47,895 47,940 315,940 324,864 Z"/>
   <glyph unicode="m" horiz-adv-x="1536" d="M 326,864 C 345,875 367,886 393,898 418,910 445,921 472,931 499,941 527,949 555,956 583,962 609,965 633,965 679,965 722,956 761,939 800,922 829,894 848,856 869,868 895,881 925,894 955,907 986,918 1019,929 1051,940 1083,948 1115,955 1146,962 1175,965 1200,965 1236,965 1269,960 1298,950 1327,940 1353,924 1374,902 1395,880 1411,851 1423,816 1434,781 1440,738 1440,688 L 1440,70 1561,45 1561,0 1134,0 1134,45 1274,70 1274,670 C 1274,725 1262,768 1237,798 1212,827 1171,842 1114,842 1097,842 1077,841 1054,838 1031,835 1008,832 985,829 962,826 940,822 919,818 898,813 880,810 866,807 877,771 883,731 883,688 L 883,70 1024,45 1024,0 578,0 578,45 717,70 717,670 C 717,725 703,768 675,798 646,827 604,842 547,842 528,842 509,841 489,839 468,837 448,835 429,832 409,829 390,826 373,823 355,819 340,816 328,813 L 328,70 469,45 469,0 43,0 43,45 162,70 162,870 43,895 43,940 318,940 326,864 Z"/>
   <glyph unicode="l" horiz-adv-x="504" d="M 367,70 L 528,45 528,0 41,0 41,45 201,70 201,1352 41,1376 41,1421 367,1421 367,70 Z"/>
   <glyph unicode="i" horiz-adv-x="504" d="M 379,1247 C 379,1232 376,1219 371,1206 365,1193 357,1181 347,1171 337,1161 325,1153 312,1148 299,1142 285,1139 270,1139 255,1139 242,1142 229,1148 216,1153 204,1161 194,1171 184,1181 176,1193 171,1206 165,1219 162,1232 162,1247 162,1262 165,1276 171,1289 176,1302 184,1314 194,1324 204,1334 216,1342 229,1348 242,1353 255,1356 270,1356 285,1356 299,1353 312,1348 325,1342 337,1334 347,1324 357,1314 365,1302 371,1289 376,1276 379,1262 379,1247 Z M 369,70 L 530,45 530,0 43,0 43,45 203,70 203,870 70,895 70,940 369,940 369,70 Z"/>
   <glyph unicode="g" horiz-adv-x="927" d="M 870,643 C 870,535 838,453 773,398 708,343 615,315 494,315 467,315 439,317 412,320 384,323 361,326 342,330 L 279,199 C 281,188 294,177 318,167 342,157 372,152 408,152 L 686,152 C 787,152 863,130 912,86 961,42 985,-19 985,-96 985,-139 976,-182 959,-224 941,-265 912,-302 873,-335 833,-367 781,-393 717,-413 653,-432 574,-442 481,-442 410,-442 349,-436 299,-425 249,-413 208,-397 177,-376 146,-355 123,-331 109,-304 95,-277 88,-247 88,-215 88,-193 92,-172 101,-153 109,-133 121,-114 136,-96 151,-77 168,-59 189,-42 210,-25 232,-7 256,10 244,14 230,21 215,30 199,39 184,50 170,64 156,78 144,94 135,113 126,131 121,151 121,174 L 279,352 C 174,401 121,498 121,643 121,696 130,742 147,783 164,823 189,857 222,884 254,911 294,931 341,945 388,958 442,965 502,965 521,965 540,964 559,962 578,960 597,958 614,956 631,953 645,951 658,948 671,945 680,942 686,940 L 907,1051 942,1008 803,864 C 826,839 843,807 854,769 865,730 870,688 870,643 Z M 829,-127 C 829,-89 817,-59 794,-38 771,-17 735,-6 688,-6 L 324,-6 C 310,-18 297,-32 286,-48 274,-63 264,-80 256,-97 247,-114 241,-132 236,-150 231,-167 229,-184 229,-201 229,-225 233,-247 241,-267 248,-286 262,-303 281,-317 300,-331 325,-342 358,-350 391,-358 432,-362 481,-362 541,-362 593,-356 637,-345 680,-333 716,-316 745,-296 774,-274 795,-250 809,-221 822,-192 829,-161 829,-127 Z M 496,391 C 569,391 620,412 651,454 681,495 696,558 696,643 696,685 693,722 686,753 679,784 667,809 652,829 636,849 615,864 590,874 565,884 534,889 498,889 461,889 430,884 405,874 379,864 358,849 342,829 325,809 313,784 306,753 299,722 295,685 295,643 295,601 299,564 306,533 313,501 325,475 341,454 357,433 378,417 403,407 428,396 459,391 496,391 Z"/>
   <glyph unicode="e" horiz-adv-x="769" d="M 260,473 L 260,455 C 260,406 264,360 271,315 278,270 292,231 313,197 334,162 363,135 401,115 439,94 489,84 551,84 571,84 592,85 614,87 636,88 658,90 680,93 702,96 723,99 744,102 765,105 784,109 801,113 L 801,57 C 786,47 767,38 746,29 724,20 700,11 674,4 648,-3 620,-9 591,-14 562,-18 532,-20 502,-20 424,-20 358,-9 305,12 251,33 207,65 174,107 141,149 117,201 102,263 87,325 80,396 80,477 80,641 114,763 183,844 252,925 350,965 477,965 527,965 574,958 618,945 661,932 699,909 732,878 765,847 791,805 810,752 829,699 838,634 838,555 L 838,473 260,473 Z M 477,885 C 440,885 408,877 381,862 354,846 331,824 314,795 296,766 283,732 275,691 266,650 262,604 262,553 L 664,553 C 664,604 661,650 656,691 650,732 640,766 626,795 611,824 592,846 568,862 544,877 514,885 477,885 Z"/>
   <glyph unicode="a" horiz-adv-x="848" d="M 465,961 C 508,961 547,957 584,949 621,941 652,927 679,908 706,889 727,863 742,830 757,797 764,755 764,705 L 764,70 881,45 881,0 623,0 604,94 C 594,84 581,72 564,59 547,46 526,33 502,22 478,10 450,0 419,-8 387,-16 352,-20 313,-20 268,-20 230,-13 199,1 168,15 143,35 124,60 105,85 92,114 84,149 76,183 72,220 72,260 72,301 77,337 87,368 97,398 111,423 129,444 147,465 168,482 193,495 217,508 243,518 272,525 300,532 330,537 362,540 393,543 425,544 457,545 L 598,549 598,696 C 598,724 596,750 591,773 586,796 579,815 568,832 557,849 542,862 523,871 504,880 481,885 453,885 421,885 389,881 356,872 323,863 295,852 270,838 L 236,721 180,721 180,926 C 223,935 268,944 315,951 361,958 411,961 465,961 Z M 598,479 L 467,475 C 428,474 394,470 365,464 336,457 313,446 294,431 275,416 261,395 252,368 243,341 238,307 238,266 238,149 286,90 381,90 426,90 466,95 499,106 532,116 565,129 598,145 L 598,479 Z"/>
   <glyph unicode="R" horiz-adv-x="1324" d="M 424,588 L 424,80 627,53 627,0 72,0 72,53 231,80 231,1262 59,1288 59,1341 638,1341 C 732,1341 811,1333 874,1316 937,1299 987,1276 1025,1245 1063,1214 1090,1176 1106,1132 1122,1088 1130,1038 1130,983 1130,932 1123,886 1108,846 1093,805 1072,770 1047,739 1022,708 992,683 959,663 926,642 891,627 855,616 L 1218,80 1363,53 1363,0 1042,0 665,588 424,588 Z M 931,969 C 931,1022 925,1067 912,1103 899,1139 880,1168 853,1190 826,1212 791,1228 749,1237 706,1246 655,1251 595,1251 L 424,1251 424,678 601,678 C 662,678 714,684 756,695 798,706 832,723 858,747 884,770 903,800 914,837 925,874 931,918 931,969 Z"/>
   <glyph unicode="I" horiz-adv-x="557" d="M 438,80 L 610,53 610,0 74,0 74,53 246,80 246,1262 74,1288 74,1341 610,1341 610,1288 438,1262 438,80 Z"/>
   <glyph unicode="1" horiz-adv-x="742" d="M 627,80 L 901,53 901,0 180,0 180,53 455,80 455,1174 184,1077 184,1130 575,1352 627,1352 627,80 Z"/>
  </font>
 </defs>
 <defs>
  <font id="EmbeddedFont_2" horiz-adv-x="2048">
   <font-face font-family="Liberation Serif embedded" units-per-em="2048" font-weight="normal" font-style="italic" ascent="1799" descent="423"/>
   <missing-glyph horiz-adv-x="2048" d="M 0,0 L 2047,0 2047,2047 0,2047 0,0 Z"/>
   <glyph unicode="x" horiz-adv-x="927" d="M 248,236 C 227,215 209,197 196,182 182,167 171,153 163,142 155,130 150,119 147,110 144,101 142,92 142,84 142,73 146,65 154,59 161,53 171,48 184,45 L 176,0 -9,0 C -13,3 -17,9 -20,17 -23,24 -25,33 -25,43 -25,52 -22,63 -18,74 -12,85 -5,97 6,111 17,125 31,141 48,159 65,177 87,198 112,221 L 385,475 213,870 106,895 114,940 362,940 507,582 631,700 C 674,741 704,773 721,796 738,819 747,839 747,856 747,861 745,866 742,870 738,874 733,878 727,881 721,884 715,886 708,889 701,891 694,893 688,895 L 696,940 873,940 C 879,935 884,930 888,923 892,916 894,907 894,897 894,858 848,794 756,707 L 542,506 734,66 850,45 842,0 586,0 419,400 248,236 Z"/>
   <glyph unicode="n" horiz-adv-x="901" d="M 755,748 C 755,778 747,802 731,821 715,840 690,849 655,849 627,849 598,843 569,830 540,817 511,800 484,779 457,758 431,735 408,709 385,682 365,656 349,630 L 239,0 73,0 226,871 108,896 116,941 394,941 367,749 C 392,782 419,811 447,838 474,865 503,887 533,906 562,925 593,939 624,950 655,960 686,965 718,965 749,965 777,961 802,953 827,945 848,932 866,915 883,898 897,876 907,849 916,822 921,791 921,754 921,746 920,735 919,722 917,708 915,693 912,677 909,661 907,645 904,628 901,611 899,595 896,580 L 808,69 939,45 931,0 630,0 732,582 C 735,597 737,612 740,628 743,644 745,660 748,675 750,690 752,704 753,717 754,730 755,740 755,748 Z"/>
  </font>
 </defs>
 <defs>
  <font id="EmbeddedFont_3" horiz-adv-x="2048">
   <font-face font-family="OpenSymbol embedded" units-per-em="2048" font-weight="normal" font-style="normal" ascent="1402" descent="423"/>
   <missing-glyph horiz-adv-x="2048" d="M 0,0 L 2047,0 2047,2047 0,2047 0,0 Z"/>
   <glyph unicode="−" horiz-adv-x="1191" d="M 221,543 L 221,641 1405,641 1405,543 221,543 Z"/>
   <glyph unicode="θ" horiz-adv-x="901" d="M 777,693 L 284,693 284,641 C 284,413 303,253 341,161 378,68 442,22 532,22 624,22 688,67 724,158 759,248 777,425 777,688 L 777,693 Z M 284,755 L 777,755 777,760 C 777,769 777,782 778,799 779,815 779,827 779,834 779,1006 760,1132 721,1213 682,1294 621,1334 537,1334 450,1334 386,1289 347,1198 307,1107 286,961 284,760 L 284,755 Z M 537,1373 C 675,1373 781,1316 856,1201 931,1086 968,919 968,702 968,468 931,289 857,166 783,42 677,-20 539,-20 393,-20 296,18 248,95 200,172 168,234 153,282 137,329 126,376 119,422 112,467 107,506 104,539 101,571 100,599 100,624 100,625 100,629 100,634 99,639 99,647 99,656 99,665 99,675 99,686 99,903 138,1072 215,1193 292,1313 400,1373 537,1373 Z"/>
   <glyph unicode="]" horiz-adv-x="398" d="M 428,-403 L 74,-403 74,-330 330,-330 330,1553 74,1553 74,1622 428,1622 428,-403 Z"/>
   <glyph unicode="[" horiz-adv-x="372" d="M 150,-403 L 150,1622 504,1622 504,1552 248,1552 248,-332 504,-332 504,-403 150,-403 Z"/>
  </font>
 </defs>
 <defs class="TextShapeIndex">
  <g ooo:slide="id1" ooo:id-list="id3 id4 id5 id6 id7 id8 id9 id10 id11 id12"/>
 </defs>
 <defs class="EmbeddedBulletChars">
  <g id="bullet-char-template(57356)" transform="scale(0.00048828125,-0.00048828125)">
   <path d="M 580,1141 L 1163,571 580,0 -4,571 580,1141 Z"/>
  </g>
  <g id="bullet-char-template(57354)" transform="scale(0.00048828125,-0.00048828125)">
   <path d="M 8,1128 L 1137,1128 1137,0 8,0 8,1128 Z"/>
  </g>
  <g id="bullet-char-template(10146)" transform="scale(0.00048828125,-0.00048828125)">
   <path d="M 174,0 L 602,739 174,1481 1456,739 174,0 Z M 1358,739 L 309,1346 659,739 1358,739 Z"/>
  </g>
  <g id="bullet-char-template(10132)" transform="scale(0.00048828125,-0.00048828125)">
   <path d="M 2015,739 L 1276,0 717,0 1260,543 174,543 174,936 1260,936 717,1481 1274,1481 2015,739 Z"/>
  </g>
  <g id="bullet-char-template(10007)" transform="scale(0.00048828125,-0.00048828125)">
   <path d="M 0,-2 C -7,14 -16,27 -25,37 L 356,567 C 262,823 215,952 215,954 215,979 228,992 255,992 264,992 276,990 289,987 310,991 331,999 354,1012 L 381,999 492,748 772,1049 836,1024 860,1049 C 881,1039 901,1025 922,1006 886,937 835,863 770,784 769,783 710,716 594,584 L 774,223 C 774,196 753,168 711,139 L 727,119 C 717,90 699,76 672,76 641,76 570,178 457,381 L 164,-76 C 142,-110 111,-127 72,-127 30,-127 9,-110 8,-76 1,-67 -2,-52 -2,-32 -2,-23 -1,-13 0,-2 Z"/>
  </g>
  <g id="bullet-char-template(10004)" transform="scale(0.00048828125,-0.00048828125)">
   <path d="M 285,-33 C 182,-33 111,30 74,156 52,228 41,333 41,471 41,549 55,616 82,672 116,743 169,778 240,778 293,778 328,747 346,684 L 369,508 C 377,444 397,411 428,410 L 1163,1116 C 1174,1127 1196,1133 1229,1133 1271,1133 1292,1118 1292,1087 L 1292,965 C 1292,929 1282,901 1262,881 L 442,47 C 390,-6 338,-33 285,-33 Z"/>
  </g>
  <g id="bullet-char-template(9679)" transform="scale(0.00048828125,-0.00048828125)">
   <path d="M 813,0 C 632,0 489,54 383,161 276,268 223,411 223,592 223,773 276,916 383,1023 489,1130 632,1184 813,1184 992,1184 1136,1130 1245,1023 1353,916 1407,772 1407,592 1407,412 1353,268 1245,161 1136,54 992,0 813,0 Z"/>
  </g>
  <g id="bullet-char-template(8226)" transform="scale(0.00048828125,-0.00048828125)">
   <path d="M 346,457 C 273,457 209,483 155,535 101,586 74,649 74,723 74,796 101,859 155,911 209,963 273,989 346,989 419,989 480,963 531,910 582,859 608,796 608,723 608,648 583,586 532,535 482,483 420,457 346,457 Z"/>
  </g>
  <g id="bullet-char-template(8211)" transform="scale(0.00048828125,-0.00048828125)">
   <path d="M -4,459 L 1135,459 1135,606 -4,606 -4,459 Z"/>
  </g>
  <g id="bullet-char-template(61548)" transform="scale(0.00048828125,-0.00048828125)">
   <path d="M 173,740 C 173,903 231,1043 346,1159 462,1274 601,1332 765,1332 928,1332 1067,1274 1183,1159 1299,1043 1357,903 1357,740 1357,577 1299,437 1183,322 1067,206 928,148 765,148 601,148 462,206 346,322 231,437 173,577 173,740 Z"/>
  </g>
 </defs>
 <defs class="TextEmbeddedBitmaps"/>
 <g class="SlideGroup">
  <g>
   <g id="container-id1">
    <g id="id1" class="Slide" clip-path="url(#presentation_clip_path)">
     <g class="Page">
      <g class="Group">
       <g class="com.sun.star.drawing.EllipseShape">
        <g id="id3">
         <rect class="BoundingBox" stroke="none" fill="none" x="15715" y="11086" width="842" height="997"/>
         <path fill="none" stroke="rgb(43,43,210)" stroke-width="40" stroke-linejoin="round" d="M 15736,11106 C 15779,11126 15816,11145 15857,11169 16088,11302 16254,11468 16387,11699 16456,11818 16501,11928 16535,12061"/>
        </g>
       </g>
       <g class="com.sun.star.drawing.LineShape">
        <g id="id4">
         <rect class="BoundingBox" stroke="none" fill="none" x="15117" y="10605" width="911" height="1859"/>
         <path fill="none" stroke="rgb(255,0,0)" stroke-width="40" stroke-linejoin="round" d="M 15138,12443 L 15851,10838"/>
         <path fill="rgb(255,0,0)" stroke="none" d="M 15824,10841 L 15805,10826 15788,10805 15775,10781 15769,10755 15768,10729 15771,10705 15778,10682 15791,10661 15807,10642 15827,10625 15850,10613 15877,10607 15903,10606 15927,10608 15950,10616 15971,10628 15990,10645 16006,10664 16019,10688 16025,10713 16027,10740 16023,10765 16016,10787 16003,10808 15988,10827 15968,10843 15944,10856 15917,10863 15892,10864 15867,10860 15845,10854 15824,10841 Z"/>
        </g>
       </g>
       <g class="com.sun.star.drawing.LineShape">
        <g id="id5">
         <rect class="BoundingBox" stroke="none" fill="none" x="15117" y="11816" width="1954" height="648"/>
         <path fill="none" stroke="rgb(255,0,0)" stroke-width="40" stroke-linejoin="round" d="M 15138,12443 L 16831,11976"/>
         <path fill="rgb(255,0,0)" stroke="none" d="M 16811,11956 L 16811,11932 16816,11906 16826,11881 16842,11860 16862,11842 16883,11829 16905,11820 16929,11817 16954,11817 16980,11822 17004,11832 17025,11849 17043,11868 17056,11889 17065,11912 17069,11935 17068,11960 17063,11985 17053,12010 17037,12031 17018,12049 16996,12062 16974,12071 16950,12074 16926,12074 16900,12069 16875,12059 16854,12043 16836,12024 16823,12002 16814,11981 16811,11956 Z"/>
        </g>
       </g>
       <g class="com.sun.star.drawing.LineShape">
        <g id="id6">
         <rect class="BoundingBox" stroke="none" fill="none" x="14798" y="12293" width="3523" height="301"/>
         <path fill="none" stroke="rgb(0,0,0)" stroke-width="40" stroke-linejoin="round" d="M 14819,12443 L 17889,12443"/>
         <path fill="rgb(0,0,0)" stroke="none" d="M 18319,12443 L 17869,12293 17869,12593 18319,12443 Z"/>
        </g>
       </g>
       <g class="com.sun.star.drawing.LineShape">
        <g id="id7">
         <rect class="BoundingBox" stroke="none" fill="none" x="14988" y="9244" width="301" height="3521"/>
         <path fill="none" stroke="rgb(0,0,0)" stroke-width="40" stroke-linejoin="round" d="M 15138,12744 L 15138,9674"/>
         <path fill="rgb(0,0,0)" stroke="none" d="M 15138,9244 L 14988,9694 15288,9694 15138,9244 Z"/>
        </g>
       </g>
       <g class="OLE2">
        <g id="id8">
         <rect class="BoundingBox" stroke="none" fill="none" x="17021" y="11487" width="1563" height="481"/>
         <defs>
          <clipPath id="clip_path_1" clipPathUnits="userSpaceOnUse">
           <path d="M 17013,11483 L 18574,11483 18574,11959 17013,11959 17013,11483 Z"/>
          </clipPath>
         </defs>
         <g clip-path="url(#clip_path_1)">
          <text class="TextShape"><tspan class="TextParagraph" font-family="Liberation Serif, serif" font-size="422px" font-style="italic" font-weight="400"><tspan class="TextPosition" x="17153" y="11857"><tspan fill="rgb(0,0,0)" stroke="none">x</tspan></tspan></tspan></text>
          <text class="TextShape"><tspan class="TextParagraph" font-family="OpenSymbol" font-size="422px" font-weight="400"><tspan class="TextPosition" x="17391" y="11857"><tspan fill="rgb(0,0,0)" stroke="none">[</tspan></tspan></tspan></text>
          <text class="TextShape"><tspan class="TextParagraph" font-family="Liberation Serif, serif" font-size="422px" font-style="italic" font-weight="400"><tspan class="TextPosition" x="17550" y="11857"><tspan fill="rgb(0,0,0)" stroke="none">n</tspan></tspan></tspan></text>
          <text class="TextShape"><tspan class="TextParagraph" font-family="OpenSymbol" font-size="422px" font-weight="400"><tspan class="TextPosition" x="17788" y="11857"><tspan fill="rgb(0,0,0)" stroke="none">−</tspan></tspan></tspan></text>
          <text class="TextShape"><tspan class="TextParagraph" font-family="Liberation Serif, serif" font-size="422px" font-weight="400"><tspan class="TextPosition" x="18132" y="11857"><tspan fill="rgb(0,0,0)" stroke="none">1</tspan></tspan></tspan></text>
          <text class="TextShape"><tspan class="TextParagraph" font-family="OpenSymbol" font-size="422px" font-weight="400"><tspan class="TextPosition" x="18370" y="11857"><tspan fill="rgb(0,0,0)" stroke="none">]</tspan></tspan></tspan></text>
         </g>
        </g>
       </g>
       <g class="OLE2">
        <g id="id9">
         <rect class="BoundingBox" stroke="none" fill="none" x="15962" y="10237" width="992" height="481"/>
         <defs>
          <clipPath id="clip_path_2" clipPathUnits="userSpaceOnUse">
           <path d="M 15954,10239 L 16960,10239 16960,10716 15954,10716 15954,10239 Z"/>
          </clipPath>
         </defs>
         <g clip-path="url(#clip_path_2)">
          <text class="TextShape"><tspan class="TextParagraph" font-family="Liberation Serif, serif" font-size="422px" font-style="italic" font-weight="400"><tspan class="TextPosition" x="16094" y="10607"><tspan fill="rgb(0,0,0)" stroke="none">x</tspan></tspan></tspan></text>
          <text class="TextShape"><tspan class="TextParagraph" font-family="OpenSymbol" font-size="422px" font-weight="400"><tspan class="TextPosition" x="16332" y="10607"><tspan fill="rgb(0,0,0)" stroke="none">[</tspan></tspan></tspan></text>
          <text class="TextShape"><tspan class="TextParagraph" font-family="Liberation Serif, serif" font-size="422px" font-style="italic" font-weight="400"><tspan class="TextPosition" x="16491" y="10607"><tspan fill="rgb(0,0,0)" stroke="none">n</tspan></tspan></tspan></text>
          <text class="TextShape"><tspan class="TextParagraph" font-family="OpenSymbol" font-size="422px" font-weight="400"><tspan class="TextPosition" x="16729" y="10607"><tspan fill="rgb(0,0,0)" stroke="none">]</tspan></tspan></tspan></text>
         </g>
        </g>
       </g>
       <g class="OLE2">
        <g id="id10">
         <rect class="BoundingBox" stroke="none" fill="none" x="15383" y="11599" width="984" height="481"/>
         <defs>
          <clipPath id="clip_path_3" clipPathUnits="userSpaceOnUse">
           <path d="M 15372,11589 L 16378,11589 16378,12091 15372,12091 15372,11589 Z"/>
          </clipPath>
         </defs>
         <g clip-path="url(#clip_path_3)">
          <text class="TextShape"><tspan class="TextParagraph" font-family="OpenSymbol" font-size="422px" font-weight="400"><tspan class="TextPosition" x="15489" y="11969"><tspan fill="rgb(0,0,0)" stroke="none">θ</tspan></tspan></tspan></text>
          <text class="TextShape"><tspan class="TextParagraph" font-family="OpenSymbol" font-size="422px" font-weight="400"><tspan class="TextPosition" x="15753" y="11969"><tspan fill="rgb(0,0,0)" stroke="none">[</tspan></tspan></tspan></text>
          <text class="TextShape"><tspan class="TextParagraph" font-family="Liberation Serif, serif" font-size="422px" font-style="italic" font-weight="400"><tspan class="TextPosition" x="15912" y="11969"><tspan fill="rgb(0,0,0)" stroke="none">n</tspan></tspan></tspan></text>
          <text class="TextShape"><tspan class="TextParagraph" font-family="OpenSymbol" font-size="422px" font-weight="400"><tspan class="TextPosition" x="16150" y="11969"><tspan fill="rgb(0,0,0)" stroke="none">]</tspan></tspan></tspan></text>
         </g>
        </g>
       </g>
       <g class="OLE2">
        <g id="id11">
         <rect class="BoundingBox" stroke="none" fill="none" x="18344" y="12209" width="1001" height="467"/>
         <defs>
          <clipPath id="clip_path_4" clipPathUnits="userSpaceOnUse">
           <path d="M 18336,12197 L 19341,12197 19341,12674 18336,12674 18336,12197 Z"/>
          </clipPath>
         </defs>
         <g clip-path="url(#clip_path_4)">
          <text class="TextShape"><tspan class="TextParagraph" font-family="Liberation Serif, serif" font-size="422px" font-weight="400"><tspan class="TextPosition" x="18450" y="12579"><tspan fill="rgb(0,0,0)" stroke="none">Real</tspan></tspan></tspan></text>
         </g>
        </g>
       </g>
       <g class="OLE2">
        <g id="id12">
         <rect class="BoundingBox" stroke="none" fill="none" x="14123" y="8771" width="1966" height="467"/>
         <defs>
          <clipPath id="clip_path_5" clipPathUnits="userSpaceOnUse">
           <path d="M 14129,8784 L 16087,8784 16087,9234 14129,9234 14129,8784 Z"/>
          </clipPath>
         </defs>
         <g clip-path="url(#clip_path_5)">
          <text class="TextShape"><tspan class="TextParagraph" font-family="Liberation Serif, serif" font-size="422px" font-weight="400"><tspan class="TextPosition" x="14229" y="9141"><tspan fill="rgb(0,0,0)" stroke="none">Imaginary</tspan></tspan></tspan></text>
         </g>
        </g>
       </g>
      </g>
     </g>
    </g>
   </g>
  </g>
 </g>
</svg>