<?xml version="1.0" encoding="UTF-8" standalone="no"?>
<!DOCTYPE svg PUBLIC "-//W3C//DTD SVG 1.1//EN" "http://www.w3.org/Graphics/SVG/1.1/DTD/svg11.dtd">
<!-- Generated by Microsoft Visio, SVG Export polyphase_interpolation_filter.svg Page-1 -->
<svg xmlns="http://www.w3.org/2000/svg" xmlns:xlink="http://www.w3.org/1999/xlink" xmlns:ev="http://www.w3.org/2001/xml-events"
		width="7.81956in" height="4.62383in" viewBox="0 0 563.008 332.916" xml:space="preserve" color-interpolation-filters="sRGB"
		class="st13">
	<style type="text/css">
	<![CDATA[
		.st1 {visibility:visible}
		.st2 {fill:#5b9bd5;fill-opacity:0.22;filter:url(#filter_2);stroke:#5b9bd5;stroke-opacity:0.22}
		.st3 {fill:#5b9bd5;stroke:#c7c8c8;stroke-width:0.25}
		.st4 {stroke:#ffffff;stroke-linecap:round;stroke-linejoin:round;stroke-width:3}
		.st5 {fill:#feffff;font-family:Calibri;font-size:1.16666em}
		.st6 {marker-end:url(#mrkr4-30);stroke:#5b9bd5;stroke-linecap:round;stroke-linejoin:round;stroke-width:1}
		.st7 {fill:#5b9bd5;fill-opacity:1;stroke:#5b9bd5;stroke-opacity:1;stroke-width:0.28409090909091}
		.st8 {fill:none;stroke:none;stroke-width:0.25}
		.st9 {fill:#41719c;font-family:Calibri;font-size:1.16666em}
		.st10 {font-size:1em}
		.st11 {fill:#feffff;font-family:Calibri;font-size:0.833336em}
		.st12 {marker-start:url(#mrkr13-94);stroke:#5b9bd5;stroke-linecap:round;stroke-linejoin:round;stroke-width:1}
		.st13 {fill:none;fill-rule:evenodd;font-size:12px;overflow:visible;stroke-linecap:square;stroke-miterlimit:3}
	]]>
	</style>

	<defs id="Markers">
		<g id="lend4">
			<path d="M 2 1 L 0 0 L 2 -1 L 2 1 " style="stroke:none"/>
		</g>
		<marker id="mrkr4-30" class="st7" refX="-7.04" orient="auto" markerUnits="strokeWidth" overflow="visible">
			<use xlink:href="#lend4" transform="scale(-3.52,-3.52) "/>
		</marker>
		<g id="lend13">
			<path d="M 3 1 L 0 0 L 3 -1 L 3 1 " style="stroke:none"/>
		</g>
		<marker id="mrkr13-94" class="st7" refX="10.2" orient="auto" markerUnits="strokeWidth" overflow="visible">
			<use xlink:href="#lend13" transform="scale(3.52) "/>
		</marker>
	</defs>
	<defs id="Filters">
		<filter id="filter_2">
			<feGaussianBlur stdDeviation="2"/>
		</filter>
	</defs>
	<g>
		<title>Page-1</title>
		<g id="group18-1" transform="translate(249.53,-142.691)">
			<title>Sheet.18</title>
			<g id="shape14-2">
				<title>Circle</title>
				<g id="shadow14-3" transform="matrix(1,0,0,1,0.345598,1.97279)" class="st1">
					<path d="M0 301.03 A31.8898 31.8898 0 0 1 63.78 301.03 A31.8898 31.8898 0 1 1 0 301.03 Z" class="st2"/>
				</g>
				<path d="M0 301.03 A31.8898 31.8898 0 0 1 63.78 301.03 A31.8898 31.8898 0 1 1 0 301.03 Z" class="st3"/>
			</g>
			<g id="shape16-7" transform="translate(-226.07,88.1714) rotate(-45)">
				<title>Sheet.16</title>
				<path d="M0 332.92 L63.79 332.92" class="st4"/>
			</g>
			<g id="shape17-10" transform="translate(-180.965,558.985) rotate(-135)">
				<title>Sheet.17</title>
				<path d="M0 332.92 L63.79 332.92" class="st4"/>
			</g>
		</g>
		<g id="group23-13" transform="translate(109.215,-132.061)">
			<title>Can.23</title>
			<desc>Tap RAM</desc>
			<g id="shape24-14">
				<title>Sheet.24</title>
				<g id="shadow24-15" transform="matrix(1,0,0,1,0.345598,1.97279)" class="st1">
					<path d="M0 324.41 A42.5197 8.50394 -180 1 0 85.04 324.41 L85.04 256.38 L0 256.38 L0 324.41 Z" class="st2"/>
				</g>
				<path d="M0 324.41 A42.5197 8.50394 -180 1 0 85.04 324.41 L85.04 256.38 L0 256.38 L0 324.41 Z" class="st3"/>
			</g>
			<g id="shape23-19">
				<g id="shadow23-20" transform="matrix(1,0,0,1,0.345598,1.97279)" class="st1">
					<ellipse cx="42.5197" cy="256.38" rx="42.5197" ry="8.50394" class="st2"/>
				</g>
				<ellipse cx="42.5197" cy="256.38" rx="42.5197" ry="8.50394" class="st3"/>
				<text x="16.66" y="294.6" class="st5">Tap RAM</text>			</g>
		</g>
		<g id="shape25-25" transform="translate(194.254,-167.494)">
			<title>Dynamic connector</title>
			<path d="M0 325.83 L48.24 325.83" class="st6"/>
		</g>
		<g id="shape26-31" transform="translate(0.25,-264.858)">
			<title>Rectangle</title>
			<desc>Incoming Sample</desc>
			<rect x="0" y="286.144" width="85.0394" height="46.7717" class="st8"/>
			<text x="28.51" y="305.33" class="st9">Incoming <tspan x="39.18" dy="1.2em" class="st10">Sample</tspan></text>		</g>
		<g id="group28-35" transform="translate(362.916,-142.691)">
			<title>Sheet.28</title>
			<g id="shape29-36">
				<title>Circle</title>
				<g id="shadow29-37" transform="matrix(1,0,0,1,0.345598,1.97279)" class="st1">
					<path d="M0 301.03 A31.8898 31.8898 0 0 1 63.78 301.03 A31.8898 31.8898 0 1 1 0 301.03 Z" class="st2"/>
				</g>
				<path d="M0 301.03 A31.8898 31.8898 0 0 1 63.78 301.03 A31.8898 31.8898 0 1 1 0 301.03 Z" class="st3"/>
			</g>
			<g id="shape30-41" transform="translate(364.805,269.136) rotate(90)">
				<title>Sheet.30</title>
				<path d="M0 332.92 L63.78 332.92" class="st4"/>
			</g>
			<g id="shape31-44" transform="translate(0,-31.8898)">
				<title>Sheet.31</title>
				<path d="M0 332.92 L63.78 332.92" class="st4"/>
			</g>
		</g>
		<g id="shape32-47" transform="translate(313.309,-167.494)">
			<title>Dynamic connector.32</title>
			<path d="M0 325.83 L42.57 325.83" class="st6"/>
		</g>
		<g id="shape33-52" transform="translate(654.729,229.201) rotate(90)">
			<title>Trapezoid</title>
			<desc>Reset ACC</desc>
			<g id="shadow33-53" transform="matrix(1,0,0,1,1.97279,-0.345598)" class="st1">
				<path d="M0 332.92 L64.25 332.92 L48.19 284.73 L16.06 284.73 L0 332.92 Z" class="st2"/>
			</g>
			<path d="M0 332.92 L64.25 332.92 L48.19 284.73 L16.06 284.73 L0 332.92 Z" class="st3"/>
			<text x="-329.5" y="35.13" transform="rotate(-90)" class="st11">Reset ACC</text>		</g>
		<g id="shape34-58" transform="translate(426.695,-174.581)">
			<title>Dynamic connector.34</title>
			<path d="M0 332.92 L10.63 332.92 L10.63 474.65 L-115.51 474.65 L-115.51 427.88 L-111.92 427.88" class="st6"/>
		</g>
		<g id="shape35-63" transform="translate(370.002,-63.5571)">
			<title>Dynamic connector.35</title>
			<path d="M0 332.92 L24.8 332.92 L24.8 260.82" class="st6"/>
		</g>
		<g id="shape36-68" transform="translate(137.561,-25.2894)">
			<title>Rectangle.36</title>
			<desc>Modulo N Counter</desc>
			<g id="shadow36-69" transform="matrix(1,0,0,1,0.345598,1.97279)" class="st1">
				<rect x="0" y="262.05" width="94.4882" height="70.8661" class="st2"/>
			</g>
			<rect x="0" y="262.05" width="94.4882" height="70.8661" class="st3"/>
			<text x="18.81" y="293.28" class="st5">Modulo N <tspan x="24.2" dy="1.2em" class="st10">Counter</tspan></text>		</g>
		<g id="shape37-75" transform="translate(137.561,-60.7224)">
			<title>Dynamic connector.37</title>
			<path d="M0 332.92 L-51.59 332.92 L-51.59 219.06 L-35.39 219.06" class="st6"/>
		</g>
		<g id="shape38-80" transform="translate(184.805,-103.006)">
			<title>Dynamic connector.38</title>
			<path d="M0 339.77 L0 319.94 L161.1 319.94 L161.1 333.2" class="st6"/>
		</g>
		<g id="shape39-85" transform="translate(477.719,-151.195)">
			<title>Rectangle.39</title>
			<desc>Outgoing Sample</desc>
			<rect x="0" y="286.144" width="85.0394" height="46.7717" class="st8"/>
			<text x="4" y="305.33" class="st9">Outgoing <tspan x="4" dy="1.2em" class="st10">Sample</tspan></text>		</g>
		<g id="shape40-89" transform="translate(477.719,-167.494)">
			<title>Dynamic connector.40</title>
			<path d="M-10.2 325.83 L-10.56 325.83 L-40.39 325.83" class="st12"/>
		</g>
		<g id="group41-95" transform="translate(442.13,2.42943) rotate(90)">
			<title>Can.41</title>
			<desc>Sample RAM</desc>
			<g id="shape42-96">
				<title>Sheet.42</title>
				<g id="shadow42-97" transform="matrix(1,0,0,1,1.97279,-0.345598)" class="st1">
					<path d="M0 324.41 A42.5197 8.50394 -180 1 0 85.04 324.41 L85.04 256.38 L0 256.38 L0 324.41 Z" class="st2"/>
				</g>
				<path d="M0 324.41 A42.5197 8.50394 -180 1 0 85.04 324.41 L85.04 256.38 L0 256.38 L0 324.41 Z" class="st3"/>
			</g>
			<g id="shape41-101">
				<g id="shadow41-102" transform="matrix(1,0,0,1,1.97279,-0.345598)" class="st1">
					<ellipse cx="42.5197" cy="256.38" rx="42.5197" ry="8.50394" class="st2"/>
				</g>
				<ellipse cx="42.5197" cy="256.38" rx="42.5197" ry="8.50394" class="st3"/>
				<text x="-311.32" y="38.32" transform="rotate(-90)" class="st5">Sample <tspan x="-304.23" dy="1.2em" class="st10">RAM</tspan></text>			</g>
		</g>
		<g id="shape43-108" transform="translate(85.2894,-295.192)">
			<title>Dynamic connector.43</title>
			<path d="M0 339.86 L16.89 340.06" class="st6"/>
		</g>
		<g id="shape44-113" transform="translate(194.254,-287.967)">
			<title>Dynamic connector.44</title>
			<path d="M0 332.92 L87.17 332.92 L87.17 407.37" class="st6"/>
		</g>
		<g id="shape45-118" transform="translate(137.561,-60.7224)">
			<title>Dynamic connector.45</title>
			<path d="M0 332.92 L-51.59 332.92 L-51.59 158.82 L14.17 158.82 L14.17 155.23" class="st6"/>
		</g>
		<g id="shape46-123" transform="translate(477.719,-0.25)">
			<title>Rectangle.46</title>
			<desc>Sample Valid</desc>
			<rect x="0" y="286.144" width="85.0394" height="46.7717" class="st8"/>
			<text x="4" y="313.73" class="st9">Sample Valid</text>		</g>
		<g id="shape47-126" transform="translate(232.049,-60.7224)">
			<title>Dynamic connector.47</title>
			<path d="M0 332.92 L10.63 332.92 L10.63 370 L238.63 370" class="st6"/>
		</g>
	</g>
</svg>
