<?xml version="1.0" encoding="UTF-8" standalone="no"?>
<!DOCTYPE svg PUBLIC "-//W3C//DTD SVG 1.1//EN" "http://www.w3.org/Graphics/SVG/1.1/DTD/svg11.dtd">
<!-- Generated by Microsoft Visio, SVG Export real_Window_block_diagram.svg Page-1 -->
<svg xmlns="http://www.w3.org/2000/svg" xmlns:xlink="http://www.w3.org/1999/xlink" xmlns:ev="http://www.w3.org/2001/xml-events"
		width="8.90262in" height="4.47411in" viewBox="0 0 640.989 322.136" xml:space="preserve" color-interpolation-filters="sRGB"
		class="st11">
	<style type="text/css">
	<![CDATA[
		.st1 {stroke:#000000;stroke-linecap:round;stroke-linejoin:round;stroke-width:0.71996}
		.st2 {stroke:none;stroke-linecap:round;stroke-linejoin:round;stroke-width:0.75}
		.st3 {fill:#000000;font-family:Calibri;font-size:1.49995em}
		.st4 {fill:#000000;stroke:#000000;stroke-linecap:round;stroke-linejoin:round;stroke-width:0.00749959}
		.st5 {fill:#000000;stroke:#000000;stroke-linecap:round;stroke-linejoin:round;stroke-width:0.0299983}
		.st6 {fill:#000000;font-family:Courier New;font-size:0.829971em}
		.st7 {fill:#000000;stroke:#000000;stroke-linecap:round;stroke-linejoin:round;stroke-width:0.0149992}
		.st8 {marker-end:url(#mrkr13-71);stroke:#000000;stroke-linecap:round;stroke-linejoin:round;stroke-width:0.75}
		.st9 {fill:#000000;fill-opacity:1;stroke:#000000;stroke-opacity:1;stroke-width:0.22935779816514}
		.st10 {marker-start:url(#mrkr13-77);stroke:#000000;stroke-linecap:round;stroke-linejoin:round;stroke-width:0.75}
		.st11 {fill:none;fill-rule:evenodd;font-size:12px;overflow:visible;stroke-linecap:square;stroke-miterlimit:3}
	]]>
	</style>

	<defs id="Markers">
		<g id="lend13">
			<path d="M 3 1 L 0 0 L 3 -1 L 3 1 " style="stroke:none"/>
		</g>
		<marker id="mrkr13-71" class="st9" refX="-13.08" orient="auto" markerUnits="strokeWidth" overflow="visible">
			<use xlink:href="#lend13" transform="scale(-4.36,-4.36) "/>
		</marker>
		<marker id="mrkr13-77" class="st9" refX="12.6" orient="auto" markerUnits="strokeWidth" overflow="visible">
			<use xlink:href="#lend13" transform="scale(4.36) "/>
		</marker>
	</defs>
	<g>
		<title>Page-1</title>
		<g id="shape8-1" transform="translate(69.2163,-87.7693)">
			<title>Sheet.8</title>
			<path d="M0 249.42 L118.19 249.42 L118.19 322.14 L0 322.14 L0 249.42" class="st1"/>
		</g>
		<g id="shape9-4" transform="translate(97.8205,-133.084)">
			<title>Sheet.9</title>
			<desc>Protocol</desc>
			<path d="M80.46 300.53 L0 300.53 L0 322.14 L80.46 322.14 L80.46 300.53" class="st2"/>
			<text x="9.32" y="316.73" class="st3">Protocol </text>		</g>
		<g id="shape10-8" transform="translate(95.7807,-111.485)">
			<title>Sheet.10</title>
			<desc>Interface</desc>
			<path d="M85.19 300.53 L0 300.53 L0 322.14 L85.19 322.14 L85.19 300.53" class="st2"/>
			<text x="9.63" y="316.73" class="st3">Interface </text>		</g>
		<g id="shape11-12" transform="translate(108.86,-89.8857)">
			<title>Sheet.11</title>
			<desc>delay</desc>
			<path d="M49.89 300.53 L0 300.53 L0 322.14 L49.89 322.14 L49.89 300.53" class="st2"/>
			<text x="5.29" y="316.73" class="st3">delay</text>		</g>
		<g id="shape12-16" transform="translate(2.26133,-160.509)">
			<title>Sheet.12</title>
			<path d="M0 232.16 L126.29 232.16 L126.29 317.13 L125.81 317.13 L125.81 232.4 L126.05 232.64 L0 232.64 L0 232.16 L0 232.16
						 ZM129.05 316.14 L126.05 322.14 L123.05 316.14 L129.05 316.14 L129.05 316.14 Z" class="st4"/>
		</g>
		<g id="shape16-18" transform="translate(483.305,-127.968)">
			<title>Sheet.16</title>
			<path d="M0 271.26 L118.19 271.26 L118.19 322.14 L0 322.14 L0 271.26" class="st1"/>
		</g>
		<g id="shape17-21" transform="translate(503.019,-151.476)">
			<title>Sheet.17</title>
			<desc>Coefficient</desc>
			<path d="M95.93 300.53 L0 300.53 L0 322.14 L95.93 322.14 L95.93 300.53" class="st2"/>
			<text x="8.29" y="316.73" class="st3">Coefficient</text>		</g>
		<g id="shape18-25" transform="translate(512.979,-129.876)">
			<title>Sheet.18</title>
			<desc>Counter</desc>
			<path d="M72.84 300.53 L0 300.53 L0 322.14 L72.84 322.14 L72.84 300.53" class="st2"/>
			<text x="6.79" y="316.73" class="st3">Counter</text>		</g>
		<g id="shape19-29" transform="translate(483.305,-220.125)">
			<title>Sheet.19</title>
			<path d="M0 271.26 L118.19 271.26 L118.19 322.14 L0 322.14 L0 271.26" class="st1"/>
		</g>
		<g id="shape20-32" transform="translate(503.019,-243.583)">
			<title>Sheet.20</title>
			<desc>Coefficient</desc>
			<path d="M95.93 300.53 L0 300.53 L0 322.14 L95.93 322.14 L95.93 300.53" class="st2"/>
			<text x="8.29" y="316.73" class="st3">Coefficient</text>		</g>
		<g id="shape21-36" transform="translate(514.539,-221.984)">
			<title>Sheet.21</title>
			<desc>DPRAM</desc>
			<path d="M69.03 300.53 L0 300.53 L0 322.14 L69.03 322.14 L69.03 300.53" class="st2"/>
			<text x="6.54" y="316.73" class="st3">DPRAM</text>		</g>
		<g id="shape24-40" transform="translate(539.461,-178.906)">
			<title>Sheet.24</title>
			<path d="M3.24 322.14 L3.24 285.93 L2.76 285.93 L2.76 322.14 L3.24 322.14 L3.24 322.14 ZM6 286.92 L3 280.92 L0 286.92
						 L6 286.92 L6 286.92 Z" class="st5"/>
		</g>
		<g id="shape25-42" transform="translate(539.461,-271.033)">
			<title>Sheet.25</title>
			<path d="M3.24 271.05 L3.24 317.13 L2.76 317.13 L2.76 271.05 L3.24 271.05 L3.24 271.05 ZM6 316.14 L3 322.14 L0 316.14
						 L6 316.14 L6 316.14 Z" class="st5"/>
		</g>
		<g id="shape26-44" transform="translate(1.19904E-014,-253.034)">
			<title>Sheet.26</title>
			<desc>data_in</desc>
			<path d="M54.99 310.18 L0 310.18 L0 322.14 L54.99 322.14 L54.99 310.18" class="st2"/>
			<text x="6.58" y="319.15" class="st6">data_in</text>		</g>
		<g id="shape27-48" transform="translate(551.631,-303.771)">
			<title>Sheet.27</title>
			<desc>Props_in.raw</desc>
			<path d="M89.36 310.18 L0 310.18 L0 322.14 L89.36 322.14 L89.36 310.18" class="st2"/>
			<text x="8.82" y="319.15" class="st6">Props_in.raw</text>		</g>
		<g id="shape31-52" transform="translate(125.627,-0.00749959)">
			<title>Sheet.31</title>
			<path d="M2.98 234.37 L3.25 317.14 L2.77 317.14 L2.5 234.39 L2.98 234.37 L2.98 234.37 ZM6 316.14 L3.03 322.14 L0 316.15
						 L6 316.14 L6 316.14 Z" class="st7"/>
		</g>
		<g id="shape32-54" transform="translate(139.19,-12.5809)">
			<title>Sheet.32</title>
			<desc>data_out</desc>
			<path d="M61.86 310.18 L0 310.18 L0 322.14 L61.86 322.14 L61.86 310.18" class="st2"/>
			<text x="7.02" y="319.15" class="st6">data_out</text>		</g>
		<g id="group33-58" transform="translate(232.884,-237.904)">
			<title>Sheet.33</title>
			<g id="shape4-59">
				<title>Sheet.4</title>
				<path d="M0 292.98 L118.19 292.98 L118.19 322.14 L0 322.14 L0 292.98" class="st1"/>
			</g>
			<g id="shape5-62" transform="translate(28.5604,-1.69727)">
				<title>Sheet.5</title>
				<desc>Window</desc>
				<path d="M75.31 300.53 L0 300.53 L0 322.14 L75.31 322.14 L75.31 300.53" class="st2"/>
				<text x="6.95" y="316.73" class="st3">Window</text>			</g>
		</g>
		<g id="shape34-66" transform="translate(128.552,-243.371)">
			<title>Dynamic connector</title>
			<path d="M0 315.33 L92.94 314.82" class="st8"/>
		</g>
		<g id="shape35-72" transform="translate(351.075,-245.397)">
			<title>Dynamic connector.35</title>
			<path d="M9.45 315.05 L9.81 315.05 L132.23 315.05" class="st10"/>
		</g>
		<g id="shape36-78" transform="translate(291.98,-237.904)">
			<title>Dynamic connector.36</title>
			<path d="M0 322.14 L0 435.91 L-94.76 435.91" class="st8"/>
		</g>
	</g>
</svg>
