{
  "name": "rmejias-sublime_text",
  "version": "0.1.0",
  "author": "rmejias",
  "summary": "",
  "license": "Apache-2.0",
  "source": "",
  "dependencies": [

  ],
  "operatingsystem_support": [
    {
      "operatingsystem": "CentOS",
      "operatingsystemrelease": [
        "7"
      ]
    },
    {
      "operatingsystem": "OracleLinux",
      "operatingsystemrelease": [
        "7"
      ]
    },
    {
      "operatingsystem": "RedHat",
      "operatingsystemrelease": [
        "8"
      ]
    },
    {
      "operatingsystem": "Scientific",
      "operatingsystemrelease": [
        "7"
      ]
    },
    {
      "operatingsystem": "Debian",
      "operatingsystemrelease": [
        "9"
      ]
    },
    {
      "operatingsystem": "Ubuntu",
      "operatingsystemrelease": [
        "18.04"
      ]
    },
    {
      "operatingsystem": "windows",
      "operatingsystemrelease": [
        "2019",
        "10"
      ]
    }
  ],
  "requirements": [
    {
      "name": "puppet",
      "version_requirement": ">= 4.10.0 < 7.0.0"
    }
  ],
  "dependencies": [
    {
      "name": "puppetlabs/apt",
      "version_requirement": ">= 2.1.0 < 8.0.0"
    },
  ],
  "pdk-version": "1.17.0",
  "template-url": "pdk-default#1.17.0",
  "template-ref": "tags/1.17.0-0-gd3a4319"
}
