<?xml version="1.0" encoding="UTF-8" standalone="no"?>
<!-- Created with Inkscape (http://www.inkscape.org/) -->
<svg
   xmlns:dc="http://purl.org/dc/elements/1.1/"
   xmlns:cc="http://creativecommons.org/ns#"
   xmlns:rdf="http://www.w3.org/1999/02/22-rdf-syntax-ns#"
   xmlns:svg="http://www.w3.org/2000/svg"
   xmlns="http://www.w3.org/2000/svg"
   xmlns:xlink="http://www.w3.org/1999/xlink"
   xmlns:sodipodi="http://sodipodi.sourceforge.net/DTD/sodipodi-0.dtd"
   xmlns:inkscape="http://www.inkscape.org/namespaces/inkscape"
   version="1.0"
   width="48"
   height="48"
   id="svg1328"
   sodipodi:version="0.32"
   inkscape:version="0.46"
   sodipodi:docname="gpm-primary-020-charging.svg"
   inkscape:output_extension="org.inkscape.output.svg.inkscape"
   inkscape:export-filename="/home/hughsie/Code/unityx-power-manager/data/icons/48x48/status/gpm-primary-020-charging.png"
   inkscape:export-xdpi="90"
   inkscape:export-ydpi="90">
  <metadata
     id="metadata104">
    <rdf:RDF>
      <cc:Work
         rdf:about="">
        <dc:format>image/svg+xml</dc:format>
        <dc:type
           rdf:resource="http://purl.org/dc/dcmitype/StillImage" />
      </cc:Work>
    </rdf:RDF>
  </metadata>
  <sodipodi:namedview
     inkscape:window-height="480"
     inkscape:window-width="640"
     inkscape:pageshadow="2"
     inkscape:pageopacity="0.0"
     guidetolerance="10.0"
     gridtolerance="10.0"
     objecttolerance="10.0"
     borderopacity="1.0"
     bordercolor="#666666"
     pagecolor="#ffffff"
     id="base"
     showgrid="false" />
  <defs
     id="defs3">
    <inkscape:perspective
       sodipodi:type="inkscape:persp3d"
       inkscape:vp_x="0 : 24 : 1"
       inkscape:vp_y="0 : 1000 : 0"
       inkscape:vp_z="48 : 24 : 1"
       inkscape:persp3d-origin="24 : 16 : 1"
       id="perspective106" />
    <linearGradient
       id="linearGradient1535">
      <stop
         style="stop-color:#f67800;stop-opacity:1"
         offset="0"
         id="stop1537" />
      <stop
         style="stop-color:#fcaf3e;stop-opacity:1"
         offset="1"
         id="stop1539" />
    </linearGradient>
    <linearGradient
       id="linearGradient1523">
      <stop
         style="stop-color:#ce5c00;stop-opacity:1"
         offset="0"
         id="stop1525" />
      <stop
         style="stop-color:#fcaf3e;stop-opacity:1"
         offset="1"
         id="stop1527" />
    </linearGradient>
    <linearGradient
       id="linearGradient3289">
      <stop
         style="stop-color:#000000;stop-opacity:1"
         offset="0"
         id="stop3291" />
      <stop
         style="stop-color:#000000;stop-opacity:0"
         offset="1"
         id="stop3293" />
    </linearGradient>
    <linearGradient
       id="linearGradient3271">
      <stop
         style="stop-color:#eeeeec;stop-opacity:1"
         offset="0"
         id="stop3273" />
      <stop
         style="stop-color:#d3d3ce;stop-opacity:1"
         offset="1"
         id="stop3275" />
    </linearGradient>
    <linearGradient
       id="linearGradient3309">
      <stop
         style="stop-color:#e5e6e3;stop-opacity:1"
         offset="0"
         id="stop3311" />
      <stop
         style="stop-color:#d1d3cf;stop-opacity:1"
         offset="0.5"
         id="stop3317" />
      <stop
         style="stop-color:#767c6f;stop-opacity:1"
         offset="1"
         id="stop3313" />
    </linearGradient>
    <linearGradient
       id="linearGradient3323">
      <stop
         style="stop-color:#000000;stop-opacity:1"
         offset="0"
         id="stop3325" />
      <stop
         style="stop-color:#000000;stop-opacity:0"
         offset="1"
         id="stop3327" />
    </linearGradient>
    <linearGradient
       id="linearGradient3341">
      <stop
         style="stop-color:#b6b6b6;stop-opacity:1"
         offset="0"
         id="stop3343" />
      <stop
         style="stop-color:#b6b6b6;stop-opacity:0"
         offset="1"
         id="stop3345" />
    </linearGradient>
    <linearGradient
       id="linearGradient3353">
      <stop
         style="stop-color:#969696;stop-opacity:1"
         offset="0"
         id="stop3355" />
      <stop
         style="stop-color:#b6b6b6;stop-opacity:0"
         offset="1"
         id="stop3357" />
    </linearGradient>
    <linearGradient
       id="linearGradient3338">
      <stop
         style="stop-color:#c36000;stop-opacity:1"
         offset="0"
         id="stop3340" />
      <stop
         style="stop-color:#fcaf3e;stop-opacity:1"
         offset="0.5"
         id="stop3346" />
      <stop
         style="stop-color:#f57900;stop-opacity:1"
         offset="1"
         id="stop3342" />
    </linearGradient>
    <linearGradient
       id="linearGradient3247">
      <stop
         style="stop-color:#f0f0f0;stop-opacity:1"
         offset="0"
         id="stop3249" />
      <stop
         style="stop-color:#f0f0f0;stop-opacity:0"
         offset="1"
         id="stop3251" />
    </linearGradient>
    <linearGradient
       id="linearGradient3233">
      <stop
         style="stop-color:#eeeeec;stop-opacity:1"
         offset="0"
         id="stop3235" />
      <stop
         style="stop-color:#a3a398;stop-opacity:1"
         offset="1"
         id="stop3237" />
    </linearGradient>
    <linearGradient
       id="linearGradient6924">
      <stop
         style="stop-color:#ffffff;stop-opacity:1"
         offset="0"
         id="stop6926" />
      <stop
         style="stop-color:#ffffff;stop-opacity:0"
         offset="1"
         id="stop6928" />
    </linearGradient>
    <linearGradient
       id="linearGradient4176">
      <stop
         style="stop-color:#ffffff;stop-opacity:1"
         offset="0"
         id="stop4178" />
      <stop
         style="stop-color:#ffffff;stop-opacity:0"
         offset="1"
         id="stop4180" />
    </linearGradient>
    <linearGradient
       id="linearGradient4134">
      <stop
         style="stop-color:#d6d7d5;stop-opacity:1"
         offset="0"
         id="stop4136" />
      <stop
         style="stop-color:#d1d2d0;stop-opacity:1"
         offset="0.25"
         id="stop4148" />
      <stop
         style="stop-color:#a5a6a3;stop-opacity:1"
         offset="0.5"
         id="stop4142" />
      <stop
         style="stop-color:#dddedc;stop-opacity:1"
         offset="1"
         id="stop4138" />
    </linearGradient>
    <linearGradient
       id="linearGradient4126">
      <stop
         style="stop-color:#000000;stop-opacity:1"
         offset="0"
         id="stop4128" />
      <stop
         style="stop-color:#000000;stop-opacity:0"
         offset="1"
         id="stop4130" />
    </linearGradient>
    <radialGradient
       cx="23.857143"
       cy="40"
       r="17.142857"
       fx="23.857143"
       fy="40"
       id="radialGradient4132"
       xlink:href="#linearGradient4126"
       gradientUnits="userSpaceOnUse"
       gradientTransform="matrix(1,0,0,0.5,0,20)" />
    <linearGradient
       x1="9.3030529"
       y1="26.71875"
       x2="38.826412"
       y2="26.71875"
       id="linearGradient4140"
       xlink:href="#linearGradient4134"
       gradientUnits="userSpaceOnUse"
       gradientTransform="matrix(1.010754,0,0,0.991346,-7.269358,-4.826537)" />
    <linearGradient
       x1="17.160095"
       y1="14.004482"
       x2="37.969398"
       y2="56.575912"
       id="linearGradient4182"
       xlink:href="#linearGradient4176"
       gradientUnits="userSpaceOnUse"
       gradientTransform="matrix(1.010754,0,0,0.992756,-7.269358,-4.832743)" />
    <linearGradient
       x1="16.07143"
       y1="19.5"
       x2="16.035715"
       y2="31.75"
       id="linearGradient6930"
       xlink:href="#linearGradient6924"
       gradientUnits="userSpaceOnUse"
       gradientTransform="matrix(1.010754,0,0,1,-7.269359,-2.32786)" />
    <radialGradient
       cx="23.857143"
       cy="40"
       r="17.142857"
       fx="23.857143"
       fy="40"
       id="radialGradient6946"
       xlink:href="#linearGradient4126"
       gradientUnits="userSpaceOnUse"
       gradientTransform="matrix(1,0,0,0.5,0,20)" />
    <linearGradient
       x1="24"
       y1="17.245949"
       x2="23.433737"
       y2="8.0476589"
       id="linearGradient3243"
       xlink:href="#linearGradient3233"
       gradientUnits="userSpaceOnUse" />
    <linearGradient
       x1="34.244171"
       y1="17.695425"
       x2="34.244171"
       y2="29.91827"
       id="linearGradient3253"
       xlink:href="#linearGradient3247"
       gradientUnits="userSpaceOnUse"
       gradientTransform="matrix(1.010754,0,0,1,-7.269359,-3.185003)" />
    <linearGradient
       x1="24"
       y1="17.245949"
       x2="23.433737"
       y2="8.0476589"
       id="linearGradient3255"
       xlink:href="#linearGradient3233"
       gradientUnits="userSpaceOnUse" />
    <linearGradient
       x1="-27.27899"
       y1="-5.7469382"
       x2="-28.46833"
       y2="-11.99264"
       id="linearGradient3797"
       xlink:href="#linearGradient3341"
       gradientUnits="userSpaceOnUse"
       gradientTransform="translate(36.7012,10.5)" />
    <radialGradient
       cx="22.5"
       cy="34"
       r="23.5"
       fx="22.5"
       fy="34"
       id="radialGradient3806"
       xlink:href="#linearGradient3323"
       gradientUnits="userSpaceOnUse"
       gradientTransform="matrix(1,0,0,0.595745,0,13.74468)" />
    <radialGradient
       cx="77.499115"
       cy="-9.0639915"
       r="17.500887"
       fx="77.499115"
       fy="-9.0639915"
       id="radialGradient3825"
       xlink:href="#linearGradient3309"
       gradientUnits="userSpaceOnUse"
       gradientTransform="matrix(1.468277,0,0,1.290652,-34.29018,41.60653)" />
    <linearGradient
       x1="78.98452"
       y1="12.350954"
       x2="79.109146"
       y2="8.7270317"
       id="linearGradient3827"
       xlink:href="#linearGradient3271"
       gradientUnits="userSpaceOnUse"
       gradientTransform="matrix(0.667726,0,0,0.695494,27.74038,34.63412)" />
    <radialGradient
       cx="69.296463"
       cy="14.854369"
       r="3.5355339"
       fx="69.296463"
       fy="14.854369"
       id="radialGradient3829"
       xlink:href="#linearGradient3289"
       gradientUnits="userSpaceOnUse"
       gradientTransform="matrix(1,0,0,1.575,0,-8.541261)" />
    <radialGradient
       cx="69.296463"
       cy="14.854369"
       r="3.5355339"
       fx="69.296463"
       fy="14.854369"
       id="radialGradient3831"
       xlink:href="#linearGradient3289"
       gradientUnits="userSpaceOnUse"
       gradientTransform="matrix(1,0,0,1.575,0,-8.541261)" />
    <linearGradient
       x1="-87.031296"
       y1="-12.199734"
       x2="-88.677742"
       y2="-17.884775"
       id="linearGradient3837"
       xlink:href="#linearGradient3353"
       gradientUnits="userSpaceOnUse"
       gradientTransform="translate(106.4527,16.53554)" />
    <linearGradient
       x1="24"
       y1="17.245949"
       x2="23.433737"
       y2="8.0476589"
       id="linearGradient4230"
       xlink:href="#linearGradient3233"
       gradientUnits="userSpaceOnUse" />
    <linearGradient
       x1="11.003058"
       y1="33.489445"
       x2="30.452171"
       y2="33.489445"
       id="linearGradient4501"
       xlink:href="#linearGradient3338"
       gradientUnits="userSpaceOnUse"
       gradientTransform="matrix(1.004593,0,0,1,-7.058924,-3.082533)" />
    <linearGradient
       x1="24"
       y1="18.132908"
       x2="24"
       y2="8.0243998"
       id="linearGradient4518"
       xlink:href="#linearGradient1535"
       gradientUnits="userSpaceOnUse" />
    <linearGradient
       x1="24"
       y1="10.396756"
       x2="24"
       y2="20.118456"
       id="linearGradient4520"
       xlink:href="#linearGradient1523"
       gradientUnits="userSpaceOnUse" />
    <linearGradient
       gradientUnits="userSpaceOnUse"
       xlink:href="#linearGradient3233"
       id="linearGradient2609"
       y2="8.0476589"
       x2="23.433737"
       y1="17.245949"
       x1="24" />
    <linearGradient
       gradientUnits="userSpaceOnUse"
       xlink:href="#linearGradient3260"
       id="linearGradient3266"
       y2="5.5616603"
       x2="21.756248"
       y1="25.114395"
       x1="21.486856" />
    <linearGradient
       gradientUnits="userSpaceOnUse"
       xlink:href="#linearGradient3815"
       id="linearGradient3821"
       y2="20.118456"
       x2="25.573168"
       y1="11.170371"
       x1="25.698481" />
    <linearGradient
       gradientTransform="matrix(0.989992,0,0,1,0.912613,-2.021202)"
       gradientUnits="userSpaceOnUse"
       xlink:href="#linearGradient3805"
       id="linearGradient3811"
       y2="32.489445"
       x2="32.396713"
       y1="32.489445"
       x1="11.003058" />
    <linearGradient
       gradientUnits="userSpaceOnUse"
       xlink:href="#linearGradient3233"
       id="linearGradient2604"
       y2="8.0476589"
       x2="23.433737"
       y1="17.245949"
       x1="24" />
    <linearGradient
       gradientTransform="matrix(1.010754,0,0,1,-0.183017,-2.185003)"
       gradientUnits="userSpaceOnUse"
       xlink:href="#linearGradient3247"
       id="linearGradient2602"
       y2="29.91827"
       x2="34.244171"
       y1="17.695425"
       x1="34.244171" />
    <radialGradient
       gradientTransform="matrix(1,0,0,0.5,0,20)"
       gradientUnits="userSpaceOnUse"
       xlink:href="#linearGradient4126"
       id="radialGradient2600"
       fy="40"
       fx="23.857143"
       r="17.142857"
       cy="40"
       cx="23.857143" />
    <linearGradient
       gradientTransform="matrix(1.010754,0,0,1,-0.183017,-1.32786)"
       gradientUnits="userSpaceOnUse"
       xlink:href="#linearGradient6924"
       id="linearGradient2598"
       y2="31.75"
       x2="16.035715"
       y1="19.5"
       x1="16.07143" />
    <linearGradient
       gradientTransform="matrix(1.010754,0,0,0.992756,-0.183016,-3.832743)"
       gradientUnits="userSpaceOnUse"
       xlink:href="#linearGradient4176"
       id="linearGradient2596"
       y2="56.575912"
       x2="37.969398"
       y1="14.004482"
       x1="17.160095" />
    <linearGradient
       gradientTransform="matrix(1.010754,0,0,0.991346,-0.183016,-3.826537)"
       gradientUnits="userSpaceOnUse"
       xlink:href="#linearGradient4134"
       id="linearGradient2594"
       y2="26.71875"
       x2="38.826412"
       y1="26.71875"
       x1="9.3030529" />
    <radialGradient
       gradientTransform="matrix(1,0,0,0.5,0,20)"
       gradientUnits="userSpaceOnUse"
       xlink:href="#linearGradient4126"
       id="radialGradient2592"
       fy="40"
       fx="23.857143"
       r="17.142857"
       cy="40"
       cx="23.857143" />
    <linearGradient
       id="linearGradient2586">
      <stop
         id="stop2588"
         offset="0"
         style="stop-color:#000000;stop-opacity:1" />
      <stop
         id="stop2590"
         offset="1"
         style="stop-color:#000000;stop-opacity:0" />
    </linearGradient>
    <linearGradient
       id="linearGradient2576">
      <stop
         id="stop2578"
         offset="0"
         style="stop-color:#d6d7d5;stop-opacity:1" />
      <stop
         id="stop2580"
         offset="0.25"
         style="stop-color:#d1d2d0;stop-opacity:1" />
      <stop
         id="stop2582"
         offset="0.5"
         style="stop-color:#a5a6a3;stop-opacity:1" />
      <stop
         id="stop2584"
         offset="1"
         style="stop-color:#dddedc;stop-opacity:1" />
    </linearGradient>
    <linearGradient
       id="linearGradient2570">
      <stop
         id="stop2572"
         offset="0"
         style="stop-color:#ffffff;stop-opacity:1" />
      <stop
         id="stop2574"
         offset="1"
         style="stop-color:#ffffff;stop-opacity:0" />
    </linearGradient>
    <linearGradient
       id="linearGradient2564">
      <stop
         id="stop2566"
         offset="0"
         style="stop-color:#ffffff;stop-opacity:1" />
      <stop
         id="stop2568"
         offset="1"
         style="stop-color:#ffffff;stop-opacity:0" />
    </linearGradient>
    <linearGradient
       id="linearGradient2558">
      <stop
         id="stop2560"
         offset="0"
         style="stop-color:#eeeeec;stop-opacity:1" />
      <stop
         id="stop2562"
         offset="1"
         style="stop-color:#a3a398;stop-opacity:1" />
    </linearGradient>
    <linearGradient
       id="linearGradient2552">
      <stop
         id="stop2554"
         offset="0"
         style="stop-color:#f0f0f0;stop-opacity:1" />
      <stop
         id="stop2556"
         offset="1"
         style="stop-color:#f0f0f0;stop-opacity:0" />
    </linearGradient>
    <linearGradient
       id="linearGradient3805">
      <stop
         id="stop3807"
         offset="0"
         style="stop-color:#284e7f;stop-opacity:1" />
      <stop
         id="stop3813"
         offset="0.5"
         style="stop-color:#6694cf;stop-opacity:1" />
      <stop
         id="stop3809"
         offset="1"
         style="stop-color:#234570;stop-opacity:1" />
    </linearGradient>
    <linearGradient
       id="linearGradient3815">
      <stop
         id="stop3817"
         offset="0"
         style="stop-color:#204a87;stop-opacity:1" />
      <stop
         id="stop3819"
         offset="1"
         style="stop-color:#98b8e7;stop-opacity:1" />
    </linearGradient>
    <linearGradient
       id="linearGradient3260">
      <stop
         id="stop3262"
         offset="0"
         style="stop-color:#3465a4;stop-opacity:1" />
      <stop
         id="stop3264"
         offset="1"
         style="stop-color:#8fb1dc;stop-opacity:1" />
    </linearGradient>
    <inkscape:perspective
       id="perspective2539"
       inkscape:persp3d-origin="24 : 16 : 1"
       inkscape:vp_z="48 : 24 : 1"
       inkscape:vp_y="0 : 1000 : 0"
       inkscape:vp_x="0 : 24 : 1"
       sodipodi:type="inkscape:persp3d" />
    <radialGradient
       inkscape:collect="always"
       xlink:href="#linearGradient4126"
       id="radialGradient2639"
       gradientUnits="userSpaceOnUse"
       gradientTransform="matrix(1,0,0,0.5,0,20)"
       cx="23.857143"
       cy="40"
       fx="23.857143"
       fy="40"
       r="17.142857" />
    <linearGradient
       inkscape:collect="always"
       xlink:href="#linearGradient4134"
       id="linearGradient2641"
       gradientUnits="userSpaceOnUse"
       gradientTransform="matrix(1.010754,0,0,0.991346,-7.269358,-4.826537)"
       x1="9.3030529"
       y1="26.71875"
       x2="38.826412"
       y2="26.71875" />
    <linearGradient
       inkscape:collect="always"
       xlink:href="#linearGradient4176"
       id="linearGradient2643"
       gradientUnits="userSpaceOnUse"
       gradientTransform="matrix(1.010754,0,0,0.992756,-7.269358,-4.832743)"
       x1="17.160095"
       y1="14.004482"
       x2="37.969398"
       y2="56.575912" />
    <linearGradient
       inkscape:collect="always"
       xlink:href="#linearGradient3247"
       id="linearGradient2645"
       gradientUnits="userSpaceOnUse"
       gradientTransform="matrix(1.010754,0,0,1,-7.269359,-3.185003)"
       x1="34.244171"
       y1="17.695425"
       x2="34.244171"
       y2="29.91827" />
    <linearGradient
       inkscape:collect="always"
       xlink:href="#linearGradient3233"
       id="linearGradient2647"
       gradientUnits="userSpaceOnUse"
       x1="24"
       y1="17.245949"
       x2="23.433737"
       y2="8.0476589" />
    <radialGradient
       inkscape:collect="always"
       xlink:href="#linearGradient4126"
       id="radialGradient2649"
       gradientUnits="userSpaceOnUse"
       gradientTransform="matrix(1,0,0,0.5,0,20)"
       cx="23.857143"
       cy="40"
       fx="23.857143"
       fy="40"
       r="17.142857" />
    <linearGradient
       inkscape:collect="always"
       xlink:href="#linearGradient6924"
       id="linearGradient2651"
       gradientUnits="userSpaceOnUse"
       gradientTransform="matrix(1.010754,0,0,1,-7.269359,-2.32786)"
       x1="16.07143"
       y1="19.5"
       x2="16.035715"
       y2="31.75" />
    <linearGradient
       inkscape:collect="always"
       xlink:href="#linearGradient3233"
       id="linearGradient2653"
       gradientUnits="userSpaceOnUse"
       x1="24"
       y1="17.245949"
       x2="23.433737"
       y2="8.0476589" />
    <radialGradient
       inkscape:collect="always"
       xlink:href="#linearGradient4126"
       id="radialGradient2669"
       gradientUnits="userSpaceOnUse"
       gradientTransform="matrix(1,0,0,0.5,0,20)"
       cx="23.857143"
       cy="40"
       fx="23.857143"
       fy="40"
       r="17.142857" />
    <linearGradient
       inkscape:collect="always"
       xlink:href="#linearGradient4134"
       id="linearGradient2671"
       gradientUnits="userSpaceOnUse"
       gradientTransform="matrix(1.010754,0,0,0.991346,-7.269358,-4.826537)"
       x1="9.3030529"
       y1="26.71875"
       x2="38.826412"
       y2="26.71875" />
    <linearGradient
       inkscape:collect="always"
       xlink:href="#linearGradient3805"
       id="linearGradient2673"
       gradientUnits="userSpaceOnUse"
       gradientTransform="matrix(0.989992,0,0,1,0.912613,-2.021202)"
       x1="11.003058"
       y1="32.489445"
       x2="32.396713"
       y2="32.489445" />
    <linearGradient
       inkscape:collect="always"
       xlink:href="#linearGradient4176"
       id="linearGradient2675"
       gradientUnits="userSpaceOnUse"
       gradientTransform="matrix(1.010754,0,0,0.992756,-7.269358,-4.832743)"
       x1="17.160095"
       y1="14.004482"
       x2="37.969398"
       y2="56.575912" />
    <linearGradient
       inkscape:collect="always"
       xlink:href="#linearGradient3260"
       id="linearGradient2677"
       gradientUnits="userSpaceOnUse"
       x1="21.486856"
       y1="25.114395"
       x2="21.756248"
       y2="5.5616603" />
    <linearGradient
       inkscape:collect="always"
       xlink:href="#linearGradient3815"
       id="linearGradient2679"
       gradientUnits="userSpaceOnUse"
       x1="25.698481"
       y1="11.170371"
       x2="25.573168"
       y2="20.118456" />
    <linearGradient
       inkscape:collect="always"
       xlink:href="#linearGradient3247"
       id="linearGradient2681"
       gradientUnits="userSpaceOnUse"
       gradientTransform="matrix(1.010754,0,0,1,-7.269359,-3.185003)"
       x1="34.244171"
       y1="17.695425"
       x2="34.244171"
       y2="29.91827" />
    <linearGradient
       inkscape:collect="always"
       xlink:href="#linearGradient3233"
       id="linearGradient2683"
       gradientUnits="userSpaceOnUse"
       x1="24"
       y1="17.245949"
       x2="23.433737"
       y2="8.0476589" />
    <radialGradient
       inkscape:collect="always"
       xlink:href="#linearGradient4126"
       id="radialGradient2685"
       gradientUnits="userSpaceOnUse"
       gradientTransform="matrix(1,0,0,0.5,0,20)"
       cx="23.857143"
       cy="40"
       fx="23.857143"
       fy="40"
       r="17.142857" />
    <linearGradient
       inkscape:collect="always"
       xlink:href="#linearGradient6924"
       id="linearGradient2687"
       gradientUnits="userSpaceOnUse"
       gradientTransform="matrix(1.010754,0,0,1,-7.269359,-2.32786)"
       x1="16.07143"
       y1="19.5"
       x2="16.035715"
       y2="31.75" />
    <linearGradient
       inkscape:collect="always"
       xlink:href="#linearGradient3233"
       id="linearGradient2689"
       gradientUnits="userSpaceOnUse"
       x1="24"
       y1="17.245949"
       x2="23.433737"
       y2="8.0476589" />
    <linearGradient
       inkscape:collect="always"
       xlink:href="#linearGradient3233"
       id="linearGradient2693"
       gradientUnits="userSpaceOnUse"
       x1="24"
       y1="17.245949"
       x2="23.433737"
       y2="8.0476589"
       gradientTransform="matrix(0.274904,0,0,0.192106,62.761187,6.2759929)" />
    <linearGradient
       inkscape:collect="always"
       xlink:href="#linearGradient6924"
       id="linearGradient2696"
       gradientUnits="userSpaceOnUse"
       gradientTransform="matrix(1.010754,0,0,1,38.017598,1.2797589)"
       x1="16.07143"
       y1="19.5"
       x2="16.035715"
       y2="31.75" />
    <radialGradient
       inkscape:collect="always"
       xlink:href="#linearGradient4126"
       id="radialGradient2700"
       gradientUnits="userSpaceOnUse"
       gradientTransform="matrix(0.367338,0,0,0.181715,60.365687,4.0389019)"
       cx="23.857143"
       cy="40"
       fx="23.857143"
       fy="40"
       r="17.142857" />
    <linearGradient
       inkscape:collect="always"
       xlink:href="#linearGradient3233"
       id="linearGradient2703"
       gradientUnits="userSpaceOnUse"
       x1="24"
       y1="17.245949"
       x2="23.433737"
       y2="8.0476589"
       gradientTransform="matrix(1.048446,0,0,0.964345,44.199337,1.0672039)" />
    <linearGradient
       inkscape:collect="always"
       xlink:href="#linearGradient3247"
       id="linearGradient2706"
       gradientUnits="userSpaceOnUse"
       gradientTransform="matrix(1.010754,0,0,1,38.017598,0.4226159)"
       x1="34.244171"
       y1="17.695425"
       x2="34.244171"
       y2="29.91827" />
    <linearGradient
       inkscape:collect="always"
       xlink:href="#linearGradient3260"
       id="linearGradient2709"
       gradientUnits="userSpaceOnUse"
       x1="21.486856"
       y1="25.114395"
       x2="21.756248"
       y2="5.5616603"
       gradientTransform="matrix(0.972641,0,0,0.865862,-6.2483349,14.117981)" />
    <linearGradient
       inkscape:collect="always"
       xlink:href="#linearGradient3815"
       id="linearGradient2711"
       gradientUnits="userSpaceOnUse"
       x1="25.698481"
       y1="11.170371"
       x2="25.573168"
       y2="20.118456"
       gradientTransform="matrix(0.972641,0,0,0.865862,-6.2483349,14.117981)" />
    <linearGradient
       inkscape:collect="always"
       xlink:href="#linearGradient4176"
       id="linearGradient2714"
       gradientUnits="userSpaceOnUse"
       gradientTransform="matrix(1.010754,0,0,0.992756,38.017599,-1.2251241)"
       x1="17.160095"
       y1="14.004482"
       x2="37.969398"
       y2="56.575912" />
    <linearGradient
       inkscape:collect="always"
       xlink:href="#linearGradient3805"
       id="linearGradient2717"
       gradientUnits="userSpaceOnUse"
       gradientTransform="matrix(0.989992,0,0,1,-6.0786909,0.5429386)"
       x1="11.003058"
       y1="32.489445"
       x2="32.396713"
       y2="32.489445" />
    <linearGradient
       inkscape:collect="always"
       xlink:href="#linearGradient4134"
       id="linearGradient2720"
       gradientUnits="userSpaceOnUse"
       gradientTransform="matrix(1.010754,0,0,0.991346,38.017599,-1.2189181)"
       x1="9.3030529"
       y1="26.71875"
       x2="38.826412"
       y2="26.71875" />
    <radialGradient
       inkscape:collect="always"
       xlink:href="#linearGradient4126"
       id="radialGradient2723"
       gradientUnits="userSpaceOnUse"
       gradientTransform="matrix(1.05,0,0,0.581984,44.236956,13.351389)"
       cx="23.857143"
       cy="40"
       fx="23.857143"
       fy="40"
       r="17.142857" />
    <linearGradient
       inkscape:collect="always"
       xlink:href="#linearGradient3233"
       id="linearGradient2739"
       gradientUnits="userSpaceOnUse"
       x1="24"
       y1="17.245949"
       x2="23.433737"
       y2="8.0476589"
       gradientTransform="matrix(0.274904,0,0,0.192106,10.38789,1.668374)" />
    <linearGradient
       inkscape:collect="always"
       xlink:href="#linearGradient6924"
       id="linearGradient2742"
       gradientUnits="userSpaceOnUse"
       gradientTransform="matrix(1.010754,0,0,1,-7.269359,-2.32786)"
       x1="16.07143"
       y1="19.5"
       x2="16.035715"
       y2="31.75" />
    <radialGradient
       inkscape:collect="always"
       xlink:href="#linearGradient4126"
       id="radialGradient2746"
       gradientUnits="userSpaceOnUse"
       gradientTransform="matrix(0.367338,0,0,0.181715,7.992393,-0.568717)"
       cx="23.857143"
       cy="40"
       fx="23.857143"
       fy="40"
       r="17.142857" />
    <linearGradient
       inkscape:collect="always"
       xlink:href="#linearGradient3233"
       id="linearGradient2749"
       gradientUnits="userSpaceOnUse"
       x1="24"
       y1="17.245949"
       x2="23.433737"
       y2="8.0476589"
       gradientTransform="matrix(1.048446,0,0,0.964345,-8.173962,-3.540415)" />
    <linearGradient
       inkscape:collect="always"
       xlink:href="#linearGradient3247"
       id="linearGradient2752"
       gradientUnits="userSpaceOnUse"
       gradientTransform="matrix(1.010754,0,0,1,-7.269359,-3.185003)"
       x1="34.244171"
       y1="17.695425"
       x2="34.244171"
       y2="29.91827" />
    <linearGradient
       inkscape:collect="always"
       xlink:href="#linearGradient1535"
       id="linearGradient2755"
       gradientUnits="userSpaceOnUse"
       x1="24"
       y1="18.132908"
       x2="24"
       y2="8.0243998"
       gradientTransform="matrix(0.972634,0,0,0.914029,-6.348509,13.66547)" />
    <linearGradient
       inkscape:collect="always"
       xlink:href="#linearGradient1523"
       id="linearGradient2757"
       gradientUnits="userSpaceOnUse"
       x1="24"
       y1="10.396756"
       x2="24"
       y2="20.118456"
       gradientTransform="matrix(0.972634,0,0,0.914029,-6.348509,13.66547)" />
    <linearGradient
       inkscape:collect="always"
       xlink:href="#linearGradient3338"
       id="linearGradient2760"
       gradientUnits="userSpaceOnUse"
       gradientTransform="matrix(1.004593,0,0,1,-7.058924,-3.082533)"
       x1="11.003058"
       y1="33.489445"
       x2="30.452171"
       y2="33.489445" />
    <linearGradient
       inkscape:collect="always"
       xlink:href="#linearGradient4176"
       id="linearGradient2763"
       gradientUnits="userSpaceOnUse"
       gradientTransform="matrix(1.010754,0,0,0.992756,-7.269358,-4.832743)"
       x1="17.160095"
       y1="14.004482"
       x2="37.969398"
       y2="56.575912" />
    <linearGradient
       inkscape:collect="always"
       xlink:href="#linearGradient3233"
       id="linearGradient2766"
       gradientUnits="userSpaceOnUse"
       x1="24"
       y1="17.245949"
       x2="23.433737"
       y2="8.0476589"
       gradientTransform="matrix(1.048446,0,0,0.971388,-7.969759,19.43377)" />
    <linearGradient
       inkscape:collect="always"
       xlink:href="#linearGradient4134"
       id="linearGradient2769"
       gradientUnits="userSpaceOnUse"
       gradientTransform="matrix(1.010754,0,0,0.991346,-7.269358,-4.826537)"
       x1="9.3030529"
       y1="26.71875"
       x2="38.826412"
       y2="26.71875" />
    <linearGradient
       inkscape:collect="always"
       xlink:href="#linearGradient3341"
       id="linearGradient2773"
       gradientUnits="userSpaceOnUse"
       gradientTransform="translate(36.7012,10.5)"
       x1="-27.27899"
       y1="-5.7469382"
       x2="-28.46833"
       y2="-11.99264" />
    <radialGradient
       inkscape:collect="always"
       xlink:href="#linearGradient4126"
       id="radialGradient2776"
       gradientUnits="userSpaceOnUse"
       gradientTransform="matrix(1.058752,0,0,0.5756295,-7.591514,8.56327)"
       cx="23.857143"
       cy="40"
       fx="23.857143"
       fy="40"
       r="17.142857" />
    <radialGradient
       inkscape:collect="always"
       xlink:href="#linearGradient3323"
       id="radialGradient2779"
       gradientUnits="userSpaceOnUse"
       gradientTransform="matrix(0.7,0,0,0.595745,17.8,14.74468)"
       cx="22.5"
       cy="34"
       fx="22.5"
       fy="34"
       r="23.5" />
    <linearGradient
       inkscape:collect="always"
       xlink:href="#linearGradient3353"
       id="linearGradient2782"
       gradientUnits="userSpaceOnUse"
       gradientTransform="translate(106.4527,16.53554)"
       x1="-87.031296"
       y1="-12.199734"
       x2="-88.677742"
       y2="-17.884775" />
  </defs>
  <g
     id="g2784">
    <path
       d="M 35.20123,24 C 33.70123,17.25 40.684722,15.592611 38.70123,10.75 C 34.282764,-0.037494208 17.45123,15.25 12.70123,14.75 C 7.95123,14.25 6.84768,-1.785534 6.84768,-1.785534"
       style="fill:none;fill-opacity:1;fill-rule:nonzero;stroke:url(#linearGradient2782);stroke-width:6;stroke-linecap:butt;stroke-linejoin:miter;marker:none;marker-start:none;marker-mid:none;marker-end:none;stroke-miterlimit:10;stroke-dasharray:none;stroke-dashoffset:0;stroke-opacity:1;visibility:visible;display:block;overflow:visible"
       id="path3835" />
    <path
       d="M 50,35 C 50,42.731986 42.635084,49 33.55,49 C 24.464916,49 17.1,42.731986 17.1,35 C 17.1,27.268014 24.464916,21 33.55,21 C 42.635084,21 50,27.268014 50,35 L 50,35 z"
       style="opacity:0.58241763;fill:url(#radialGradient2779);fill-opacity:1;fill-rule:nonzero;stroke:none;stroke-width:0.99999946;stroke-linecap:butt;stroke-linejoin:miter;marker:none;marker-start:none;marker-mid:none;marker-end:none;stroke-miterlimit:10;stroke-dasharray:none;stroke-dashoffset:0;stroke-opacity:1;visibility:visible;display:block;overflow:visible"
       id="path3321" />
    <path
       d="M 35.817318,31.58845 C 35.819484,37.039192 27.692802,41.458516 17.667284,41.458516 C 7.6417664,41.458516 -0.48491521,37.039192 -0.48274942,31.58845 C -0.48491521,26.137708 7.6417664,21.718384 17.667284,21.718384 C 27.692802,21.718384 35.819484,26.137708 35.817318,31.58845 L 35.817318,31.58845 z"
       style="fill:url(#radialGradient2776);fill-opacity:1;fill-rule:nonzero;stroke:none;stroke-width:1;stroke-linecap:butt;stroke-linejoin:miter;marker:none;marker-start:none;marker-mid:none;marker-end:none;stroke-miterlimit:10;stroke-dasharray:none;stroke-dashoffset:0;stroke-opacity:1;visibility:visible;display:block;overflow:visible"
       id="path3366" />
    <path
       d="M 35.20123,24 C 33.70123,17.25 40.684722,15.592611 38.70123,10.75 C 34.282764,-0.037494208 17.45123,15.25 12.70123,14.75 C 7.95123,14.25 6.84768,-1.785534 6.84768,-1.785534"
       style="fill:none;fill-opacity:1;fill-rule:nonzero;stroke:url(#linearGradient2773);stroke-width:4;stroke-linecap:butt;stroke-linejoin:miter;marker:none;marker-start:none;marker-mid:none;marker-end:none;stroke-miterlimit:10;stroke-dasharray:none;stroke-dashoffset:0;stroke-opacity:1;visibility:visible;display:block;overflow:visible"
       id="path3339" />
    <path
       d="M 33.829323,25.323223 C 32.41511,16.130835 42.523381,13.496137 36.480967,7.822331 C 30.34962,2.0650171 15.332069,16.672654 10.671569,14.009515 C 6.9592589,11.888195 5.7218254,-0.83972765 5.7218254,-0.83972765"
       style="opacity:0.52197804;fill:none;fill-opacity:1;fill-rule:nonzero;stroke:#ffffff;stroke-width:1;stroke-linecap:butt;stroke-linejoin:miter;marker:none;marker-start:none;marker-mid:none;marker-end:none;stroke-miterlimit:10;stroke-dasharray:none;stroke-dashoffset:0;stroke-opacity:1;visibility:visible;display:block;overflow:visible"
       id="path3361" />
    <path
       d="M 16.925566,4.0026374 C 8.981619,4.0026374 2.5223224,6.7808855 2.5223214,10.198551 C 2.5223214,10.443795 2.5223214,32.868017 2.5223214,33.123427 C 2.5223214,36.541093 8.981618,39.31934 16.925566,39.31934 C 24.869514,39.31934 31.586013,36.541092 31.586011,33.123427 C 31.586011,32.921132 31.586011,10.400846 31.586011,10.198551 C 31.586011,6.7808845 24.869513,4.0026374 16.925566,4.0026374 z"
       style="fill:url(#linearGradient2769);fill-opacity:1;fill-rule:nonzero;stroke:#767973;stroke-width:1;stroke-linecap:butt;stroke-linejoin:miter;marker:none;marker-start:none;marker-mid:none;marker-end:none;stroke-miterlimit:10;stroke-dasharray:none;stroke-dashoffset:0;stroke-opacity:1;visibility:visible;display:block;overflow:visible"
       id="path3068" />
    <path
       d="M 30.672964,33.102586 C 30.672964,36.053241 24.637755,38.44522 17.192945,38.44522 C 9.7481354,38.44522 3.7129259,36.053241 3.7129259,33.102586 C 3.7129259,30.151931 9.7481354,27.759952 17.192945,27.759952 C 24.637755,27.759952 30.672964,30.151931 30.672964,33.102586 L 30.672964,33.102586 z"
       style="opacity:0.23626374;fill:#d3d7cf;fill-opacity:1;fill-rule:nonzero;stroke:url(#linearGradient2766);stroke-width:0.99999934;stroke-linecap:butt;stroke-linejoin:miter;marker:none;marker-start:none;marker-mid:none;marker-end:none;stroke-miterlimit:10;stroke-dasharray:none;stroke-dashoffset:0;stroke-opacity:1;visibility:visible;display:block;overflow:visible"
       id="path3241" />
    <path
       d="M 16.934282,4.7826643 C 9.5277209,4.7826643 3.505378,7.376656 3.505377,10.567657 C 3.505377,10.796637 3.505377,32.295174 3.505377,32.533645 C 3.505377,35.724648 9.5277198,38.318638 16.934282,38.318638 C 24.340842,38.318638 30.602988,35.724647 30.602986,32.533645 C 30.602986,32.344768 30.602986,10.756537 30.602986,10.567657 C 30.602986,7.376655 24.340841,4.7826643 16.934282,4.7826643 z"
       style="opacity:0.5443038;fill:none;fill-opacity:1;fill-rule:nonzero;stroke:url(#linearGradient2763);stroke-width:1.00000012;stroke-linecap:butt;stroke-linejoin:miter;marker:none;marker-start:none;marker-mid:none;marker-end:none;stroke-miterlimit:10;stroke-dasharray:none;stroke-dashoffset:0;stroke-opacity:1;visibility:visible;display:block;overflow:visible"
       id="path4174" />
    <path
       d="M 28.976705,8.500013 C 27.855663,7.514903 26.907756,7.214975 25.913658,6.7322461 L 26.219962,25.420069 L 28.976705,28.652556 L 28.976705,8.500013 z"
       style="fill:url(#linearGradient2752);fill-opacity:1;fill-rule:nonzero;stroke:none;stroke-width:0.99999946;stroke-linecap:butt;stroke-linejoin:miter;marker:none;marker-start:none;marker-mid:none;marker-end:none;stroke-miterlimit:10;stroke-dasharray:none;stroke-dashoffset:0;stroke-opacity:1;visibility:visible;display:block;overflow:visible"
       id="path3245" />
    <path
       d="M 30.468761,10.029296 C 30.468761,12.958558 24.433552,15.333194 16.988742,15.333194 C 9.5439324,15.333194 3.5087229,12.958558 3.5087229,10.029296 C 3.5087229,7.1000347 9.5439324,4.7253986 16.988742,4.7253986 C 24.433552,4.7253986 30.468761,7.1000347 30.468761,10.029296 L 30.468761,10.029296 z"
       style="opacity:0.467033;fill:#f0f0f0;fill-opacity:1;fill-rule:nonzero;stroke:url(#linearGradient2749);stroke-width:0.9999994;stroke-linecap:butt;stroke-linejoin:miter;marker:none;marker-start:none;marker-mid:none;marker-end:none;stroke-miterlimit:10;stroke-dasharray:none;stroke-dashoffset:0;stroke-opacity:1;visibility:visible;display:block;overflow:visible"
       id="path3364" />
    <path
       d="M 23.053251,6.699883 C 23.054003,8.4205758 20.23442,9.8156702 16.756028,9.8156702 C 13.277637,9.8156702 10.458054,8.4205758 10.458806,6.699883 C 10.458054,4.9791902 13.277637,3.5840958 16.756028,3.5840958 C 20.23442,3.5840958 23.054003,4.9791902 23.053251,6.699883 L 23.053251,6.699883 z"
       style="opacity:0.30769234;fill:url(#radialGradient2746);fill-opacity:1;fill-rule:nonzero;stroke:none;stroke-width:1;stroke-linecap:butt;stroke-linejoin:miter;marker:none;marker-start:none;marker-mid:none;marker-end:none;stroke-miterlimit:10;stroke-dasharray:none;stroke-dashoffset:0;stroke-opacity:1;visibility:visible;display:block;overflow:visible"
       id="path6944" />
    <path
       d="M 17.079287,2.5 C 15.054955,2.5 12.398199,3.214153 12.398199,4.092669 C 12.398199,4.155709 12.398199,6.656674 12.398199,6.722328 C 12.398199,7.600844 15.054955,8.314997 17.079287,8.314997 C 19.10362,8.314997 21.537133,7.600844 21.537132,6.722328 C 21.537132,6.670328 21.537132,4.144669 21.537132,4.092669 C 21.537132,3.214152 19.10362,2.5 17.079287,2.5 z"
       style="fill:#9d9e9b;fill-opacity:1;fill-rule:nonzero;stroke:#7d7f7a;stroke-width:0.99999994;stroke-linecap:butt;stroke-linejoin:miter;marker:none;marker-start:none;marker-mid:none;marker-end:none;stroke-miterlimit:10;stroke-dasharray:none;stroke-dashoffset:0;stroke-opacity:1;visibility:visible;display:block;overflow:visible"
       id="path3362" />
    <path
       d="M 29.600432,26.301896 C 29.600432,28.932009 24.001582,31.064137 17.095049,31.064137 C 10.188516,31.064137 4.5896661,28.932009 4.5896661,26.301896 C 4.5896661,23.671783 10.188516,21.539655 17.095049,21.539655 C 24.001582,21.539655 29.600432,23.671783 29.600432,26.301896 L 29.600432,26.301896 z"
       style="fill:url(#linearGradient2709);fill-opacity:1;fill-rule:nonzero;stroke:url(#linearGradient2711);stroke-width:0.99999982;stroke-linecap:butt;stroke-linejoin:miter;marker:none;marker-start:none;marker-mid:none;marker-end:none;stroke-miterlimit:10;stroke-dasharray:none;stroke-dashoffset:0;stroke-opacity:1;visibility:visible;display:block;overflow:visible"
       id="path3277" />
    <path
       d="M 6.6646107,14.743568 L 7.0255934,31.529283 L 11.646184,32.814997 L 11.501791,16.100711 C 11.501791,16.100711 13.461486,16.012323 16.854733,15.798037 C 10.287485,15.748054 5.9977868,14.219867 3.6323481,11.957854 C 5.0644847,14.05003 6.6646107,14.743568 6.6646107,14.743568 z"
       style="opacity:0.58241763;fill:url(#linearGradient2742);fill-opacity:1;fill-rule:nonzero;stroke:none;stroke-width:1;stroke-linecap:butt;stroke-linejoin:miter;marker:none;marker-start:none;marker-mid:none;marker-end:none;stroke-miterlimit:4;stroke-dasharray:none;stroke-dashoffset:0;stroke-opacity:1;visibility:visible;display:block;overflow:visible"
       id="path6922" />
    <path
       d="M 20.520066,4.3715797 C 20.520066,4.9551144 18.937625,5.4281627 16.985586,5.4281627 C 15.033547,5.4281627 13.451106,4.9551144 13.451106,4.3715797 C 13.451106,3.7880451 15.033547,3.3149967 16.985586,3.3149967 C 18.937625,3.3149967 20.520066,3.7880451 20.520066,4.3715797 L 20.520066,4.3715797 z"
       style="fill:#d3d7cf;fill-opacity:1;fill-rule:nonzero;stroke:url(#linearGradient2739);stroke-width:1.00000024;stroke-linecap:butt;stroke-linejoin:miter;marker:none;marker-start:none;marker-mid:none;marker-end:none;stroke-miterlimit:10;stroke-dasharray:none;stroke-dashoffset:0;stroke-opacity:1;visibility:visible;display:block;overflow:visible"
       id="path6940" />
    <path
       sodipodi:nodetypes="cssssssc"
       d="M 16.464558,21.43918 C 9.8551321,21.573906 4.5098992,23.805205 4.5098992,26.49348 C 4.5098992,26.812171 4.5098992,32.031687 4.5098992,32.34821 C 4.5098992,35.123203 10.289578,37.363377 17.197761,37.363379 C 24.105943,37.363379 29.641034,35.018855 29.641035,32.243862 C 29.641035,31.927339 29.601905,26.786084 29.601905,26.467393 C 29.601905,23.692399 23.988552,21.439181 17.08037,21.43918 C 16.86449,21.43918 16.677764,21.434834 16.464558,21.43918 z"
       style="opacity:0.79120878;fill:url(#linearGradient2717);fill-opacity:1;fill-rule:nonzero;stroke:#204a87;stroke-width:0.99621499;stroke-linecap:butt;stroke-linejoin:miter;marker:none;marker-start:none;marker-mid:none;marker-end:none;stroke-miterlimit:10;stroke-dasharray:none;stroke-dashoffset:0;stroke-opacity:1;visibility:visible;display:block;overflow:visible"
       id="path3275" />
    <g
       transform="translate(-45.004,-5.936464)"
       id="g3814">
      <path
         d="M 79.191286,28.437593 C 72.690514,28.59762 67.504624,33.772305 67.504624,40.1711 L 67.504624,40.451497 C 67.502838,40.460078 67.505539,40.485767 67.504624,40.494634 C 67.504392,40.499132 67.504624,40.511648 67.504624,40.516203 L 67.504624,49.186919 C 67.500718,49.355538 67.662376,49.5117 67.796572,49.504341 C 67.796572,49.504341 90.655668,49.540472 90.655668,49.540472 C 91.053415,49.518375 91.506406,49.303728 91.517454,48.839689 C 91.517454,48.839689 91.495357,40.516203 91.495357,40.516203 C 91.495357,40.511648 91.495588,40.499132 91.495357,40.494634 C 91.494442,40.485767 91.497142,40.460078 91.495357,40.451497 L 91.495357,40.1711 C 91.495357,33.670737 86.145424,28.437593 79.499991,28.437593 C 79.396156,28.437593 79.294473,28.435053 79.191286,28.437593 z"
         style="fill:url(#radialGradient3825);fill-opacity:1;fill-rule:nonzero;stroke:#848781;stroke-width:0.99999952;stroke-linecap:butt;stroke-linejoin:miter;marker:none;marker-start:none;marker-mid:none;marker-end:none;stroke-miterlimit:10;stroke-dasharray:none;stroke-dashoffset:0;stroke-opacity:1;visibility:visible;display:block;overflow:visible"
         id="rect2393" />
      <rect
         width="20.013201"
         height="6.9925261"
         rx="0.38128209"
         ry="0.38128221"
         x="69.482597"
         y="40.527031"
         style="fill:url(#linearGradient3827);fill-opacity:1;fill-rule:nonzero;stroke:#888a85;stroke-width:0.99999958;stroke-linecap:butt;stroke-linejoin:miter;marker:none;marker-start:none;marker-mid:none;marker-end:none;stroke-miterlimit:10;stroke-dasharray:none;stroke-dashoffset:0;stroke-opacity:1;visibility:visible;display:block;overflow:visible"
         id="rect2391" />
      <path
         d="M 72.831997,14.854369 C 72.831997,17.929748 71.249085,20.422835 69.296463,20.422835 C 67.343841,20.422835 65.760929,17.929748 65.760929,14.854369 C 65.760929,11.77899 67.343841,9.2859031 69.296463,9.2859031 C 71.249085,9.2859031 72.831997,11.77899 72.831997,14.854369 L 72.831997,14.854369 z"
         transform="matrix(0.7,0,0,0.7,37.13251,35.09136)"
         style="opacity:0.48901098;fill:url(#radialGradient3829);fill-opacity:1;fill-rule:nonzero;stroke:none;stroke-width:0.99999946;stroke-linecap:butt;stroke-linejoin:miter;marker:none;marker-start:none;marker-mid:none;marker-end:none;stroke-miterlimit:10;stroke-dasharray:none;stroke-dashoffset:0;stroke-opacity:1;visibility:visible;display:block;overflow:visible"
         id="path3297" />
      <path
         d="M 72.831997,14.854369 C 72.831997,17.929748 71.249085,20.422835 69.296463,20.422835 C 67.343841,20.422835 65.760929,17.929748 65.760929,14.854369 C 65.760929,11.77899 67.343841,9.2859031 69.296463,9.2859031 C 71.249085,9.2859031 72.831997,11.77899 72.831997,14.854369 L 72.831997,14.854369 z"
         transform="matrix(0.7,0,0,0.7,25.15124,35.09136)"
         style="opacity:0.48901098;fill:url(#radialGradient3831);fill-opacity:1;fill-rule:nonzero;stroke:none;stroke-width:0.99999946;stroke-linecap:butt;stroke-linejoin:miter;marker:none;marker-start:none;marker-mid:none;marker-end:none;stroke-miterlimit:10;stroke-dasharray:none;stroke-dashoffset:0;stroke-opacity:1;visibility:visible;display:block;overflow:visible"
         id="path3287" />
      <path
         d="M 79.311448,29.482533 C 73.404864,29.626641 68.560395,34.286528 68.560395,40.048745 C 68.560395,40.048745 68.516201,48.487142 68.516201,48.491244 C 68.516201,48.491244 90.512993,48.496419 90.512993,48.496419 L 90.490896,40.048745 C 90.490896,34.195064 85.62996,29.482533 79.591936,29.482533 C 79.497592,29.482533 79.405205,29.480246 79.311448,29.482533 z"
         style="opacity:0.58241763;fill:none;fill-opacity:1;fill-rule:nonzero;stroke:#ffffff;stroke-width:1;stroke-linecap:butt;stroke-linejoin:miter;marker:none;marker-start:none;marker-mid:none;marker-end:none;stroke-miterlimit:10;stroke-dasharray:none;stroke-dashoffset:0;stroke-opacity:1;visibility:visible;display:block;overflow:visible"
         id="path3319" />
      <rect
         width="2.0417981"
         height="9.9702358"
         rx="0.38128215"
         ry="0.38128218"
         x="84.47113"
         y="42.462387"
         style="fill:#babdb6;fill-opacity:1;fill-rule:nonzero;stroke:#888a85;stroke-width:0.9999994;stroke-linecap:butt;stroke-linejoin:miter;marker:none;marker-start:none;marker-mid:none;marker-end:none;stroke-miterlimit:10;stroke-dasharray:none;stroke-dashoffset:0;stroke-opacity:1;visibility:visible;display:block;overflow:visible"
         id="rect3283" />
      <rect
         width="1"
         height="6"
         x="85"
         y="46"
         style="opacity:0.68131869;fill:#ffffff;fill-opacity:1;fill-rule:nonzero;stroke:none;stroke-width:1;stroke-linecap:butt;stroke-linejoin:miter;marker:none;marker-start:none;marker-mid:none;marker-end:none;stroke-miterlimit:10;stroke-dasharray:none;stroke-dashoffset:0;stroke-opacity:1;visibility:visible;display:block;overflow:visible"
         id="rect3808" />
      <rect
         width="2.0417981"
         height="9.9702358"
         rx="0.38128215"
         ry="0.38128218"
         x="72.5"
         y="42.462387"
         style="fill:#babdb6;fill-opacity:1;fill-rule:nonzero;stroke:#888a85;stroke-width:0.9999994;stroke-linecap:butt;stroke-linejoin:miter;marker:none;marker-start:none;marker-mid:none;marker-end:none;stroke-miterlimit:10;stroke-dasharray:none;stroke-dashoffset:0;stroke-opacity:1;visibility:visible;display:block;overflow:visible"
         id="rect3810" />
      <rect
         width="1"
         height="6"
         x="73.02887"
         y="46"
         style="opacity:0.68131869;fill:#ffffff;fill-opacity:1;fill-rule:nonzero;stroke:none;stroke-width:1;stroke-linecap:butt;stroke-linejoin:miter;marker:none;marker-start:none;marker-mid:none;marker-end:none;stroke-miterlimit:10;stroke-dasharray:none;stroke-dashoffset:0;stroke-opacity:1;visibility:visible;display:block;overflow:visible"
         id="rect3812" />
    </g>
    <path
       d="M 18.009886,18.575938 L 12.470041,24.937721 L 16.45867,24.937721 L 14.395922,30.833073 L 20.447301,23.359244 L 16.225022,23.359244 L 18.009886,18.575938 z"
       style="fill:#ffffff;fill-opacity:1;fill-rule:nonzero;stroke:#edd400;stroke-width:0.99999994;stroke-linecap:butt;stroke-linejoin:miter;marker:none;marker-start:none;marker-mid:none;marker-end:none;stroke-miterlimit:10;stroke-dasharray:none;stroke-dashoffset:0;stroke-opacity:1;visibility:visible;display:block;overflow:visible"
       id="path3914" />
    <path
       d="M 18.009884,18.575937 L 12.470041,24.937721 L 16.458672,24.937721 L 14.395923,30.833071 L 20.447302,23.359244 L 16.225023,23.359244 L 18.009884,18.575937 z"
       style="fill:#ffffff;fill-opacity:1;fill-rule:nonzero;stroke:none;stroke-width:6;stroke-linecap:butt;stroke-linejoin:miter;marker:none;marker-start:none;marker-mid:none;marker-end:none;stroke-miterlimit:10;stroke-dasharray:none;stroke-dashoffset:0;stroke-opacity:1;visibility:visible;display:block;overflow:visible"
       id="path3912" />
    <g
       transform="translate(-53.99282,-31.64138)"
       id="g4438" />
    <g
       id="layer2" />
    <g
       transform="translate(-8.705863,-28.033761)"
       id="g2635" />
    <g
       transform="translate(45.286957,3.6076189)"
       id="g2637" />
  </g>
</svg>
