/* XPM */
static char * minimize_focused_normal = {
"18 14 4 1", 
".	c None", 
"=	c None", 
"@	c None", 
"+	c #202020", 
"..................", 
"..................", 
"==================", 
"==================", 
"==================", 
"==================", 
"==================", 
"==================", 
"==================", 
"===@@@@@@@@@@@@===", 
"===@++++++++++@===", 
"===@++++++++++@===", 
"===@@@@@@@@@@@@===", 
"==================", 
};