/* XPM */
static char * close_focused_pressed = {
"18 14 4 1", 
".	c None", 
"=	c None", 
"@	c None", 
"+	c #D92626", 
"..................", 
"..................", 
"==================", 
"=====@@====@@=====", 
"====@++@==@++@====", 
"====@+++@@+++@====", 
"=====@++++++@=====", 
"======@++++@======", 
"======@++++@======", 
"=====@++++++@=====", 
"====@+++@@+++@====", 
"====@++@==@++@====", 
"=====@@====@@=====", 
"==================", 
};