/* XPM */
static char * unmaximize_unfocused = {
"18 14 4 1", 
".	c None", 
"=	c None", 
"@	c None", 
"+	c #606060", 
"..................", 
"..................", 
"==================", 
"==================", 
"====@@@@@@@@@@====", 
"====@++++++++@====", 
"====@++++++++@====", 
"====@+@@@@@@+@====", 
"====@+@====@+@====", 
"====@+@====@+@====", 
"====@+@@@@@@+@====", 
"====@++++++++@====", 
"====@@@@@@@@@@====", 
"==================", 
};