/* XPM */
static char * title_5_inactive = {
"11 14 4 1", 
"+	c #000000 s inactive_shadow_2", 
"%	c #000000 s inactive_color_2", 
"#	c #000000 s inactive_color_2", 
"=	c #000000 s inactive_color_2", 
"+++++++++++", 
"%%%%%%%%%%%", 
"###########", 
"#=========#", 
"#=========#", 
"#=========#", 
"#=========#", 
"#=========#", 
"#=========#", 
"#=========#", 
"#=========#", 
"#=========#", 
"#=========#", 
"#=========#", 
};