<?xml version="1.0" encoding="utf-8"?>
<svg version="1.1" xmlns="http://www.w3.org/2000/svg" xmlns:xlink="http://www.w3.org/1999/xlink" x="0px" y="0px"
	 viewBox="0 0 320 512" style="enable-background:new 0 0 320 512;" xml:space="preserve">
<style type="text/css">
	.st0{fill:#5D2750;}
</style>
<g id="Calque_2">
</g>
<g id="Calque_1" focusable="false">
	<path class="st0" d="M96.2,234.6h127.5c8.8,0,13.2,10.7,7,16.9L167,315.2c-3.9,3.9-10.2,3.9-14,0l-63.7-63.8
		C83,245.2,87.4,234.6,96.2,234.6z"/>
</g>
</svg>
