1
2
3
4
5
6
7
8
9
10
10
9
8
7
6
5
4
3
2
1
2
1
3
4
5
6
7
8
9
10
1
2
3
4
5
6
7
8
10
9
1
2
3
4
6
5
7
8
9
10
-2
4
4
5
6
7
8
9
10
24
4
-2
4
5
6
7
8
9
10
24
-2
4
4
5
6
7
8
9
24
10
-2
4
4
5
7
6
8
9
10
24
1
1
1
1
1
1
1
1
1
1


