<?xml version="1.0" encoding="UTF-8" standalone="no"?>
<svg
   xmlns:dc="http://purl.org/dc/elements/1.1/"
   xmlns:cc="http://creativecommons.org/ns#"
   xmlns:rdf="http://www.w3.org/1999/02/22-rdf-syntax-ns#"
   xmlns:svg="http://www.w3.org/2000/svg"
   xmlns="http://www.w3.org/2000/svg"
   xmlns:xlink="http://www.w3.org/1999/xlink"
   xmlns:sodipodi="http://sodipodi.sourceforge.net/DTD/sodipodi-0.dtd"
   xmlns:inkscape="http://www.inkscape.org/namespaces/inkscape"
   height="526"
   width="1920"
   version="1.1"
   viewBox="0 0 507.99999 139.17084"
   id="svg115"
   sodipodi:docname="banner-16-cat.svg"
   inkscape:version="0.92.5 (0.92.5+68)"
   inkscape:export-filename="/home/cibersheep/Ubuntu_Touch_Projects/design/OTA16/banner-16-cat.png"
   inkscape:export-xdpi="200.03041"
   inkscape:export-ydpi="200.03041">
  <metadata
     id="metadata119">
    <rdf:RDF>
      <cc:Work
         rdf:about="">
        <dc:format>image/svg+xml</dc:format>
        <dc:type
           rdf:resource="http://purl.org/dc/dcmitype/StillImage" />
        <dc:title></dc:title>
      </cc:Work>
    </rdf:RDF>
  </metadata>
  <sodipodi:namedview
     pagecolor="#ffffff"
     bordercolor="#666666"
     borderopacity="1"
     objecttolerance="10"
     gridtolerance="10"
     guidetolerance="10"
     inkscape:pageopacity="0"
     inkscape:pageshadow="2"
     inkscape:window-width="1859"
     inkscape:window-height="1056"
     id="namedview117"
     showgrid="false"
     inkscape:zoom="0.36261063"
     inkscape:cx="960.83772"
     inkscape:cy="422.76233"
     inkscape:window-x="61"
     inkscape:window-y="24"
     inkscape:window-maximized="1"
     inkscape:current-layer="svg115" />
  <defs
     id="defs5">
    <linearGradient
       inkscape:collect="always"
       id="linearGradient5008">
      <stop
         style="stop-color:#20e964;stop-opacity:1"
         offset="0"
         id="stop5004" />
      <stop
         style="stop-color:#31ccc2;stop-opacity:1"
         offset="1"
         id="stop5006" />
    </linearGradient>
    <filter
       id="a"
       style="color-interpolation-filters:sRGB"
       height="1.168"
       width="1.194"
       y="-.08395"
       x="-.09699">
      <feGaussianBlur
         stdDeviation="12.947969"
         id="feGaussianBlur2" />
    </filter>
    <linearGradient
       inkscape:collect="always"
       xlink:href="#linearGradient5008"
       id="linearGradient5010"
       x1="-0.55000001"
       y1="-0.2146"
       x2="508.55002"
       y2="139.38541"
       gradientUnits="userSpaceOnUse"
       gradientTransform="translate(5.1969422e-7,1.4623802e-5)" />
  </defs>
  <rect
     style="color:#000000;opacity:0.575;isolation:auto;mix-blend-mode:normal;solid-color:#000000;fill:url(#linearGradient5010);fill-opacity:1;paint-order:markers fill stroke;color-rendering:auto;image-rendering:auto;shape-rendering:auto"
     height="139.60001"
     width="509.10001"
     y="-0.21458541"
     x="-0.54999948"
     id="rect9" />
  <path
     style="color:#000000;opacity:0.15;isolation:auto;mix-blend-mode:normal;solid-color:#000000;fill:#e5e5e5;stroke-width:1.99844885;paint-order:markers fill stroke;color-rendering:auto;image-rendering:auto;shape-rendering:auto"
     d="M 456.59627,-24.176462 996.25377,191.28681 438.70098,149.53269 Z"
     id="rect11"
     inkscape:connector-curvature="0"
     sodipodi:nodetypes="cccc" />
  <path
     style="opacity:0.05;fill:#000000;fill-opacity:1;fill-rule:evenodd;stroke:none;stroke-width:0.26458335px;stroke-linecap:butt;stroke-linejoin:miter;stroke-opacity:1"
     d="M -55.131716,1.270674 107.95393,220.99519 -33.61993,280.9167 Z"
     id="path5014"
     inkscape:connector-curvature="0"
     sodipodi:nodetypes="cccc" />
  <rect
     style="color:#000000;clip-rule:nonzero;display:inline;overflow:visible;visibility:visible;opacity:1;isolation:auto;mix-blend-mode:normal;color-interpolation:sRGB;color-interpolation-filters:linearRGB;solid-color:#000000;solid-opacity:1;vector-effect:none;fill:#003c19;fill-opacity:1;fill-rule:nonzero;stroke:none;stroke-width:2.5757072;stroke-linecap:round;stroke-linejoin:round;stroke-miterlimit:1;stroke-dasharray:none;stroke-dashoffset:0;stroke-opacity:1;marker:none;paint-order:stroke fill markers;color-rendering:auto;image-rendering:auto;shape-rendering:auto;text-rendering:auto;enable-background:accumulate"
     id="rect4766"
     width="19.749012"
     height="19.749012"
     x="-203.00948"
     y="123.73302"
     ry="1.9425249"
     transform="rotate(-135)" />
  <path
     style="color:#000000;clip-rule:nonzero;display:inline;overflow:visible;visibility:visible;opacity:1;isolation:auto;mix-blend-mode:normal;color-interpolation:sRGB;color-interpolation-filters:linearRGB;solid-color:#000000;solid-opacity:1;vector-effect:none;fill:#003c19;fill-opacity:1;fill-rule:nonzero;stroke:none;stroke-width:4.75000286;stroke-linecap:round;stroke-linejoin:round;stroke-miterlimit:1;stroke-dasharray:none;stroke-dashoffset:0;stroke-opacity:1;marker:none;paint-order:stroke fill markers;color-rendering:auto;image-rendering:auto;shape-rendering:auto;text-rendering:auto;enable-background:accumulate"
     d="m 231.40638,102.89034 0.38109,0.38109 c 1.40333,1.40332 3.66257,1.40331 5.06588,0 l 20.68741,-20.68744 c 1.40334,-1.40332 1.40334,-3.66256 1e-5,-5.06588 L 236.85335,56.8307 c -1.40332,-1.40333 -3.66255,-1.40332 -5.06588,-1e-5 l -0.38108,0.38108 z"
     id="rect4768"
     inkscape:connector-curvature="0" />
  <path
     id="path4773"
     d="m 224.17978,116.43901 -1e-5,0.53893 c 0,1.9846 1.59753,3.58213 3.58212,3.58214 l 29.2564,-1e-5 c 1.98461,0 3.58214,-1.59752 3.58213,-3.58212 l 1e-5,-29.25641 c -1e-5,-1.98463 -1.59752,-3.58212 -3.58213,-3.58213 l -0.53892,-1e-5 z"
     style="color:#000000;clip-rule:nonzero;display:inline;overflow:visible;visibility:visible;opacity:1;isolation:auto;mix-blend-mode:normal;color-interpolation:sRGB;color-interpolation-filters:linearRGB;solid-color:#000000;solid-opacity:1;vector-effect:none;fill:#003c19;fill-opacity:1;fill-rule:nonzero;stroke:none;stroke-width:4.75000286;stroke-linecap:round;stroke-linejoin:round;stroke-miterlimit:1;stroke-dasharray:none;stroke-dashoffset:0;stroke-opacity:1;marker:none;paint-order:stroke fill markers;color-rendering:auto;image-rendering:auto;shape-rendering:auto;text-rendering:auto;enable-background:accumulate"
     inkscape:connector-curvature="0" />
  <path
     inkscape:connector-curvature="0"
     style="color:#000000;clip-rule:nonzero;display:inline;overflow:visible;visibility:visible;opacity:1;isolation:auto;mix-blend-mode:normal;color-interpolation:sRGB;color-interpolation-filters:linearRGB;solid-color:#000000;solid-opacity:1;vector-effect:none;fill:#003c19;fill-opacity:1;fill-rule:nonzero;stroke:none;stroke-width:3.0929389;stroke-linecap:round;stroke-linejoin:round;stroke-miterlimit:1;stroke-dasharray:none;stroke-dashoffset:0;stroke-opacity:1;marker:none;paint-order:stroke fill markers;color-rendering:auto;image-rendering:auto;shape-rendering:auto;text-rendering:auto;enable-background:accumulate"
     d="m 230.67671,57.21177 -0.24814,-0.24811 c -0.91379,-0.91377 -2.38488,-0.91379 -3.29865,-2e-5 l -13.47049,13.47049 c -0.91379,0.91377 -0.91376,2.38487 1e-5,3.29864 l 13.47048,13.47051 c 0.91378,0.91376 2.38487,0.91376 3.29864,-1e-5 l 0.24811,-0.24814 z"
     id="path4775" />
  <path
     id="path4777"
     d="m 245.12743,37.80575 -0.15861,0.15138 c -0.58417,0.55771 -1.50332,0.53635 -2.06098,-0.0478 l -8.22105,-8.61185 c -0.55741,-0.58443 -0.53633,-1.50333 0.0479,-2.061 l 8.61184,-8.22106 c 0.58415,-0.55769 1.50331,-0.53632 2.06099,0.0478 l 0.15116,0.15882 z"
     style="color:#000000;clip-rule:nonzero;display:inline;overflow:visible;visibility:visible;opacity:1;isolation:auto;mix-blend-mode:normal;color-interpolation:sRGB;color-interpolation-filters:linearRGB;solid-color:#000000;solid-opacity:1;vector-effect:none;fill:#003c19;fill-opacity:1;fill-rule:nonzero;stroke:none;stroke-width:1.93300474;stroke-linecap:round;stroke-linejoin:round;stroke-miterlimit:1;stroke-dasharray:none;stroke-dashoffset:0;stroke-opacity:1;marker:none;paint-order:stroke fill markers;color-rendering:auto;image-rendering:auto;shape-rendering:auto;text-rendering:auto;enable-background:accumulate"
     inkscape:connector-curvature="0" />
  <path
     inkscape:connector-curvature="0"
     style="color:#000000;clip-rule:nonzero;display:inline;overflow:visible;visibility:visible;opacity:1;isolation:auto;mix-blend-mode:normal;color-interpolation:sRGB;color-interpolation-filters:linearRGB;solid-color:#000000;solid-opacity:1;vector-effect:none;fill:#003c19;fill-opacity:1;fill-rule:nonzero;stroke:none;stroke-width:1.93300474;stroke-linecap:round;stroke-linejoin:round;stroke-miterlimit:1;stroke-dasharray:none;stroke-dashoffset:0;stroke-opacity:1;marker:none;paint-order:stroke fill markers;color-rendering:auto;image-rendering:auto;shape-rendering:auto;text-rendering:auto;enable-background:accumulate"
     d="m 216.9369,20.02439 0.15597,-0.15411 c 0.57457,-0.5676 1.49405,-0.56178 2.06154,0.0125 l 8.36731,8.46981 c 0.56758,0.57453 0.56176,1.49401 -0.0126,2.06152 l -8.46977,8.3673 c -0.57455,0.5676 -1.49403,0.56177 -2.06154,-0.0125 l -0.15404,-0.15606 z"
     id="path4779" />
  <path
     style="color:#000000;clip-rule:nonzero;display:inline;overflow:visible;visibility:visible;opacity:1;isolation:auto;mix-blend-mode:normal;color-interpolation:sRGB;color-interpolation-filters:linearRGB;solid-color:#000000;solid-opacity:1;vector-effect:none;fill:#003c19;fill-opacity:1;fill-rule:nonzero;stroke:none;stroke-width:2.254493;stroke-linecap:round;stroke-linejoin:round;stroke-miterlimit:1;stroke-dasharray:none;stroke-dashoffset:0;stroke-opacity:1;marker:none;paint-order:stroke fill markers;color-rendering:auto;image-rendering:auto;shape-rendering:auto;text-rendering:auto;enable-background:accumulate"
     d="m 278.43552,119.53701 c -0.2965,0.31779 -0.7145,0.52296 -1.18518,0.53928 l -13.87684,0.48011 c -0.94141,0.0326 -1.72525,-0.69868 -1.7579,-1.64007 l -0.009,-0.25502 16.46871,-17.65176 0.0222,2.6e-4 c 0.29813,-0.38713 0.75485,-0.6478 1.28361,-0.66604 l 13.87791,-0.481172 c 0.94136,-0.0327 1.72522,0.698662 1.75788,1.640052 l 0.009,0.25502 -16.46973,17.65288 -0.0198,1.4e-4 c -0.0326,0.0425 -0.0618,0.0879 -0.0986,0.12673 z"
     id="path4781"
     inkscape:connector-curvature="0"
     sodipodi:nodetypes="cccccccccccccsc" />
  <g
     id="g4820"
     transform="rotate(13.740878,110.78444,92.206196)">
    <rect
       transform="scale(-1)"
       ry="0.87483472"
       y="-89.447716"
       x="-104.9885"
       height="8.8941574"
       width="8.8941574"
       id="rect4766-6"
       style="color:#000000;clip-rule:nonzero;display:inline;overflow:visible;visibility:visible;opacity:0.33900003;isolation:auto;mix-blend-mode:normal;color-interpolation:sRGB;color-interpolation-filters:linearRGB;solid-color:#000000;solid-opacity:1;vector-effect:none;fill:#000000;fill-opacity:1;fill-rule:nonzero;stroke:none;stroke-width:1.15999436;stroke-linecap:round;stroke-linejoin:round;stroke-miterlimit:1;stroke-dasharray:none;stroke-dashoffset:0;stroke-opacity:1;marker:none;paint-order:stroke fill markers;color-rendering:auto;image-rendering:auto;shape-rendering:auto;text-rendering:auto;enable-background:accumulate" />
    <path
       id="rect4768-0"
       d="m 88.244556,90.396437 h 0.242708 c 0.893785,0 1.613249,-0.719459 1.613249,-1.613245 V 75.60729 c 0,-0.893789 -0.719464,-1.613249 -1.613249,-1.613249 H 75.311361 c -0.893786,0 -1.613246,0.71946 -1.613246,1.613249 v 0.242705 z"
       style="color:#000000;clip-rule:nonzero;display:inline;overflow:visible;visibility:visible;opacity:0.33900003;isolation:auto;mix-blend-mode:normal;color-interpolation:sRGB;color-interpolation-filters:linearRGB;solid-color:#000000;solid-opacity:1;vector-effect:none;fill:#000000;fill-opacity:1;fill-rule:nonzero;stroke:none;stroke-width:2.13920927;stroke-linecap:round;stroke-linejoin:round;stroke-miterlimit:1;stroke-dasharray:none;stroke-dashoffset:0;stroke-opacity:1;marker:none;paint-order:stroke fill markers;color-rendering:auto;image-rendering:auto;shape-rendering:auto;text-rendering:auto;enable-background:accumulate"
       inkscape:connector-curvature="0" />
    <path
       inkscape:connector-curvature="0"
       style="color:#000000;clip-rule:nonzero;display:inline;overflow:visible;visibility:visible;opacity:0.33900003;isolation:auto;mix-blend-mode:normal;color-interpolation:sRGB;color-interpolation-filters:linearRGB;solid-color:#000000;solid-opacity:1;vector-effect:none;fill:#000000;fill-opacity:1;fill-rule:nonzero;stroke:none;stroke-width:2.13920927;stroke-linecap:round;stroke-linejoin:round;stroke-miterlimit:1;stroke-dasharray:none;stroke-dashoffset:0;stroke-opacity:1;marker:none;paint-order:stroke fill markers;color-rendering:auto;image-rendering:auto;shape-rendering:auto;text-rendering:auto;enable-background:accumulate"
       d="m 129.70681,89.015594 v -0.242705 c 0,-0.893789 -0.71946,-1.613249 -1.61324,-1.613249 h -13.17591 c -0.89378,0 -1.61324,0.71946 -1.61324,1.613243 v 13.175907 c 0,0.89379 0.71946,1.61324 1.61324,1.61325 h 0.24271 z"
       id="path4773-4" />
    <path
       id="path4775-8"
       d="m 99.341576,45.645134 0.11175,-0.111749 c 0.41153,-0.411525 0.41153,-1.074048 10e-6,-1.485572 l -6.06657,-6.066565 c -0.41152,-0.411525 -1.074045,-0.41152 -1.485569,4e-6 l -6.066565,6.066565 c -0.411525,0.411524 -0.411526,1.074043 -10e-7,1.485568 l 0.111749,0.111749 z"
       style="color:#000000;clip-rule:nonzero;display:inline;overflow:visible;visibility:visible;opacity:0.33900003;isolation:auto;mix-blend-mode:normal;color-interpolation:sRGB;color-interpolation-filters:linearRGB;solid-color:#000000;solid-opacity:1;vector-effect:none;fill:#000000;fill-opacity:1;fill-rule:nonzero;stroke:none;stroke-width:1.39293456;stroke-linecap:round;stroke-linejoin:round;stroke-miterlimit:1;stroke-dasharray:none;stroke-dashoffset:0;stroke-opacity:1;marker:none;paint-order:stroke fill markers;color-rendering:auto;image-rendering:auto;shape-rendering:auto;text-rendering:auto;enable-background:accumulate"
       inkscape:connector-curvature="0" />
    <path
       inkscape:connector-curvature="0"
       style="color:#000000;clip-rule:nonzero;display:inline;overflow:visible;visibility:visible;opacity:0.33900003;isolation:auto;mix-blend-mode:normal;color-interpolation:sRGB;color-interpolation-filters:linearRGB;solid-color:#000000;solid-opacity:1;vector-effect:none;fill:#000000;fill-opacity:1;fill-rule:nonzero;stroke:none;stroke-width:0.87054724;stroke-linecap:round;stroke-linejoin:round;stroke-miterlimit:1;stroke-dasharray:none;stroke-dashoffset:0;stroke-opacity:1;marker:none;paint-order:stroke fill markers;color-rendering:auto;image-rendering:auto;shape-rendering:auto;text-rendering:auto;enable-background:accumulate"
       d="m 84.154775,67.453818 v 0.09877 c 0,0.363724 0.292782,0.656509 0.656507,0.656509 h 5.361909 c 0.363725,0 0.656507,-0.292785 0.656507,-0.65651 v -5.361909 c -10e-7,-0.363723 -0.292782,-0.656507 -0.656506,-0.656506 l -0.09877,-10e-7 z"
       id="path4777-8" />
    <path
       id="path4779-8"
       d="m 101.72474,61.570624 h -0.0988 c -0.36373,0 -0.65651,0.292782 -0.65651,0.656507 v 5.361909 c 0,0.363724 0.29278,0.656506 0.65651,0.656506 l 5.36191,10e-7 c 0.36372,-10e-7 0.6565,-0.292782 0.6565,-0.656507 v -0.09877 z"
       style="color:#000000;clip-rule:nonzero;display:inline;overflow:visible;visibility:visible;opacity:0.33900003;isolation:auto;mix-blend-mode:normal;color-interpolation:sRGB;color-interpolation-filters:linearRGB;solid-color:#000000;solid-opacity:1;vector-effect:none;fill:#000000;fill-opacity:1;fill-rule:nonzero;stroke:none;stroke-width:0.87054724;stroke-linecap:round;stroke-linejoin:round;stroke-miterlimit:1;stroke-dasharray:none;stroke-dashoffset:0;stroke-opacity:1;marker:none;paint-order:stroke fill markers;color-rendering:auto;image-rendering:auto;shape-rendering:auto;text-rendering:auto;enable-background:accumulate"
       inkscape:connector-curvature="0" />
    <path
       sodipodi:nodetypes="cccccccccccccsc"
       inkscape:connector-curvature="0"
       id="path4781-9"
       d="m 116.90707,60.55055 c 0.13839,0.138396 0.32975,0.224217 0.54185,0.224217 l 6.25332,-4.68e-4 c 0.42421,0 0.76561,-0.341392 0.7656,-0.765607 v -0.11491 l -7.68786,-7.687866 -0.009,-6e-6 c -0.14021,-0.169608 -0.34983,-0.279805 -0.5881,-0.279805 l -6.25379,7e-6 c -0.42422,10e-7 -0.76561,0.341392 -0.7656,0.765606 v 0.114912 l 7.68833,7.688333 0.009,-2e-6 c 0.0154,0.01861 0.0292,0.03853 0.0462,0.05559 z"
       style="color:#000000;clip-rule:nonzero;display:inline;overflow:visible;visibility:visible;opacity:0.33900003;isolation:auto;mix-blend-mode:normal;color-interpolation:sRGB;color-interpolation-filters:linearRGB;solid-color:#000000;solid-opacity:1;vector-effect:none;fill:#000000;fill-opacity:1;fill-rule:nonzero;stroke:none;stroke-width:1.01533246;stroke-linecap:round;stroke-linejoin:round;stroke-miterlimit:1;stroke-dasharray:none;stroke-dashoffset:0;stroke-opacity:1;marker:none;paint-order:stroke fill markers;color-rendering:auto;image-rendering:auto;shape-rendering:auto;text-rendering:auto;enable-background:accumulate" />
  </g>
  <g
     id="g4829"
     transform="translate(5.387959,-4.0103524)">
    <rect
       style="color:#000000;clip-rule:nonzero;display:inline;overflow:visible;visibility:visible;opacity:0.33900003;isolation:auto;mix-blend-mode:normal;color-interpolation:sRGB;color-interpolation-filters:linearRGB;solid-color:#000000;solid-opacity:1;vector-effect:none;fill:#000000;fill-opacity:1;fill-rule:nonzero;stroke:none;stroke-width:1.15999436;stroke-linecap:round;stroke-linejoin:round;stroke-miterlimit:1;stroke-dasharray:none;stroke-dashoffset:0;stroke-opacity:1;marker:none;paint-order:stroke fill markers;color-rendering:auto;image-rendering:auto;shape-rendering:auto;text-rendering:auto;enable-background:accumulate"
       id="rect4845"
       width="8.8941574"
       height="8.8941574"
       x="337.51755"
       y="240.20392"
       ry="0.87483472"
       transform="matrix(0.70710678,0.70710678,0.70710678,-0.70710678,0,0)" />
    <path
       inkscape:connector-curvature="0"
       style="color:#000000;clip-rule:nonzero;display:inline;overflow:visible;visibility:visible;opacity:0.33900003;isolation:auto;mix-blend-mode:normal;color-interpolation:sRGB;color-interpolation-filters:linearRGB;solid-color:#000000;solid-opacity:1;vector-effect:none;fill:#000000;fill-opacity:1;fill-rule:nonzero;stroke:none;stroke-width:2.13920927;stroke-linecap:round;stroke-linejoin:round;stroke-miterlimit:1;stroke-dasharray:none;stroke-dashoffset:0;stroke-opacity:1;marker:none;paint-order:stroke fill markers;color-rendering:auto;image-rendering:auto;shape-rendering:auto;text-rendering:auto;enable-background:accumulate"
       d="m 400.43485,90.807353 -0.17162,-0.171622 c -0.632,-0.632005 -0.63201,-1.649475 0,-2.281477 L 409.58,79.037485 c 0.632,-0.632005 1.64947,-0.632005 2.28148,0 l 9.31676,9.316769 c 0.63201,0.632005 0.63201,1.649475 0,2.281479 l -0.17161,0.171618 z"
       id="path4847" />
    <path
       id="path4849"
       d="m 392.15872,66.806045 0.17162,-0.171618 c 0.632,-0.632004 1.64947,-0.632004 2.28147,-6e-6 l 9.31678,9.316775 c 0.63199,0.631998 0.63199,1.649468 -10e-6,2.281468 l -9.31677,9.316772 c -0.632,0.632002 -1.64947,0.632002 -2.28147,5e-6 l -0.17162,-0.171622 z"
       style="color:#000000;clip-rule:nonzero;display:inline;overflow:visible;visibility:visible;opacity:0.33900003;isolation:auto;mix-blend-mode:normal;color-interpolation:sRGB;color-interpolation-filters:linearRGB;solid-color:#000000;solid-opacity:1;vector-effect:none;fill:#000000;fill-opacity:1;fill-rule:nonzero;stroke:none;stroke-width:2.13920927;stroke-linecap:round;stroke-linejoin:round;stroke-miterlimit:1;stroke-dasharray:none;stroke-dashoffset:0;stroke-opacity:1;marker:none;paint-order:stroke fill markers;color-rendering:auto;image-rendering:auto;shape-rendering:auto;text-rendering:auto;enable-background:accumulate"
       inkscape:connector-curvature="0" />
    <path
       inkscape:connector-curvature="0"
       style="color:#000000;clip-rule:nonzero;display:inline;overflow:visible;visibility:visible;opacity:0.33900003;isolation:auto;mix-blend-mode:normal;color-interpolation:sRGB;color-interpolation-filters:linearRGB;solid-color:#000000;solid-opacity:1;vector-effect:none;fill:#000000;fill-opacity:1;fill-rule:nonzero;stroke:none;stroke-width:1.39293456;stroke-linecap:round;stroke-linejoin:round;stroke-miterlimit:1;stroke-dasharray:none;stroke-dashoffset:0;stroke-opacity:1;marker:none;paint-order:stroke fill markers;color-rendering:auto;image-rendering:auto;shape-rendering:auto;text-rendering:auto;enable-background:accumulate"
       d="m 413.28708,57.592689 v -0.158037 c 0,-0.581988 0.46848,-1.050463 1.05046,-1.050465 l 8.57942,3e-6 c 0.58198,-3e-6 1.05045,0.46848 1.05045,1.05046 v 8.579415 c 0,0.581987 -0.46847,1.050458 -1.05045,1.050462 l -0.15804,-10e-7 z"
       id="path4851" />
    <path
       id="path4853"
       d="m 423.38036,81.964448 -0.0698,0.06984 c -0.25719,0.257192 -0.67125,0.257195 -0.92844,7e-6 l -3.79144,-3.791443 c -0.2572,-0.257196 -0.25719,-0.671253 0,-0.928446 l 3.79144,-3.791442 c 0.25719,-0.257191 0.67125,-0.257194 0.92844,3e-6 l 0.0699,0.06986 z"
       style="color:#000000;clip-rule:nonzero;display:inline;overflow:visible;visibility:visible;opacity:0.33900003;isolation:auto;mix-blend-mode:normal;color-interpolation:sRGB;color-interpolation-filters:linearRGB;solid-color:#000000;solid-opacity:1;vector-effect:none;fill:#000000;fill-opacity:1;fill-rule:nonzero;stroke:none;stroke-width:0.87054724;stroke-linecap:round;stroke-linejoin:round;stroke-miterlimit:1;stroke-dasharray:none;stroke-dashoffset:0;stroke-opacity:1;marker:none;paint-order:stroke fill markers;color-rendering:auto;image-rendering:auto;shape-rendering:auto;text-rendering:auto;enable-background:accumulate"
       inkscape:connector-curvature="0" />
    <path
       inkscape:connector-curvature="0"
       style="color:#000000;clip-rule:nonzero;display:inline;overflow:visible;visibility:visible;opacity:0.33900003;isolation:auto;mix-blend-mode:normal;color-interpolation:sRGB;color-interpolation-filters:linearRGB;solid-color:#000000;solid-opacity:1;vector-effect:none;fill:#000000;fill-opacity:1;fill-rule:nonzero;stroke:none;stroke-width:0.87054724;stroke-linecap:round;stroke-linejoin:round;stroke-miterlimit:1;stroke-dasharray:none;stroke-dashoffset:0;stroke-opacity:1;marker:none;paint-order:stroke fill markers;color-rendering:auto;image-rendering:auto;shape-rendering:auto;text-rendering:auto;enable-background:accumulate"
       d="m 407.43622,64.869476 0.0699,0.06986 c 0.2572,0.257196 0.2572,0.671251 0,0.928443 l -3.79144,3.791443 c -0.25719,0.257191 -0.67125,0.257193 -0.92844,-3e-6 l -3.79144,-3.791442 c -0.25719,-0.25719 -0.25719,-0.671244 0,-0.928437 l 0.0698,-0.06984 z"
       id="path4855" />
    <path
       style="color:#000000;clip-rule:nonzero;display:inline;overflow:visible;visibility:visible;opacity:0.33900003;isolation:auto;mix-blend-mode:normal;color-interpolation:sRGB;color-interpolation-filters:linearRGB;solid-color:#000000;solid-opacity:1;vector-effect:none;fill:#000000;fill-opacity:1;fill-rule:nonzero;stroke:none;stroke-width:1.01533246;stroke-linecap:round;stroke-linejoin:round;stroke-miterlimit:1;stroke-dasharray:none;stroke-dashoffset:0;stroke-opacity:1;marker:none;paint-order:stroke fill markers;color-rendering:auto;image-rendering:auto;shape-rendering:auto;text-rendering:auto;enable-background:accumulate"
       d="m 398.99143,62.387174 c -0.19572,4e-6 -0.39172,-0.07462 -0.54169,-0.224601 l -4.42144,-4.422096 c -0.29996,-0.299961 -0.29996,-0.782768 10e-6,-1.082727 l 0.0812,-0.08125 10.87228,-4e-6 0.006,0.0064 c 0.21907,-0.02079 0.44522,0.04951 0.6137,0.217998 l 4.42209,4.422102 c 0.29997,0.29997 0.29997,0.782769 0,1.082726 l -0.0813,0.08125 -10.87294,2e-6 -0.006,-0.0064 c -0.024,0.0023 -0.0479,0.0066 -0.072,0.0066 z"
       id="path4857"
       inkscape:connector-curvature="0"
       sodipodi:nodetypes="cccccccccccccsc" />
  </g>
  <path
     sodipodi:nodetypes="cccc"
     inkscape:connector-curvature="0"
     id="path4861"
     d="M 289.1359,156.41641 533.55261,98.728749 522.15629,252.03847 Z"
     style="opacity:0.05;fill:#000000;fill-opacity:1;fill-rule:evenodd;stroke:none;stroke-width:0.26458335px;stroke-linecap:butt;stroke-linejoin:miter;stroke-opacity:1" />
  <path
     sodipodi:nodetypes="cccc"
     inkscape:connector-curvature="0"
     id="path4831"
     d="M -31.334218,-155.65571 118.61751,-15.464399 -9.8224324,123.99031 Z"
     style="opacity:0.05;fill:#000000;fill-opacity:1;fill-rule:evenodd;stroke:none;stroke-width:0.26458335px;stroke-linecap:butt;stroke-linejoin:miter;stroke-opacity:1" />
</svg>
