<?xml version="1.0" encoding="UTF-8" standalone="no"?>
<!-- Created with Inkscape (http://www.inkscape.org/) -->

<svg
   width="164.57083mm"
   height="338.66666mm"
   viewBox="0 0 164.57083 338.66666"
   version="1.1"
   id="svg5"
   inkscape:version="1.2.1 (1:1.2.1+202210291244+9c6d41e410)"
   sodipodi:docname="background-phone.svg"
   inkscape:export-filename="background-phone.png"
   inkscape:export-xdpi="200.03"
   inkscape:export-ydpi="200.03"
   xml:space="preserve"
   xmlns:inkscape="http://www.inkscape.org/namespaces/inkscape"
   xmlns:sodipodi="http://sodipodi.sourceforge.net/DTD/sodipodi-0.dtd"
   xmlns:xlink="http://www.w3.org/1999/xlink"
   xmlns="http://www.w3.org/2000/svg"
   xmlns:svg="http://www.w3.org/2000/svg"><sodipodi:namedview
     id="namedview7"
     pagecolor="#ffffff"
     bordercolor="#666666"
     borderopacity="1.0"
     inkscape:pageshadow="2"
     inkscape:pageopacity="0.0"
     inkscape:pagecheckerboard="0"
     inkscape:document-units="mm"
     showgrid="false"
     fit-margin-top="0"
     fit-margin-left="0"
     fit-margin-right="0"
     fit-margin-bottom="0"
     inkscape:zoom="0.51834677"
     inkscape:cx="165.9121"
     inkscape:cy="456.25827"
     inkscape:window-width="1854"
     inkscape:window-height="1053"
     inkscape:window-x="66"
     inkscape:window-y="27"
     inkscape:window-maximized="1"
     inkscape:current-layer="layer1"
     inkscape:showpageshadow="2"
     inkscape:deskcolor="#d1d1d1"><sodipodi:guide
       position="0,338.66665"
       orientation="0,621.99999"
       id="guide916"
       inkscape:locked="false" /><sodipodi:guide
       position="164.57083,338.66665"
       orientation="1280,0"
       id="guide918"
       inkscape:locked="false" /><sodipodi:guide
       position="164.57083,0"
       orientation="0,-621.99999"
       id="guide920"
       inkscape:locked="false" /><sodipodi:guide
       position="0,0"
       orientation="-1280,0"
       id="guide922"
       inkscape:locked="false" /></sodipodi:namedview><defs
     id="defs2"><linearGradient
       inkscape:collect="always"
       id="linearGradient952"><stop
         style="stop-color:#a6b008;stop-opacity:1;"
         offset="0"
         id="stop948" /><stop
         style="stop-color:#c06600;stop-opacity:1;"
         offset="0.24442756"
         id="stop1020" /><stop
         style="stop-color:#8a31cc;stop-opacity:1;"
         offset="1"
         id="stop950" /></linearGradient><filter
       id="a"
       style="color-interpolation-filters:sRGB"
       height="1.168"
       width="1.194"
       y="-.08395"
       x="-.09699"><feGaussianBlur
         stdDeviation="12.947969"
         id="feGaussianBlur2" /></filter><linearGradient
       inkscape:collect="always"
       xlink:href="#linearGradient952"
       id="linearGradient1687"
       gradientUnits="userSpaceOnUse"
       x1="26.181173"
       y1="3.4604504"
       x2="190.75201"
       y2="342.12711" /><filter
       id="a-3"
       style="color-interpolation-filters:sRGB"
       height="1.168"
       width="1.194"
       y="-.08395"
       x="-.09699"><feGaussianBlur
         stdDeviation="12.947969"
         id="feGaussianBlur2-6" /></filter></defs><g
     inkscape:label="Capa 1"
     inkscape:groupmode="layer"
     id="layer1"
     transform="translate(-26.181173,-3.4604506)"><rect
       style="fill:url(#linearGradient1687);stroke-width:1;stroke-linecap:round;stroke-linejoin:round;stop-color:#000000;fill-opacity:1"
       id="rect946"
       width="164.57083"
       height="338.66666"
       x="26.181173"
       y="3.4604504"
       ry="0.87483418" /><g
       id="g1478"
       transform="translate(-125.85978,41.542081)"
       style="font-variation-settings:normal;opacity:0.722874;vector-effect:none;fill:#ffffff;fill-opacity:1;stroke-width:1;stroke-linecap:butt;stroke-linejoin:miter;stroke-miterlimit:4;stroke-dasharray:none;stroke-dashoffset:0;stroke-opacity:1;-inkscape-stroke:none;stop-color:#000000;stop-opacity:1"><g
         id="g1207"
         transform="translate(-4.7541826,1.5535851)"
         style="font-variation-settings:normal;vector-effect:none;fill:#ffffff;fill-opacity:1;stroke-width:1;stroke-linecap:butt;stroke-linejoin:miter;stroke-miterlimit:4;stroke-dasharray:none;stroke-dashoffset:0;stroke-opacity:1;-inkscape-stroke:none;stop-color:#000000;stop-opacity:1"><g
           id="g1252"
           transform="translate(3.7725679,1.4816717)"
           style="font-variation-settings:normal;vector-effect:none;fill:#ffffff;fill-opacity:1;stroke-width:1;stroke-linecap:butt;stroke-linejoin:miter;stroke-miterlimit:4;stroke-dasharray:none;stroke-dashoffset:0;stroke-opacity:1;-inkscape-stroke:none;stop-color:#000000;stop-opacity:1"><g
             id="g1232-3"
             transform="rotate(33.35393,150.23155,182.53075)"
             style="font-variation-settings:normal;vector-effect:none;fill:#ffffff;fill-opacity:1;stroke-width:1;stroke-linecap:butt;stroke-linejoin:miter;stroke-miterlimit:4;stroke-dasharray:none;stroke-dashoffset:0;stroke-opacity:1;-inkscape-stroke:none;stop-color:#000000;stop-opacity:1"><g
               id="g1230-6"
               transform="matrix(-0.61607887,-0.78768447,-0.78768447,0.61607887,425.78589,345.66956)"
               style="font-variation-settings:normal;vector-effect:none;fill:#ffffff;fill-opacity:1;stroke-width:1;stroke-linecap:butt;stroke-linejoin:miter;stroke-miterlimit:4;stroke-dasharray:none;stroke-dashoffset:0;stroke-opacity:1;-inkscape-stroke:none;stop-color:#000000;stop-opacity:1"><rect
                 style="color:#000000;clip-rule:nonzero;display:inline;overflow:visible;visibility:visible;opacity:0.339;isolation:auto;mix-blend-mode:normal;color-interpolation:sRGB;color-interpolation-filters:linearRGB;solid-color:#000000;solid-opacity:1;vector-effect:none;fill:#ffffff;fill-opacity:1;fill-rule:nonzero;stroke:none;stroke-width:1;stroke-linecap:butt;stroke-linejoin:miter;stroke-miterlimit:4;stroke-dasharray:none;stroke-dashoffset:0;stroke-opacity:1;marker:none;paint-order:stroke fill markers;color-rendering:auto;image-rendering:auto;shape-rendering:auto;text-rendering:auto;enable-background:accumulate;font-variation-settings:normal;-inkscape-stroke:none;stop-color:#000000;stop-opacity:1"
                 id="rect1216-7"
                 width="8.8942337"
                 height="8.8941574"
                 x="315.85855"
                 y="247.30171"
                 ry="0.87483472"
                 transform="matrix(0.70710678,0.70710678,0.70710678,-0.70710678,0,0)" /><path
                 inkscape:connector-curvature="0"
                 style="color:#000000;clip-rule:nonzero;display:inline;overflow:visible;visibility:visible;opacity:0.339;isolation:auto;mix-blend-mode:normal;color-interpolation:sRGB;color-interpolation-filters:linearRGB;solid-color:#000000;solid-opacity:1;vector-effect:none;fill:#ffffff;fill-opacity:1;fill-rule:nonzero;stroke:none;stroke-width:1;stroke-linecap:butt;stroke-linejoin:miter;stroke-miterlimit:4;stroke-dasharray:none;stroke-dashoffset:0;stroke-opacity:1;marker:none;paint-order:stroke fill markers;color-rendering:auto;image-rendering:auto;shape-rendering:auto;text-rendering:auto;enable-background:accumulate;font-variation-settings:normal;-inkscape-stroke:none;stop-color:#000000;stop-opacity:1"
                 d="m 438.42401,34.526435 0.2146,0.113368 c 0.7903,0.417479 1.09041,1.38968 0.67293,2.179976 l -6.1543,11.650283 c -0.41747,0.790294 -1.38968,1.090394 -2.17998,0.672917 l -11.65027,-6.154301 c -0.7903,-0.417478 -1.09041,-1.389679 -0.67293,-2.179976 l 0.11336,-0.214603 z"
                 id="path1218-5" /><path
                 id="path1220-3"
                 d="m 433.42081,72.365082 0.24268,-0.0037 c 0.89368,-0.01377 1.62413,0.694523 1.6379,1.588199 l 0.20295,13.17435 c 0.0138,0.893668 -0.69454,1.624125 -1.58821,1.637891 l -13.17434,0.202907 c -0.89368,0.01377 -1.62414,-0.694525 -1.63791,-1.5882 l -0.004,-0.24268 z"
                 style="color:#000000;clip-rule:nonzero;display:inline;overflow:visible;visibility:visible;opacity:0.339;isolation:auto;mix-blend-mode:normal;color-interpolation:sRGB;color-interpolation-filters:linearRGB;solid-color:#000000;solid-opacity:1;vector-effect:none;fill:#ffffff;fill-opacity:1;fill-rule:nonzero;stroke:none;stroke-width:1;stroke-linecap:butt;stroke-linejoin:miter;stroke-miterlimit:4;stroke-dasharray:none;stroke-dashoffset:0;stroke-opacity:1;marker:none;paint-order:stroke fill markers;color-rendering:auto;image-rendering:auto;shape-rendering:auto;text-rendering:auto;enable-background:accumulate;font-variation-settings:normal;-inkscape-stroke:none;stop-color:#000000;stop-opacity:1"
                 inkscape:connector-curvature="0" /><path
                 inkscape:connector-curvature="0"
                 style="color:#000000;clip-rule:nonzero;display:inline;overflow:visible;visibility:visible;opacity:0.339;isolation:auto;mix-blend-mode:normal;color-interpolation:sRGB;color-interpolation-filters:linearRGB;solid-color:#000000;solid-opacity:1;vector-effect:none;fill:#ffffff;fill-opacity:1;fill-rule:nonzero;stroke:none;stroke-width:1;stroke-linecap:butt;stroke-linejoin:miter;stroke-miterlimit:4;stroke-dasharray:none;stroke-dashoffset:0;stroke-opacity:1;marker:none;paint-order:stroke fill markers;color-rendering:auto;image-rendering:auto;shape-rendering:auto;text-rendering:auto;enable-background:accumulate;font-variation-settings:normal;-inkscape-stroke:none;stop-color:#000000;stop-opacity:1"
                 d="m 412.3445,70.172441 v -0.158037 c 0,-0.581988 0.46848,-1.050463 1.05046,-1.050465 l 8.57942,3e-6 c 0.58198,-3e-6 1.05045,0.46848 1.05045,1.05046 v 8.579415 c 0,0.581987 -0.46847,1.050458 -1.05045,1.050462 l -0.15804,-10e-7 z"
                 id="path1222-5" /><path
                 id="path1224-6"
                 d="m 428.10555,67.511327 -0.0698,0.06984 c -0.25719,0.257192 -0.67125,0.257195 -0.92844,7e-6 l -3.79144,-3.791443 c -0.2572,-0.257196 -0.25719,-0.671253 0,-0.928446 l 3.79144,-3.791442 c 0.25719,-0.257191 0.67125,-0.257194 0.92844,3e-6 l 0.0699,0.06986 z"
                 style="color:#000000;clip-rule:nonzero;display:inline;overflow:visible;visibility:visible;opacity:0.339;isolation:auto;mix-blend-mode:normal;color-interpolation:sRGB;color-interpolation-filters:linearRGB;solid-color:#000000;solid-opacity:1;vector-effect:none;fill:#ffffff;fill-opacity:1;fill-rule:nonzero;stroke:none;stroke-width:1;stroke-linecap:butt;stroke-linejoin:miter;stroke-miterlimit:4;stroke-dasharray:none;stroke-dashoffset:0;stroke-opacity:1;marker:none;paint-order:stroke fill markers;color-rendering:auto;image-rendering:auto;shape-rendering:auto;text-rendering:auto;enable-background:accumulate;font-variation-settings:normal;-inkscape-stroke:none;stop-color:#000000;stop-opacity:1"
                 inkscape:connector-curvature="0" /><path
                 inkscape:connector-curvature="0"
                 style="color:#000000;clip-rule:nonzero;display:inline;overflow:visible;visibility:visible;opacity:0.339;isolation:auto;mix-blend-mode:normal;color-interpolation:sRGB;color-interpolation-filters:linearRGB;solid-color:#000000;solid-opacity:1;vector-effect:none;fill:#ffffff;fill-opacity:1;fill-rule:nonzero;stroke:none;stroke-width:1;stroke-linecap:butt;stroke-linejoin:miter;stroke-miterlimit:4;stroke-dasharray:none;stroke-dashoffset:0;stroke-opacity:1;marker:none;paint-order:stroke fill markers;color-rendering:auto;image-rendering:auto;shape-rendering:auto;text-rendering:auto;enable-background:accumulate;font-variation-settings:normal;-inkscape-stroke:none;stop-color:#000000;stop-opacity:1"
                 d="m 405.04487,78.26427 0.0699,0.06986 c 0.2572,0.257196 0.2572,0.671251 0,0.928443 l -3.79144,3.791443 c -0.25719,0.257191 -0.67125,0.257193 -0.92844,-3e-6 l -3.79144,-3.791442 c -0.25719,-0.25719 -0.25719,-0.671244 0,-0.928437 l 0.0698,-0.06984 z"
                 id="path1226-2" /><path
                 style="color:#000000;clip-rule:nonzero;display:inline;overflow:visible;visibility:visible;opacity:0.339;isolation:auto;mix-blend-mode:normal;color-interpolation:sRGB;color-interpolation-filters:linearRGB;solid-color:#000000;solid-opacity:1;vector-effect:none;fill:#ffffff;fill-opacity:1;fill-rule:nonzero;stroke:none;stroke-width:1;stroke-linecap:butt;stroke-linejoin:miter;stroke-miterlimit:4;stroke-dasharray:none;stroke-dashoffset:0;stroke-opacity:1;marker:none;paint-order:stroke fill markers;color-rendering:auto;image-rendering:auto;shape-rendering:auto;text-rendering:auto;enable-background:accumulate;font-variation-settings:normal;-inkscape-stroke:none;stop-color:#000000;stop-opacity:1"
                 d="m 404.48451,63.740072 c 0.0425,-0.191053 0.15775,-0.36624 0.337,-0.479901 l 5.27757,-3.354293 c 0.358,-0.227571 0.82926,-0.122604 1.05683,0.235405 l 0.0617,0.09693 -2.36371,10.612227 -0.008,0.0045 c -0.0273,0.218361 -0.14512,0.423803 -0.34617,0.55164 l -5.27773,3.354924 c -0.35801,0.227576 -0.82926,0.122612 -1.05682,-0.235393 l -0.0616,-0.09702 2.36385,-10.612869 0.008,-0.0045 c 0.003,-0.02387 0.004,-0.04818 0.009,-0.07171 z"
                 id="path1228-9"
                 inkscape:connector-curvature="0"
                 sodipodi:nodetypes="cccccccccccccsc" /></g></g><g
             id="g344"
             transform="matrix(-0.83529022,0.54980928,0.54980928,0.83529022,346.9712,-52.534035)"
             style="font-variation-settings:normal;vector-effect:none;fill:#ffffff;fill-opacity:1;stroke-width:1;stroke-linecap:butt;stroke-linejoin:miter;stroke-miterlimit:4;stroke-dasharray:none;stroke-dashoffset:0;stroke-opacity:1;-inkscape-stroke:none;stop-color:#000000;stop-opacity:1"><g
               id="g342"
               transform="matrix(-0.61607887,-0.78768447,-0.78768447,0.61607887,425.78589,345.66956)"
               style="font-variation-settings:normal;vector-effect:none;fill:#ffffff;fill-opacity:1;stroke-width:1;stroke-linecap:butt;stroke-linejoin:miter;stroke-miterlimit:4;stroke-dasharray:none;stroke-dashoffset:0;stroke-opacity:1;-inkscape-stroke:none;stop-color:#000000;stop-opacity:1"><rect
                 style="color:#000000;clip-rule:nonzero;display:inline;overflow:visible;visibility:visible;opacity:0.339;isolation:auto;mix-blend-mode:normal;color-interpolation:sRGB;color-interpolation-filters:linearRGB;solid-color:#000000;solid-opacity:1;vector-effect:none;fill:#ffffff;fill-opacity:1;fill-rule:nonzero;stroke:none;stroke-width:1;stroke-linecap:butt;stroke-linejoin:miter;stroke-miterlimit:4;stroke-dasharray:none;stroke-dashoffset:0;stroke-opacity:1;marker:none;paint-order:stroke fill markers;color-rendering:auto;image-rendering:auto;shape-rendering:auto;text-rendering:auto;enable-background:accumulate;font-variation-settings:normal;-inkscape-stroke:none;stop-color:#000000;stop-opacity:1"
                 id="rect328"
                 width="8.8942337"
                 height="8.8941574"
                 x="315.85855"
                 y="247.30171"
                 ry="0.87483472"
                 transform="matrix(0.70710678,0.70710678,0.70710678,-0.70710678,0,0)" /><path
                 inkscape:connector-curvature="0"
                 style="color:#000000;clip-rule:nonzero;display:inline;overflow:visible;visibility:visible;opacity:0.339;isolation:auto;mix-blend-mode:normal;color-interpolation:sRGB;color-interpolation-filters:linearRGB;solid-color:#000000;solid-opacity:1;vector-effect:none;fill:#ffffff;fill-opacity:1;fill-rule:nonzero;stroke:none;stroke-width:1;stroke-linecap:butt;stroke-linejoin:miter;stroke-miterlimit:4;stroke-dasharray:none;stroke-dashoffset:0;stroke-opacity:1;marker:none;paint-order:stroke fill markers;color-rendering:auto;image-rendering:auto;shape-rendering:auto;text-rendering:auto;enable-background:accumulate;font-variation-settings:normal;-inkscape-stroke:none;stop-color:#000000;stop-opacity:1"
                 d="m 438.42401,34.526435 0.2146,0.113368 c 0.7903,0.417479 1.09041,1.38968 0.67293,2.179976 l -6.1543,11.650283 c -0.41747,0.790294 -1.38968,1.090394 -2.17998,0.672917 l -11.65027,-6.154301 c -0.7903,-0.417478 -1.09041,-1.389679 -0.67293,-2.179976 l 0.11336,-0.214603 z"
                 id="path330" /><path
                 id="path332"
                 d="m 433.42081,72.365082 0.24268,-0.0037 c 0.89368,-0.01377 1.62413,0.694523 1.6379,1.588199 l 0.20295,13.17435 c 0.0138,0.893668 -0.69454,1.624125 -1.58821,1.637891 l -13.17434,0.202907 c -0.89368,0.01377 -1.62414,-0.694525 -1.63791,-1.5882 l -0.004,-0.24268 z"
                 style="color:#000000;clip-rule:nonzero;display:inline;overflow:visible;visibility:visible;opacity:0.339;isolation:auto;mix-blend-mode:normal;color-interpolation:sRGB;color-interpolation-filters:linearRGB;solid-color:#000000;solid-opacity:1;vector-effect:none;fill:#ffffff;fill-opacity:1;fill-rule:nonzero;stroke:none;stroke-width:1;stroke-linecap:butt;stroke-linejoin:miter;stroke-miterlimit:4;stroke-dasharray:none;stroke-dashoffset:0;stroke-opacity:1;marker:none;paint-order:stroke fill markers;color-rendering:auto;image-rendering:auto;shape-rendering:auto;text-rendering:auto;enable-background:accumulate;font-variation-settings:normal;-inkscape-stroke:none;stop-color:#000000;stop-opacity:1"
                 inkscape:connector-curvature="0" /><path
                 inkscape:connector-curvature="0"
                 style="color:#000000;clip-rule:nonzero;display:inline;overflow:visible;visibility:visible;opacity:0.339;isolation:auto;mix-blend-mode:normal;color-interpolation:sRGB;color-interpolation-filters:linearRGB;solid-color:#000000;solid-opacity:1;vector-effect:none;fill:#ffffff;fill-opacity:1;fill-rule:nonzero;stroke:none;stroke-width:1;stroke-linecap:butt;stroke-linejoin:miter;stroke-miterlimit:4;stroke-dasharray:none;stroke-dashoffset:0;stroke-opacity:1;marker:none;paint-order:stroke fill markers;color-rendering:auto;image-rendering:auto;shape-rendering:auto;text-rendering:auto;enable-background:accumulate;font-variation-settings:normal;-inkscape-stroke:none;stop-color:#000000;stop-opacity:1"
                 d="m 412.3445,70.172441 v -0.158037 c 0,-0.581988 0.46848,-1.050463 1.05046,-1.050465 l 8.57942,3e-6 c 0.58198,-3e-6 1.05045,0.46848 1.05045,1.05046 v 8.579415 c 0,0.581987 -0.46847,1.050458 -1.05045,1.050462 l -0.15804,-10e-7 z"
                 id="path334" /><path
                 id="path336"
                 d="m 428.10555,67.511327 -0.0698,0.06984 c -0.25719,0.257192 -0.67125,0.257195 -0.92844,7e-6 l -3.79144,-3.791443 c -0.2572,-0.257196 -0.25719,-0.671253 0,-0.928446 l 3.79144,-3.791442 c 0.25719,-0.257191 0.67125,-0.257194 0.92844,3e-6 l 0.0699,0.06986 z"
                 style="color:#000000;clip-rule:nonzero;display:inline;overflow:visible;visibility:visible;opacity:0.339;isolation:auto;mix-blend-mode:normal;color-interpolation:sRGB;color-interpolation-filters:linearRGB;solid-color:#000000;solid-opacity:1;vector-effect:none;fill:#ffffff;fill-opacity:1;fill-rule:nonzero;stroke:none;stroke-width:1;stroke-linecap:butt;stroke-linejoin:miter;stroke-miterlimit:4;stroke-dasharray:none;stroke-dashoffset:0;stroke-opacity:1;marker:none;paint-order:stroke fill markers;color-rendering:auto;image-rendering:auto;shape-rendering:auto;text-rendering:auto;enable-background:accumulate;font-variation-settings:normal;-inkscape-stroke:none;stop-color:#000000;stop-opacity:1"
                 inkscape:connector-curvature="0" /><path
                 inkscape:connector-curvature="0"
                 style="color:#000000;clip-rule:nonzero;display:inline;overflow:visible;visibility:visible;opacity:0.339;isolation:auto;mix-blend-mode:normal;color-interpolation:sRGB;color-interpolation-filters:linearRGB;solid-color:#000000;solid-opacity:1;vector-effect:none;fill:#ffffff;fill-opacity:1;fill-rule:nonzero;stroke:none;stroke-width:1;stroke-linecap:butt;stroke-linejoin:miter;stroke-miterlimit:4;stroke-dasharray:none;stroke-dashoffset:0;stroke-opacity:1;marker:none;paint-order:stroke fill markers;color-rendering:auto;image-rendering:auto;shape-rendering:auto;text-rendering:auto;enable-background:accumulate;font-variation-settings:normal;-inkscape-stroke:none;stop-color:#000000;stop-opacity:1"
                 d="m 405.04487,78.26427 0.0699,0.06986 c 0.2572,0.257196 0.2572,0.671251 0,0.928443 l -3.79144,3.791443 c -0.25719,0.257191 -0.67125,0.257193 -0.92844,-3e-6 l -3.79144,-3.791442 c -0.25719,-0.25719 -0.25719,-0.671244 0,-0.928437 l 0.0698,-0.06984 z"
                 id="path338" /><path
                 style="color:#000000;clip-rule:nonzero;display:inline;overflow:visible;visibility:visible;opacity:0.339;isolation:auto;mix-blend-mode:normal;color-interpolation:sRGB;color-interpolation-filters:linearRGB;solid-color:#000000;solid-opacity:1;vector-effect:none;fill:#ffffff;fill-opacity:1;fill-rule:nonzero;stroke:none;stroke-width:1;stroke-linecap:butt;stroke-linejoin:miter;stroke-miterlimit:4;stroke-dasharray:none;stroke-dashoffset:0;stroke-opacity:1;marker:none;paint-order:stroke fill markers;color-rendering:auto;image-rendering:auto;shape-rendering:auto;text-rendering:auto;enable-background:accumulate;font-variation-settings:normal;-inkscape-stroke:none;stop-color:#000000;stop-opacity:1"
                 d="m 404.48451,63.740072 c 0.0425,-0.191053 0.15775,-0.36624 0.337,-0.479901 l 5.27757,-3.354293 c 0.358,-0.227571 0.82926,-0.122604 1.05683,0.235405 l 0.0617,0.09693 -2.36371,10.612227 -0.008,0.0045 c -0.0273,0.218361 -0.14512,0.423803 -0.34617,0.55164 l -5.27773,3.354924 c -0.35801,0.227576 -0.82926,0.122612 -1.05682,-0.235393 l -0.0616,-0.09702 2.36385,-10.612869 0.008,-0.0045 c 0.003,-0.02387 0.004,-0.04818 0.009,-0.07171 z"
                 id="path340"
                 inkscape:connector-curvature="0"
                 sodipodi:nodetypes="cccccccccccccsc" /></g></g></g></g></g><g
       id="g1187"
       transform="translate(-133.97781,203.0699)"
       style="font-variation-settings:normal;opacity:0.747028;vector-effect:none;fill:#ffffff;fill-opacity:1;stroke:none;stroke-width:2.29998;stroke-linecap:round;stroke-linejoin:round;stroke-miterlimit:1;stroke-dasharray:none;stroke-dashoffset:0;stroke-opacity:1;-inkscape-stroke:none;marker:none;paint-order:stroke fill markers;stop-color:#000000;stop-opacity:1"><rect
         style="color:#000000;font-variation-settings:normal;clip-rule:nonzero;display:inline;overflow:visible;visibility:visible;isolation:auto;mix-blend-mode:normal;color-interpolation:sRGB;color-interpolation-filters:linearRGB;solid-color:#000000;solid-opacity:1;vector-effect:none;fill:#ffffff;fill-opacity:1;fill-rule:nonzero;stroke:none;stroke-width:2.29998;stroke-linecap:round;stroke-linejoin:round;stroke-miterlimit:1;stroke-dasharray:none;stroke-dashoffset:0;stroke-opacity:1;-inkscape-stroke:none;marker:none;paint-order:stroke fill markers;color-rendering:auto;image-rendering:auto;shape-rendering:auto;text-rendering:auto;enable-background:accumulate;stop-color:#000000;stop-opacity:1"
         id="rect4766"
         width="19.749012"
         height="19.749012"
         x="76.923836"
         y="171.42188"
         ry="1.9425249"
         transform="rotate(-44.91353)" /><path
         id="path4777"
         d="m 173.81436,41.45766 0.18855,-0.185256 c 0.69487,-0.682235 1.8124,-0.681885 2.5058,6.4e-4 l 10.22211,10.062036 c 0.69311,0.68286 0.69224,1.781107 -0.003,2.463267 L 176.4844,63.854651 c -0.69485,0.6822 -1.8124,0.68183 -2.5058,-6.3e-4 l -0.18833,-0.18523 z"
         style="color:#000000;font-variation-settings:normal;clip-rule:nonzero;display:inline;overflow:visible;visibility:visible;isolation:auto;mix-blend-mode:normal;color-interpolation:sRGB;color-interpolation-filters:linearRGB;solid-color:#000000;solid-opacity:1;vector-effect:none;fill:#ffffff;fill-opacity:1;fill-rule:nonzero;stroke:none;stroke-width:2.29998;stroke-linecap:round;stroke-linejoin:round;stroke-miterlimit:1;stroke-dasharray:none;stroke-dashoffset:0;stroke-opacity:1;-inkscape-stroke:none;marker:none;paint-order:stroke fill markers;color-rendering:auto;image-rendering:auto;shape-rendering:auto;text-rendering:auto;enable-background:accumulate;stop-color:#000000;stop-opacity:1"
         inkscape:connector-curvature="0" /><path
         style="color:#000000;font-variation-settings:normal;clip-rule:nonzero;display:inline;overflow:visible;visibility:visible;isolation:auto;mix-blend-mode:normal;color-interpolation:sRGB;color-interpolation-filters:linearRGB;solid-color:#000000;solid-opacity:1;vector-effect:none;fill:#ffffff;fill-opacity:1;fill-rule:nonzero;stroke:none;stroke-width:2.29998;stroke-linecap:round;stroke-linejoin:round;stroke-miterlimit:1;stroke-dasharray:none;stroke-dashoffset:0;stroke-opacity:1;-inkscape-stroke:none;marker:none;paint-order:stroke fill markers;color-rendering:auto;image-rendering:auto;shape-rendering:auto;text-rendering:auto;enable-background:accumulate;stop-color:#000000;stop-opacity:1"
         d="m 299.66203,105.68684 c 0.43462,-0.003 0.86858,-0.17195 1.19919,-0.50736 l 9.74645,-9.889576 c 0.66112,-0.671016 0.65351,-1.742862 -0.0174,-2.404113 l -0.18185,-0.179018 -24.14068,0.174142 -0.0149,0.01633 c -0.48676,-0.0426 -0.98778,0.117161 -1.35914,0.494021 l -9.74794,9.889644 c -0.66108,0.67098 -0.6535,1.74284 0.0173,2.40411 l 0.18184,0.17901 24.14222,-0.17416 0.0135,-0.0145 c 0.0532,0.005 0.10657,0.0141 0.16003,0.0132 z"
         id="path4781"
         inkscape:connector-curvature="0"
         sodipodi:nodetypes="cccccccccccccsc" /><path
         style="color:#000000;font-variation-settings:normal;clip-rule:nonzero;display:inline;overflow:visible;visibility:visible;isolation:auto;mix-blend-mode:normal;color-interpolation:sRGB;color-interpolation-filters:linearRGB;solid-color:#000000;solid-opacity:1;vector-effect:none;fill:#ffffff;fill-opacity:1;fill-rule:nonzero;stroke:none;stroke-width:2.29998;stroke-linecap:round;stroke-linejoin:round;stroke-miterlimit:1;stroke-dasharray:none;stroke-dashoffset:0;stroke-opacity:1;-inkscape-stroke:none;marker:none;paint-order:stroke fill markers;color-rendering:auto;image-rendering:auto;shape-rendering:auto;text-rendering:auto;enable-background:accumulate;stop-color:#000000;stop-opacity:1"
         d="m 227.63588,97.639865 0.38061,-0.381577 c 1.4012,-1.405449 1.39861,-3.664371 -0.007,-5.065885 L 207.29606,71.531514 c -1.40475,-1.401917 -3.66436,-1.398642 -5.06588,0.006 l -20.66089,20.713914 c -1.4012,1.405446 -1.39861,3.664341 0.006,5.065883 l 0.38158,0.380584 z"
         id="rect4768"
         inkscape:connector-curvature="0" /><path
         id="path4773"
         d="m 272.59361,106.63433 0.38461,-0.37754 c 1.41556,-1.39095 1.43541,-3.65011 0.0445,-5.06568 l -20.5051,-20.868104 c -1.39097,-1.415579 -3.65012,-1.435411 -5.06569,-0.0444 l -20.86817,20.505054 c -1.41559,1.39098 -1.43539,3.6501 -0.0444,5.0657 l 0.37751,0.38459 z"
         style="color:#000000;font-variation-settings:normal;clip-rule:nonzero;display:inline;overflow:visible;visibility:visible;isolation:auto;mix-blend-mode:normal;color-interpolation:sRGB;color-interpolation-filters:linearRGB;solid-color:#000000;solid-opacity:1;vector-effect:none;fill:#ffffff;fill-opacity:1;fill-rule:nonzero;stroke:none;stroke-width:2.29998;stroke-linecap:round;stroke-linejoin:round;stroke-miterlimit:1;stroke-dasharray:none;stroke-dashoffset:0;stroke-opacity:1;-inkscape-stroke:none;marker:none;paint-order:stroke fill markers;color-rendering:auto;image-rendering:auto;shape-rendering:auto;text-rendering:auto;enable-background:accumulate;stop-color:#000000;stop-opacity:1"
         inkscape:connector-curvature="0" /><path
         inkscape:connector-curvature="0"
         style="color:#000000;font-variation-settings:normal;clip-rule:nonzero;display:inline;overflow:visible;visibility:visible;isolation:auto;mix-blend-mode:normal;color-interpolation:sRGB;color-interpolation-filters:linearRGB;solid-color:#000000;solid-opacity:1;vector-effect:none;fill:#ffffff;fill-opacity:1;fill-rule:nonzero;stroke:none;stroke-width:2.29998;stroke-linecap:round;stroke-linejoin:round;stroke-miterlimit:1;stroke-dasharray:none;stroke-dashoffset:0;stroke-opacity:1;-inkscape-stroke:none;marker:none;paint-order:stroke fill markers;color-rendering:auto;image-rendering:auto;shape-rendering:auto;text-rendering:auto;enable-background:accumulate;stop-color:#000000;stop-opacity:1"
         d="m 216.75053,75.238673 -0.24811,0.24814 c -0.91378,0.91379 -0.9138,2.38487 -3e-5,3.29864 l 13.4705,13.47049 c 0.91376,0.91379 2.38486,0.91376 3.29863,-1e-5 l 13.47051,-13.47048 c 0.91376,-0.91377 0.91376,-2.38487 -1e-5,-3.29863 l -0.2481,-0.24813 z"
         id="path4775" /><path
         inkscape:connector-curvature="0"
         style="color:#000000;font-variation-settings:normal;clip-rule:nonzero;display:inline;overflow:visible;visibility:visible;isolation:auto;mix-blend-mode:normal;color-interpolation:sRGB;color-interpolation-filters:linearRGB;solid-color:#000000;solid-opacity:1;vector-effect:none;fill:#ffffff;fill-opacity:1;fill-rule:nonzero;stroke:none;stroke-width:2.29998;stroke-linecap:round;stroke-linejoin:round;stroke-miterlimit:1;stroke-dasharray:none;stroke-dashoffset:0;stroke-opacity:1;-inkscape-stroke:none;marker:none;paint-order:stroke fill markers;color-rendering:auto;image-rendering:auto;shape-rendering:auto;text-rendering:auto;enable-background:accumulate;stop-color:#000000;stop-opacity:1"
         d="m 205.23035,41.380544 -0.18517,-0.18377 c -0.68375,-0.67526 -1.7777,-0.668417 -2.45292,0.0149 l -9.95583,10.077796 c -0.67538,0.68357 -0.66842,1.777647 0.015,2.452897 l 10.07781,9.955754 c 0.68373,0.67524 1.77766,0.66843 2.45292,-0.0149 l 0.18308,-0.18591 z"
         id="path4779" /></g></g></svg>
