<?xml version="1.0" encoding="UTF-8" standalone="no"?>
<svg
   xmlns:dc="http://purl.org/dc/elements/1.1/"
   xmlns:cc="http://creativecommons.org/ns#"
   xmlns:rdf="http://www.w3.org/1999/02/22-rdf-syntax-ns#"
   xmlns:svg="http://www.w3.org/2000/svg"
   xmlns="http://www.w3.org/2000/svg"
   xmlns:sodipodi="http://sodipodi.sourceforge.net/DTD/sodipodi-0.dtd"
   xmlns:inkscape="http://www.inkscape.org/namespaces/inkscape"
   height="526"
   width="1920"
   version="1.1"
   viewBox="0 0 507.99999 139.17084"
   id="svg88"
   sodipodi:docname="banner-8stepPenguin.svg"
   inkscape:version="0.92.4 (unknown)"
   inkscape:export-filename="/home/cibersheep/Ubuntu_Touch_Projects/design/OTA8/banner-8stepPenguin.png"
   inkscape:export-xdpi="150"
   inkscape:export-ydpi="150">
  <metadata
     id="metadata92">
    <rdf:RDF>
      <cc:Work
         rdf:about="">
        <dc:format>image/svg+xml</dc:format>
        <dc:type
           rdf:resource="http://purl.org/dc/dcmitype/StillImage" />
        <dc:title></dc:title>
      </cc:Work>
    </rdf:RDF>
  </metadata>
  <sodipodi:namedview
     pagecolor="#ffffff"
     bordercolor="#666666"
     borderopacity="1"
     objecttolerance="10"
     gridtolerance="10"
     guidetolerance="10"
     inkscape:pageopacity="0"
     inkscape:pageshadow="2"
     inkscape:window-width="1859"
     inkscape:window-height="1056"
     id="namedview90"
     showgrid="false"
     inkscape:zoom="0.55336507"
     inkscape:cx="853.85062"
     inkscape:cy="487.59016"
     inkscape:window-x="61"
     inkscape:window-y="24"
     inkscape:window-maximized="1"
     inkscape:current-layer="g86" />
  <defs
     id="defs10">
    <linearGradient
       id="a"
       y2="298.1"
       gradientUnits="userSpaceOnUse"
       x2="509.6"
       y1="158.5"
       x1=".5474"
       gradientTransform="translate(0,-148.16669)">
      <stop
         style="stop-color:#e9befe"
         offset="0"
         id="stop2" />
      <stop
         style="stop-color:#b795c9"
         offset="1"
         id="stop4" />
    </linearGradient>
    <filter
       id="b"
       style="color-interpolation-filters:sRGB"
       height="1.114"
       width="1.09"
       y="-.05690"
       x="-.04523">
      <feGaussianBlur
         stdDeviation="1.647103"
         id="feGaussianBlur7" />
    </filter>
    <filter
       inkscape:collect="always"
       style="color-interpolation-filters:sRGB"
       id="filter5134"
       x="-0.058525821"
       width="1.1170516"
       y="-0.061550362"
       height="1.1231007">
      <feGaussianBlur
         inkscape:collect="always"
         stdDeviation="2.6408858"
         id="feGaussianBlur5136" />
    </filter>
  </defs>
  <g
     transform="translate(0,-157.8)"
     id="g86">
    <rect
       style="color:#000000;opacity:0.4;isolation:auto;mix-blend-mode:normal;solid-color:#000000;fill:#198400;paint-order:markers fill stroke;color-rendering:auto;image-rendering:auto;shape-rendering:auto"
       height="139.60001"
       width="509.10001"
       y="158.5"
       x="0.5474"
       id="rect66" />
    <rect
       style="color:#000000;opacity:0.1;isolation:auto;mix-blend-mode:normal;solid-color:#000000;fill:#e5e5e5;paint-order:markers fill stroke;color-rendering:auto;image-rendering:auto;shape-rendering:auto"
       height="74.639999"
       width="509.10001"
       y="223.5"
       x="0.5474"
       id="rect84" />
    <g
       id="g5114"
       transform="translate(2.8036737)">
      <g
         style="fill:#198400;fill-opacity:1"
         id="g16"
         transform="matrix(0.4423,-0.4423,0.4423,0.4423,83.72888,127.72814)">
        <rect
           id="rect14"
           x="-185.718"
           y="39.598015"
           width="81.93"
           height="81.93"
           style="color:#000000;isolation:auto;mix-blend-mode:normal;solid-color:#000000;fill:#198400;fill-opacity:1;paint-order:markers fill stroke;color-rendering:auto;image-rendering:auto;shape-rendering:auto" />
      </g>
      <g
         transform="translate(43.791073,264.02507)"
         id="g4856">
        <path
           inkscape:connector-curvature="0"
           id="path4850"
           d="m 88.500546,-95.099816 -36.237584,36.238099 7.258989,7.258989 h 57.957199 l 7.25899,-7.258989 z"
           style="color:#000000;isolation:auto;mix-blend-mode:normal;solid-color:#000000;fill:#198400;fill-opacity:1;stroke-width:0.62550664;paint-order:markers fill stroke;color-rendering:auto;image-rendering:auto;shape-rendering:auto" />
        <path
           inkscape:connector-curvature="0"
           id="path4852"
           d="M 88.500546,-77.637316 62.319196,-51.45545 H 114.6819 Z"
           style="color:#000000;isolation:auto;mix-blend-mode:normal;solid-color:#000000;fill:#f5f5f5;fill-opacity:1;stroke-width:0.62550664;paint-order:markers fill stroke;color-rendering:auto;image-rendering:auto;shape-rendering:auto" />
      </g>
      <g
         transform="translate(-56.750586,327.52511)"
         id="g4869">
        <path
           style="color:#000000;isolation:auto;mix-blend-mode:normal;solid-color:#000000;fill:#198400;fill-opacity:1;stroke-width:0.62550664;paint-order:markers fill stroke;color-rendering:auto;image-rendering:auto;shape-rendering:auto"
           d="m 189.04225,-95.099816 -36.2376,36.238099 7.259,7.258989 h 57.95721 l 7.25899,-7.258989 z"
           id="rect4837"
           inkscape:connector-curvature="0" />
        <path
           inkscape:connector-curvature="0"
           style="color:#000000;isolation:auto;mix-blend-mode:normal;solid-color:#000000;fill:#f5f5f5;fill-opacity:1;stroke-width:2.36411953;paint-order:markers fill stroke;color-rendering:auto;image-rendering:auto;shape-rendering:auto"
           d="m 687.42383,-862.77539 -71.88672,71.88867 h 197.90625 l -71.88672,-71.88867 z"
           transform="matrix(0.26458334,0,0,0.26458334,0,157.8)"
           id="path4845" />
        <path
           style="color:#000000;opacity:0.70999995;isolation:auto;mix-blend-mode:normal;solid-color:#000000;fill:#198400;fill-opacity:1;stroke-width:0.62550664;paint-order:markers fill stroke;color-rendering:auto;image-rendering:auto;shape-rendering:auto"
           d="m 180.20712,-70.873904 8.83511,8.83512 8.83512,-8.83512 z"
           id="path4858"
           inkscape:connector-curvature="0" />
      </g>
    </g>
    <g
       id="g5103"
       transform="translate(129.80369,-16.901579)">
      <g
         transform="translate(312.66418,229.55297)"
         id="g4891">
        <path
           inkscape:connector-curvature="0"
           id="path4879"
           d="m -23.682842,-37.949815 -36.237577,36.2381004 7.25899,7.2589892 H 5.2957619 l 7.2589901,-7.2589892 z"
           style="color:#000000;isolation:auto;mix-blend-mode:normal;solid-color:#000000;fill:#f5f5f5;fill-opacity:1;stroke-width:0.62550664;paint-order:markers fill stroke;color-rendering:auto;image-rendering:auto;shape-rendering:auto" />
        <path
           inkscape:connector-curvature="0"
           style="color:#000000;opacity:0.1;isolation:auto;mix-blend-mode:normal;solid-color:#000000;fill:#000000;fill-opacity:1;stroke-width:2.36411953;paint-order:markers fill stroke;color-rendering:auto;image-rendering:auto;shape-rendering:auto"
           d="m -138.07422,-691.27734 -88.39648,88.39843 27.43554,27.43555 h 60.96094 z"
           transform="matrix(0.26458334,0,0,0.26458334,0,157.8)"
           id="path4871" />
        <path
           id="path4886"
           d="M -10.70787,-25.100467 12.680365,-1.7117156 5.4213772,5.5472738 H -10.70787 Z"
           style="color:#000000;opacity:0.1;isolation:auto;mix-blend-mode:normal;solid-color:#000000;fill:#000000;fill-opacity:1;stroke-width:0.62550664;paint-order:markers fill stroke;color-rendering:auto;image-rendering:auto;shape-rendering:auto"
           inkscape:connector-curvature="0" />
      </g>
      <g
         id="g5079">
        <g
           transform="translate(258.85991,238.37211)"
           id="g4947">
          <path
             style="color:#000000;isolation:auto;mix-blend-mode:normal;solid-color:#000000;fill:#f5f5f5;fill-opacity:1;stroke-width:0.62550664;paint-order:markers fill stroke;color-rendering:auto;image-rendering:auto;shape-rendering:auto"
             d="M -23.682591,14.96663 -36.531938,27.815975 V 58.46372 h 25.824265 V 27.941549 Z"
             id="path4926"
             inkscape:connector-curvature="0" />
          <path
             style="fill:#198400;fill-opacity:1;fill-rule:evenodd;stroke:none;stroke-width:0.26458335px;stroke-linecap:butt;stroke-linejoin:miter;stroke-opacity:1"
             d="m -36.825163,28.117608 21.157486,21.755153 -7.650165,8.725967 L -37.06423,43.89607 Z"
             id="path4936"
             inkscape:connector-curvature="0" />
          <path
             style="fill:#198400;fill-opacity:1;fill-rule:evenodd;stroke:none;stroke-width:0.26458335px;stroke-linecap:butt;stroke-linejoin:miter;stroke-opacity:1"
             d="m -10.615172,28.117766 -12.529935,12.877717 7.88634,8.108551 4.882858,-5.207904 z"
             id="path4938"
             inkscape:connector-curvature="0"
             sodipodi:nodetypes="ccccc" />
        </g>
        <g
           transform="matrix(0.8068948,0,0,0.8068948,370.97012,238.29315)"
           id="g5003">
          <path
             style="color:#000000;isolation:auto;mix-blend-mode:normal;solid-color:#000000;fill:#f5f5f5;fill-opacity:1;stroke-width:0.76848936;paint-order:markers fill stroke;color-rendering:auto;image-rendering:auto;shape-rendering:auto"
             d="M -105.81956,19.280397 -121.6061,35.066936 V 72.72036 h 31.727354 V 35.221215 Z"
             id="path4976"
             inkscape:connector-curvature="0" />
          <path
             inkscape:connector-curvature="0"
             style="fill:#198400;fill-opacity:1;fill-rule:evenodd;stroke:none;stroke-width:1.22858715px;stroke-linecap:butt;stroke-linejoin:miter;stroke-opacity:1"
             d="m -213.81836,-462.98047 -1.10937,73.26563 33.47656,35.80664 v -75.79102 z"
             transform="matrix(0.26458334,0,0,0.26458334,-65.393742,157.93465)"
             id="path4978" />
          <path
             style="fill:#dddddd;fill-opacity:1;fill-rule:evenodd;stroke:none;stroke-width:0.26458335px;stroke-linecap:butt;stroke-linejoin:miter;stroke-opacity:1"
             d="m -131.28136,60.778711 17.91891,-16.904634 v 28.778332 l -8.79041,-0.02384 z"
             id="path4984"
             inkscape:connector-curvature="0"
             sodipodi:nodetypes="ccccc" />
          <path
             id="path4996"
             d="m -89.883711,35.437731 0.29352,19.384865 -8.857328,9.47384 V 44.243395 Z"
             style="fill:#198400;fill-opacity:1;fill-rule:evenodd;stroke:none;stroke-width:0.32506371px;stroke-linecap:butt;stroke-linejoin:miter;stroke-opacity:1"
             inkscape:connector-curvature="0" />
          <path
             sodipodi:nodetypes="ccccc"
             inkscape:connector-curvature="0"
             id="path4988"
             d="m -80.800463,60.778711 -17.91891,-16.904634 v 28.778332 l 8.790407,-0.02384 z"
             style="fill:#dddddd;fill-opacity:1;fill-rule:evenodd;stroke:none;stroke-width:0.26458335px;stroke-linecap:butt;stroke-linejoin:miter;stroke-opacity:1" />
        </g>
        <g
           id="g5015"
           transform="matrix(0.8068948,0,0,0.8068948,421.32106,238.29316)">
          <path
             inkscape:connector-curvature="0"
             id="path5005"
             transform="matrix(0.32790314,0,0,0.32790314,-105.86305,193.5232)"
             d="m -16.121094,-515.13086 -31.890625,31.89063 v 114.83007 h 96.757813 v -114.36132 l -32.359375,-32.35938 z"
             style="color:#000000;isolation:auto;mix-blend-mode:normal;solid-color:#000000;fill:#f5f5f5;fill-opacity:1;stroke-width:2.34364748;paint-order:markers fill stroke;color-rendering:auto;image-rendering:auto;shape-rendering:auto" />
          <path
             id="path5007"
             transform="matrix(0.26458334,0,0,0.26458334,-65.393742,157.93465)"
             d="m -213.81836,-462.98047 -1.10937,73.26563 33.47656,35.80664 v -75.79102 z"
             style="fill:#198400;fill-opacity:1;fill-rule:evenodd;stroke:none;stroke-width:1.22858715px;stroke-linecap:butt;stroke-linejoin:miter;stroke-opacity:1"
             inkscape:connector-curvature="0" />
          <path
             sodipodi:nodetypes="ccccc"
             inkscape:connector-curvature="0"
             id="path5009"
             d="m -131.28136,60.778711 17.91891,-16.904634 v 28.778332 l -8.79041,0.02854 z"
             style="fill:#dddddd;fill-opacity:1;fill-rule:evenodd;stroke:none;stroke-width:0.26458335px;stroke-linecap:butt;stroke-linejoin:miter;stroke-opacity:1" />
          <path
             inkscape:connector-curvature="0"
             style="fill:#198400;fill-opacity:1;fill-rule:evenodd;stroke:none;stroke-width:0.32506371px;stroke-linecap:butt;stroke-linejoin:miter;stroke-opacity:1"
             d="m -89.883711,35.437731 0.29352,19.384865 -8.857328,9.47384 V 44.243395 Z"
             id="path5011" />
          <path
             style="fill:#dddddd;fill-opacity:1;fill-rule:evenodd;stroke:none;stroke-width:0.26458335px;stroke-linecap:butt;stroke-linejoin:miter;stroke-opacity:1"
             d="m -80.590961,60.778711 -17.91891,-16.904634 v 28.778332 l 8.790407,-0.02384 z"
             id="path5013"
             inkscape:connector-curvature="0"
             sodipodi:nodetypes="ccccc" />
          <path
             inkscape:connector-curvature="0"
             id="path5020"
             d="m -111.14921,24.610173 h 10.6181 l -5.3687,6.203835 z"
             style="fill:#198400;fill-opacity:1;fill-rule:evenodd;stroke:none;stroke-width:0.26407582px;stroke-linecap:butt;stroke-linejoin:miter;stroke-opacity:1" />
        </g>
      </g>
    </g>
    <path
       style="opacity:0.2;fill:#000000;fill-opacity:1;fill-rule:evenodd;stroke:none;stroke-width:0.27475154px;stroke-linecap:butt;stroke-linejoin:miter;stroke-opacity:1;filter:url(#filter5134)"
       d="m 244.53152,177.5675 -23.51123,23.51124 -0.32349,34.35709 -19.59157,20.2613 19.13268,22.40277 -0.0279,2.44223 h 69.57972 v -1.88103 l 19.61173,-22.96397 -19.61173,-20.28197 v -0.16329 l -0.0636,-0.0615 0.0863,-34.37311 -22.29218,-23.24976 z m -19.28875,53.81225 -4.3589,4.40335 v -0.22841 z"
       id="path5116"
       inkscape:connector-curvature="0" />
    <g
       transform="translate(205.4878,211.92214)"
       id="g5037">
      <path
         style="fill:#f5f5f5;fill-opacity:1;fill-rule:evenodd;stroke:none;stroke-width:0.27475154px;stroke-linecap:butt;stroke-linejoin:miter;stroke-opacity:1"
         d="M 13.468641,67.366615 H 83.048629 V 22.076533 L 65.328772,4.9753994 31.423173,5.1521764 13.974819,22.777305 Z"
         id="path5030"
         inkscape:connector-curvature="0"
         sodipodi:nodetypes="ccccccc" />
      <path
         style="fill:#198400;fill-opacity:1;fill-rule:evenodd;stroke:none;stroke-width:0.26458335px;stroke-linecap:butt;stroke-linejoin:miter;stroke-opacity:1"
         d="M 82.881921,65.681054 102.66035,42.521706 82.881921,22.067102 Z"
         id="path5022"
         inkscape:connector-curvature="0" />
      <path
         inkscape:connector-curvature="0"
         id="path5024"
         d="M 14.142481,65.681054 -5.6359353,42.521706 14.142481,22.067102 Z"
         style="fill:#198400;fill-opacity:1;fill-rule:evenodd;stroke:none;stroke-width:0.26458335px;stroke-linecap:butt;stroke-linejoin:miter;stroke-opacity:1" />
      <path
         style="fill:#59a547;fill-opacity:1;fill-rule:evenodd;stroke:none;stroke-width:0.27475154px;stroke-linecap:butt;stroke-linejoin:miter;stroke-opacity:1"
         d="M 48.304371,25.060767 65.419808,4.8733293 H 31.627791 Z"
         id="path5026"
         inkscape:connector-curvature="0" />
      <path
         style="fill:#198400;fill-opacity:1;fill-rule:evenodd;stroke:none;stroke-width:0.27258345px;stroke-linecap:butt;stroke-linejoin:miter;stroke-opacity:1"
         d="M 82.984127,22.386419 65.394195,5.318962 H 31.955913 l -18.00271,17.241614 0.325702,-34.657382 23.511292,-23.511292 h 22.988818 l 22.292189,23.250057 z"
         id="path5028"
         inkscape:connector-curvature="0"
         sodipodi:nodetypes="ccccccccc" />
    </g>
  </g>
</svg>
