<?xml version="1.0" encoding="utf-8"?>
<!-- Generator: Adobe Illustrator 24.3.0, SVG Export Plug-In . SVG Version: 6.00 Build 0)  -->
<svg version="1.1" id="Laag_1" xmlns="http://www.w3.org/2000/svg" xmlns:xlink="http://www.w3.org/1999/xlink" x="0px" y="0px"
	 viewBox="0 0 1272.2 1272.2" style="enable-background:new 0 0 1272.2 1272.2;" xml:space="preserve">
<style type="text/css">
	.st0{clip-path:url(#SVGID_3_);fill:url(#SVGID_4_);}
	.st1{clip-path:url(#SVGID_3_);fill:url(#SVGID_5_);}
	.st2{clip-path:url(#SVGID_8_);fill:url(#SVGID_9_);}
	.st3{clip-path:url(#SVGID_8_);fill:url(#SVGID_10_);}
	.st4{clip-path:url(#SVGID_12_);fill:none;}
</style>
<g>
	<defs>
		<path id="SVGID_1_" d="M576.9,426.4C707.5,324.2,813.7,155.7,989.3,304c175.5,148.3,340,700,28.7,653.1
			c-311.3-46.9-373.2,51.6-543.9,34.2C303.4,973.9,157,823,201.6,669.4C248.8,506.7,446.2,528.6,576.9,426.4z"/>
	</defs>
	<linearGradient id="SVGID_2_" gradientUnits="userSpaceOnUse" x1="193.513" y1="619.4822" x2="1192.962" y2="619.4822">
		<stop  offset="0" style="stop-color:#8C3684"/>
		<stop  offset="0.9976" style="stop-color:#E85521"/>
	</linearGradient>
	<use xlink:href="#SVGID_1_"  style="overflow:visible;fill-rule:evenodd;clip-rule:evenodd;fill:url(#SVGID_2_);"/>
	<clipPath id="SVGID_3_">
		<use xlink:href="#SVGID_1_"  style="overflow:visible;"/>
	</clipPath>
	<linearGradient id="SVGID_4_" gradientUnits="userSpaceOnUse" x1="196.7045" y1="611.6962" x2="1210.1316" y2="611.6962">
		<stop  offset="0" style="stop-color:#8C3684"/>
		<stop  offset="0.9976" style="stop-color:#E85521"/>
	</linearGradient>
	<rect x="196.7" y="231.4" class="st0" width="1013.4" height="760.6"/>
	<linearGradient id="SVGID_5_" gradientUnits="userSpaceOnUse" x1="-730.0415" y1="735.441" x2="1282.8345" y2="735.441">
		<stop  offset="0" style="stop-color:#8C3684"/>
		<stop  offset="0.9976" style="stop-color:#E85521"/>
	</linearGradient>
	<rect x="-730" y="224.9" class="st1" width="2012.9" height="1021"/>
</g>
<g>
	<defs>
		<path id="SVGID_6_" d="M495.4,462.9c137.8-106.7,249.9-282.6,435.1-127.8c185.2,154.8,358.7,730.7,30.3,681.8
			C632.3,968,567,1070.8,387,1052.6c-180-18.2-334.5-175.7-287.5-336.1C149.3,546.7,357.6,569.6,495.4,462.9z"/>
	</defs>
	<linearGradient id="SVGID_7_" gradientUnits="userSpaceOnUse" x1="90.97" y1="664.4201" x2="1145.3882" y2="664.4201">
		<stop  offset="0" style="stop-color:#8C3684"/>
		<stop  offset="0.9976" style="stop-color:#E85521"/>
	</linearGradient>
	<use xlink:href="#SVGID_6_"  style="overflow:visible;fill-rule:evenodd;clip-rule:evenodd;fill:url(#SVGID_7_);"/>
	<clipPath id="SVGID_8_">
		<use xlink:href="#SVGID_6_"  style="overflow:visible;"/>
	</clipPath>
	<linearGradient id="SVGID_9_" gradientUnits="userSpaceOnUse" x1="94.3369" y1="656.2919" x2="1163.5021" y2="656.2919">
		<stop  offset="0" style="stop-color:#8C3684"/>
		<stop  offset="0.9976" style="stop-color:#E85521"/>
	</linearGradient>
	<rect x="94.3" y="259.3" class="st2" width="1069.2" height="794.1"/>
	<linearGradient id="SVGID_10_" gradientUnits="userSpaceOnUse" x1="-883.3796" y1="785.4757" x2="1240.2035" y2="785.4757">
		<stop  offset="0" style="stop-color:#8C3684"/>
		<stop  offset="0.9976" style="stop-color:#E85521"/>
	</linearGradient>
	<rect x="-883.4" y="252.5" class="st3" width="2123.6" height="1065.9"/>
</g>
<g>
	<defs>
		<path id="SVGID_11_" d="M524.9,433.6C662.7,326.9,774.8,151,959.9,305.8c185.2,154.8,358.7,730.7,30.3,681.8
			c-328.5-48.9-393.7,53.9-573.8,35.7c-180-18.2-334.5-175.7-287.5-336.1C178.8,517.4,387.1,540.3,524.9,433.6z"/>
	</defs>
	<clipPath id="SVGID_12_">
		<use xlink:href="#SVGID_11_"  style="overflow:visible;"/>
	</clipPath>
	<g transform="matrix(1 0 0 1 -7.629395e-06 0)" style="clip-path:url(#SVGID_12_);">
		
			<image style="overflow:visible;" width="6336" height="9504" xlink:href="29D1FDDC550366F8.jpg"  transform="matrix(0.2019 0 0 0.2019 120.43 -355.5668)">
		</image>
	</g>
	<rect x="123.8" y="230" class="st4" width="1069.2" height="794.1"/>
	<rect x="-853.9" y="223.2" class="st4" width="2123.6" height="1065.9"/>
</g>
</svg>
