<?xml version="1.0" encoding="utf-8"?>
<!-- Generator: Adobe Illustrator 24.3.0, SVG Export Plug-In . SVG Version: 6.00 Build 0)  -->
<svg version="1.1" id="Laag_1" xmlns="http://www.w3.org/2000/svg" xmlns:xlink="http://www.w3.org/1999/xlink" x="0px" y="0px"
	 viewBox="0 0 1272.2 1272.2" style="enable-background:new 0 0 1272.2 1272.2;" xml:space="preserve">
<style type="text/css">
	.st0{fill-rule:evenodd;clip-rule:evenodd;fill:url(#SVGID_2_);}
	.st1{clip-path:url(#SVGID_4_);fill:url(#SVGID_5_);}
	.st2{clip-path:url(#SVGID_7_);fill:url(#SVGID_8_);}
	.st3{clip-path:url(#SVGID_10_);}
	.st4{clip-path:url(#SVGID_12_);fill:none;}
	.st5{clip-path:url(#SVGID_14_);fill:none;}
</style>
<g>
	<g>
		
			<linearGradient id="SVGID_2_" gradientUnits="userSpaceOnUse" x1="129.6567" y1="650.9344" x2="1167.7058" y2="650.9344" gradientTransform="matrix(1 0 0 -1 0 1272)">
			<stop  offset="0" style="stop-color:#8C3684"/>
			<stop  offset="0.9976" style="stop-color:#E85521"/>
		</linearGradient>
		<path id="SVGID_1_" class="st0" d="M721.3,192.8c-164-47.6-422.4,4.7-535.3,212.4C73,613,122.3,1200.3,403.9,1037.5
			s483.6,4.5,641.1-76.9s166-266.9,10.3-382.1C916,475.2,947.1,265,721.3,192.8z"/>
	</g>
	<g>
		<defs>
			<path id="SVGID_3_" d="M721.3,192.8c-164-47.6-422.4,4.7-535.3,212.4C73,613,122.3,1200.3,403.9,1037.5s483.6,4.5,641.1-76.9
				s166-266.9,10.3-382.1C916,475.2,947.1,265,721.3,192.8z"/>
		</defs>
		<clipPath id="SVGID_4_">
			<use xlink:href="#SVGID_3_"  style="overflow:visible;"/>
		</clipPath>
		
			<linearGradient id="SVGID_5_" gradientUnits="userSpaceOnUse" x1="-53" y1="645.05" x2="1261.6" y2="645.05" gradientTransform="matrix(1 0 0 -1 0 1272)">
			<stop  offset="0" style="stop-color:#8C3684"/>
			<stop  offset="0.9976" style="stop-color:#E85521"/>
		</linearGradient>
		<polygon class="st1" points="1261.6,889 287.4,1274 -53,412.8 902.3,-20.1 		"/>
	</g>
	<g>
		<defs>
			<path id="SVGID_6_" d="M721.3,192.8c-164-47.6-422.4,4.7-535.3,212.4C73,613,122.3,1200.3,403.9,1037.5s483.6,4.5,641.1-76.9
				s166-266.9,10.3-382.1C916,475.2,947.1,265,721.3,192.8z"/>
		</defs>
		<clipPath id="SVGID_7_">
			<use xlink:href="#SVGID_6_"  style="overflow:visible;"/>
		</clipPath>
		
			<linearGradient id="SVGID_8_" gradientUnits="userSpaceOnUse" x1="-126" y1="727.15" x2="2192.8999" y2="727.15" gradientTransform="matrix(1 0 0 -1 0 1272)">
			<stop  offset="0" style="stop-color:#8C3684"/>
			<stop  offset="0.9976" style="stop-color:#E85521"/>
		</linearGradient>
		<polygon class="st2" points="2192.9,648.1 257.9,1412.8 -126,441.6 1809.1,-323.1 		"/>
	</g>
</g>
<g>
	<g>
		<defs>
			<path id="SVGID_9_" d="M696.2,220.9c-164-47.6-422.4,4.7-535.3,212.4c-113,207.7-63.7,795.1,217.9,632.2
				c281.7-162.9,483.6,4.5,641.1-76.9s166-266.9,10.3-382.1C890.8,503.3,921.9,293.1,696.2,220.9z"/>
		</defs>
		<clipPath id="SVGID_10_">
			<use xlink:href="#SVGID_9_"  style="overflow:visible;"/>
		</clipPath>
		<g transform="matrix(1 0 0 1 0 0)" class="st3">
			
				<image style="overflow:visible;enable-background:new    ;" width="3544" height="4778" xlink:href="29DA68E90F11BB43.jpg"  transform="matrix(0.3152 0 0 0.3323 50.555 -292.7862)">
			</image>
		</g>
	</g>
	<g>
		<defs>
			<path id="SVGID_11_" d="M696.2,220.9c-164-47.6-422.4,4.7-535.3,212.4c-113,207.7-63.7,795.1,217.9,632.2
				c281.7-162.9,483.6,4.5,641.1-76.9s166-266.9,10.3-382.1C890.8,503.3,921.9,293.1,696.2,220.9z"/>
		</defs>
		<clipPath id="SVGID_12_">
			<use xlink:href="#SVGID_11_"  style="overflow:visible;"/>
		</clipPath>
		<polygon class="st4" points="1236.4,917.1 262.2,1302.1 -78.2,440.9 877.2,8 		"/>
	</g>
	<g>
		<defs>
			<path id="SVGID_13_" d="M588.6,360.3c-170,16-391.1,159.6-419.8,394.3c-28.8,234.7,233,762.9,435,507.9
				c202.1-255,451.4-173.5,568-307.1c116.6-133.6,56.3-309.2-130.8-359.1C873.4,551.4,825.1,344.5,588.6,360.3z"/>
		</defs>
		<clipPath id="SVGID_14_">
			<use xlink:href="#SVGID_13_"  style="overflow:visible;"/>
		</clipPath>
		
			<rect x="-32" y="50.8" transform="matrix(0.93 -0.3675 0.3675 0.93 -140.0118 410.6616)" class="st5" width="2080.7" height="1044.3"/>
	</g>
</g>
</svg>
