<?xml version="1.0" encoding="UTF-8" standalone="no"?>
<!-- Created with Inkscape (http://www.inkscape.org/) -->

<svg
   version="1.1"
   id="svg1"
   width="4.5cm"
   height="5.5cm"
   viewBox="0 0 170.07874 207.87401"
   sodipodi:docname="sticker-yumi-phone.jpg"
   xml:space="preserve"
   inkscape:version="1.3.2 (1:1.3.2+202311252150+091e20ef0f)"
   xmlns:inkscape="http://www.inkscape.org/namespaces/inkscape"
   xmlns:sodipodi="http://sodipodi.sourceforge.net/DTD/sodipodi-0.dtd"
   xmlns:xlink="http://www.w3.org/1999/xlink"
   xmlns="http://www.w3.org/2000/svg"
   xmlns:svg="http://www.w3.org/2000/svg"><defs
     id="defs1"><linearGradient
       id="linearGradient3"
       inkscape:collect="always"><stop
         style="stop-color:#e25c3e;stop-opacity:1;"
         offset="0"
         id="stop3" /><stop
         style="stop-color:#821c83;stop-opacity:1;"
         offset="1"
         id="stop4" /></linearGradient><clipPath
       id="clipPath18"
       clipPathUnits="userSpaceOnUse"><path
         id="path16"
         d="M 0,2500 H 2500 V 0 H 0 Z" /></clipPath><clipPath
       id="clipPath30"
       clipPathUnits="userSpaceOnUse"><path
         id="path28"
         d="M 0,2500 H 2500 V 0 H 0 Z" /></clipPath><clipPath
       id="clipPath42"
       clipPathUnits="userSpaceOnUse"><path
         id="path40"
         d="M 0,2500 H 2500 V 0 H 0 Z" /></clipPath><clipPath
       id="clipPath54"
       clipPathUnits="userSpaceOnUse"><path
         id="path52"
         d="M 0,2500 H 2500 V 0 H 0 Z" /></clipPath><clipPath
       id="clipPath66"
       clipPathUnits="userSpaceOnUse"><path
         id="path64"
         d="M 0,2500 H 2500 V 0 H 0 Z" /></clipPath><clipPath
       id="clipPath78"
       clipPathUnits="userSpaceOnUse"><path
         id="path76"
         d="M 0,2500 H 2500 V 0 H 0 Z" /></clipPath><clipPath
       id="clipPath90"
       clipPathUnits="userSpaceOnUse"><path
         id="path88"
         d="M 0,2500 H 2500 V 0 H 0 Z" /></clipPath><clipPath
       id="clipPath102"
       clipPathUnits="userSpaceOnUse"><path
         id="path100"
         d="M 0,2500 H 2500 V 0 H 0 Z" /></clipPath><clipPath
       id="clipPath114"
       clipPathUnits="userSpaceOnUse"><path
         id="path112"
         d="M 0,2500 H 2500 V 0 H 0 Z" /></clipPath><clipPath
       id="clipPath126"
       clipPathUnits="userSpaceOnUse"><path
         id="path124"
         d="M 0,2500 H 2500 V 0 H 0 Z" /></clipPath><clipPath
       id="clipPath138"
       clipPathUnits="userSpaceOnUse"><path
         id="path136"
         d="M 0,2500 H 2500 V 0 H 0 Z" /></clipPath><clipPath
       id="clipPath162"
       clipPathUnits="userSpaceOnUse"><path
         id="path160"
         d="M 0,2500 H 2500 V 0 H 0 Z" /></clipPath><clipPath
       id="clipPath174"
       clipPathUnits="userSpaceOnUse"><path
         id="path172"
         d="M 0,2500 H 2500 V 0 H 0 Z" /></clipPath><clipPath
       id="clipPath186"
       clipPathUnits="userSpaceOnUse"><path
         id="path184"
         d="M 0,2500 H 2500 V 0 H 0 Z" /></clipPath><clipPath
       id="clipPath198"
       clipPathUnits="userSpaceOnUse"><path
         id="path196"
         d="M 0,2500 H 2500 V 0 H 0 Z" /></clipPath><filter
       inkscape:collect="always"
       style="color-interpolation-filters:sRGB"
       id="filter7"
       x="-0.037059853"
       y="-0.050115302"
       width="1.0741197"
       height="1.1002306"><feGaussianBlur
         inkscape:collect="always"
         stdDeviation="6.7759685"
         id="feGaussianBlur7" /></filter><clipPath
       id="clipPath174-7"
       clipPathUnits="userSpaceOnUse"><path
         id="path172-0"
         d="M 0,2500 H 2500 V 0 H 0 Z" /></clipPath><clipPath
       id="clipPath198-9"
       clipPathUnits="userSpaceOnUse"><path
         id="path196-3"
         d="M 0,2500 H 2500 V 0 H 0 Z" /></clipPath><clipPath
       id="clipPath174-6"
       clipPathUnits="userSpaceOnUse"><path
         id="path172-1"
         d="M 0,2500 H 2500 V 0 H 0 Z" /></clipPath><clipPath
       id="clipPath198-2"
       clipPathUnits="userSpaceOnUse"><path
         id="path196-9"
         d="M 0,2500 H 2500 V 0 H 0 Z" /></clipPath><linearGradient
       inkscape:collect="always"
       xlink:href="#linearGradient3"
       id="linearGradient97"
       gradientUnits="userSpaceOnUse"
       x1="1048.6624"
       y1="708.3194"
       x2="1248.5895"
       y2="429.02551" /><clipPath
       id="clipPath174-6-7"
       clipPathUnits="userSpaceOnUse"><path
         id="path172-1-6"
         d="M 0,2500 H 2500 V 0 H 0 Z" /></clipPath><clipPath
       id="clipPath198-2-5"
       clipPathUnits="userSpaceOnUse"><path
         id="path196-9-6"
         d="M 0,2500 H 2500 V 0 H 0 Z" /></clipPath><linearGradient
       inkscape:collect="always"
       xlink:href="#linearGradient3"
       id="linearGradient124"
       gradientUnits="userSpaceOnUse"
       x1="1048.6624"
       y1="708.3194"
       x2="1248.5895"
       y2="429.02551" /><linearGradient
       inkscape:collect="always"
       xlink:href="#linearGradient3"
       id="linearGradient147"
       gradientUnits="userSpaceOnUse"
       x1="1048.6624"
       y1="708.3194"
       x2="1248.5895"
       y2="429.02551" /><clipPath
       clipPathUnits="userSpaceOnUse"
       id="clipPath256"><g
         id="g258"><g
           id="g257"><path
             id="path256"
             d="M -278.39028,-77.539755 78.5373,-81.78018 82.777725,275.14739 -274.14985,279.38782 Z"
             style="stroke-width:0.142781" /></g></g></clipPath><clipPath
       clipPathUnits="userSpaceOnUse"
       id="clipPath259"><g
         id="g261"><g
           id="g260"><path
             id="path259"
             d="M -278.39028,-77.539755 78.5373,-81.78018 82.777725,275.14739 -274.14985,279.38782 Z"
             style="stroke-width:0.142781" /></g></g></clipPath><clipPath
       clipPathUnits="userSpaceOnUse"
       id="clipPath262"><g
         id="g264"><g
           id="g263"><path
             id="path262"
             d="M -278.39028,-77.539755 78.5373,-81.78018 82.777725,275.14739 -274.14985,279.38782 Z"
             style="stroke-width:0.142781" /></g></g></clipPath><clipPath
       clipPathUnits="userSpaceOnUse"
       id="clipPath265"><g
         id="g267"><g
           id="g266"><path
             id="path265"
             d="M -278.39028,-77.539755 78.5373,-81.78018 82.777725,275.14739 -274.14985,279.38782 Z"
             style="stroke-width:0.142781" /></g></g></clipPath><clipPath
       clipPathUnits="userSpaceOnUse"
       id="clipPath268"><g
         id="g270"><g
           id="g269"><path
             id="path268"
             d="M -278.39028,-77.539755 78.5373,-81.78018 82.777725,275.14739 -274.14985,279.38782 Z"
             style="stroke-width:0.142781" /></g></g></clipPath><clipPath
       clipPathUnits="userSpaceOnUse"
       id="clipPath271"><g
         id="g273"><g
           id="g272"><path
             id="path271"
             d="M -278.39028,-77.539755 78.5373,-81.78018 82.777725,275.14739 -274.14985,279.38782 Z"
             style="stroke-width:0.142781" /></g></g></clipPath><clipPath
       clipPathUnits="userSpaceOnUse"
       id="clipPath274"><g
         id="g276"><g
           id="g275"><path
             id="path274"
             d="M -278.39028,-77.539755 78.5373,-81.78018 82.777725,275.14739 -274.14985,279.38782 Z"
             style="stroke-width:0.142781" /></g></g></clipPath><clipPath
       clipPathUnits="userSpaceOnUse"
       id="clipPath277"><g
         id="g279"><g
           id="g278"><path
             id="path277"
             d="M -278.39028,-77.539755 78.5373,-81.78018 82.777725,275.14739 -274.14985,279.38782 Z"
             style="stroke-width:0.142781" /></g></g></clipPath><clipPath
       clipPathUnits="userSpaceOnUse"
       id="clipPath280"><g
         id="g282"><g
           id="g281"><path
             id="path280"
             d="M -278.39028,-77.539755 78.5373,-81.78018 82.777725,275.14739 -274.14985,279.38782 Z"
             style="stroke-width:0.142781" /></g></g></clipPath><clipPath
       clipPathUnits="userSpaceOnUse"
       id="clipPath283"><g
         id="g285"><g
           id="g284"><path
             id="path283"
             d="M -278.39028,-77.539755 78.5373,-81.78018 82.777725,275.14739 -274.14985,279.38782 Z"
             style="stroke-width:0.142781" /></g></g></clipPath><clipPath
       clipPathUnits="userSpaceOnUse"
       id="clipPath286"><g
         id="g288"><g
           id="g287"><path
             id="path286"
             d="M -278.39028,-77.539755 78.5373,-81.78018 82.777725,275.14739 -274.14985,279.38782 Z"
             style="stroke-width:0.142781" /></g></g></clipPath><clipPath
       clipPathUnits="userSpaceOnUse"
       id="clipPath289"><g
         id="g291"><g
           id="g290"><path
             id="path289"
             d="M -278.39028,-77.539755 78.5373,-81.78018 82.777725,275.14739 -274.14985,279.38782 Z"
             style="stroke-width:0.142781" /></g></g></clipPath><clipPath
       clipPathUnits="userSpaceOnUse"
       id="clipPath292"><g
         id="g294"><g
           id="g293"><path
             id="path292"
             d="M -278.39028,-77.539755 78.5373,-81.78018 82.777725,275.14739 -274.14985,279.38782 Z"
             style="stroke-width:0.142781" /></g></g></clipPath><clipPath
       clipPathUnits="userSpaceOnUse"
       id="clipPath295"><g
         id="g297"><g
           id="g296"><path
             id="path295"
             d="M -278.39028,-77.539755 78.5373,-81.78018 82.777725,275.14739 -274.14985,279.38782 Z"
             style="stroke-width:0.142781" /></g></g></clipPath><clipPath
       clipPathUnits="userSpaceOnUse"
       id="clipPath298"><g
         id="g300"><g
           id="g299"><path
             id="path298"
             d="M -278.39028,-77.539755 78.5373,-81.78018 82.777725,275.14739 -274.14985,279.38782 Z"
             style="stroke-width:0.142781" /></g></g></clipPath><clipPath
       clipPathUnits="userSpaceOnUse"
       id="clipPath303"><g
         id="g305"><g
           id="g304"><path
             id="path303"
             d="M -278.39028,-77.539755 78.5373,-81.78018 82.777725,275.14739 -274.14985,279.38782 Z"
             style="stroke-width:0.142781" /></g></g></clipPath><clipPath
       clipPathUnits="userSpaceOnUse"
       id="clipPath306"><g
         id="g308"><g
           id="g307"><path
             id="path306"
             d="M -278.39028,-77.539755 78.5373,-81.78018 82.777725,275.14739 -274.14985,279.38782 Z"
             style="stroke-width:0.142781" /></g></g></clipPath><clipPath
       clipPathUnits="userSpaceOnUse"
       id="clipPath309"><g
         id="g311"><g
           id="g310"><path
             id="path309"
             d="M -278.39028,-77.539755 78.5373,-81.78018 82.777725,275.14739 -274.14985,279.38782 Z"
             style="stroke-width:0.142781" /></g></g></clipPath><clipPath
       clipPathUnits="userSpaceOnUse"
       id="clipPath312"><g
         id="g314"><g
           id="g313"><path
             id="path312"
             d="M -278.39028,-77.539755 78.5373,-81.78018 82.777725,275.14739 -274.14985,279.38782 Z"
             style="stroke-width:0.142781" /></g></g></clipPath><clipPath
       clipPathUnits="userSpaceOnUse"
       id="clipPath315"><g
         id="g317"><g
           id="g316"><path
             id="path315"
             d="M -278.39028,-77.539755 78.5373,-81.78018 82.777725,275.14739 -274.14985,279.38782 Z"
             style="stroke-width:0.142781" /></g></g></clipPath><clipPath
       clipPathUnits="userSpaceOnUse"
       id="clipPath318"><g
         id="g320"><g
           id="g319"><path
             id="path318"
             d="M -180.92888,-607.11804 680.81789,-43.86251 117.56237,817.88427 -744.18441,254.62874 Z"
             style="stroke-width:0.411799" /></g></g></clipPath><clipPath
       clipPathUnits="userSpaceOnUse"
       id="clipPath323"><g
         id="g325"><g
           id="g324"><path
             id="path323"
             d="M -176.13374,-608.05527 685.61303,-44.79974 122.35751,816.94704 -739.38927,253.69151 Z"
             style="stroke-width:0.411799" /></g></g></clipPath></defs><sodipodi:namedview
     id="namedview1"
     pagecolor="#ffffff"
     bordercolor="#666666"
     borderopacity="1.0"
     inkscape:showpageshadow="2"
     inkscape:pageopacity="0.0"
     inkscape:pagecheckerboard="0"
     inkscape:deskcolor="#d1d1d1"
     inkscape:zoom="3.8744608"
     inkscape:cx="90.206101"
     inkscape:cy="105.04688"
     inkscape:window-width="1854"
     inkscape:window-height="1053"
     inkscape:window-x="66"
     inkscape:window-y="27"
     inkscape:window-maximized="1"
     inkscape:current-layer="g1"
     showguides="true"
     inkscape:document-units="cm" /><g
     inkscape:groupmode="layer"
     id="layer4"
     inkscape:label="Sticker shape"><path
       id="path147"
       clip-path="url(#clipPath256)"
       style="display:inline;fill:#ffffff;fill-opacity:1;fill-rule:nonzero;stroke:#000000;stroke-width:0.188976;stroke-dasharray:none;stroke-opacity:1"
       d="m -126.6269,6.919803 c -5.92404,1.7090832 -11.23166,5.262273 -15.40913,9.759648 -3.23662,3.518528 -5.78673,7.670356 -7.43663,12.15844 -2.69654,0.504957 -5.55442,1.022646 -7.79101,2.71289 -1.94363,1.693669 -2.45915,4.343613 -3.17632,6.695517 -1.61254,6.243817 -1.12062,13.201641 2.14428,18.844463 1.3215,2.063676 3.68745,3.146947 6.03255,3.547599 0.75712,0.154895 1.52131,0.274182 2.2866,0.381171 2.65,7.978371 7.88595,15.195369 15.06062,19.674856 2.26947,1.483178 4.71653,2.702444 7.28703,3.569285 -2.69651,0.698643 -5.34353,1.569634 -9.13941,3.629653 -3.79588,2.060019 -7.86354,5.047531 -10.01488,9.231675 -2.49603,4.60057 -3.1883,9.94599 -3.13086,15.11328 0.3608,6.50936 3.87183,12.54775 8.74171,16.76095 1.83713,1.63677 3.85119,3.06999 5.97313,4.31327 0.30754,2.81164 0.71162,5.61217 1.17383,8.40234 -2.03945,3.23949 -4.31051,6.34719 -6.10575,9.73158 -2.71164,5.96447 -0.67773,13.72029 4.77497,17.42294 2.67555,1.87988 5.48596,3.55948 8.2002,5.38313 2.17364,1.44142 4.41509,2.81158 6.5466,4.2973 4.78035,6.71166 11.52556,12.30026 19.54695,14.57375 1.446925,0.46612 2.990011,0.59558 4.444175,0.97922 2.600906,1.79965 5.496359,3.44113 8.731622,3.59632 5.519471,0.48804 11.114338,-2.56057 13.799127,-7.3901 0.355315,-0.60462 0.690888,-1.24544 1.36741,-1.53631 7.200745,-4.94727 12.275808,-12.41714 15.764919,-20.31731 1.526006,-3.36229 2.617556,-6.9027 3.810425,-10.38492 l 6.025601,-9.27552 c 7.91715,0.24043 16.062683,-0.66244 23.304154,-4.05078 5.407661,-2.58643 10.097762,-7.11497 11.97781,-12.90313 1.378439,-4.038 1.8548452,-8.40104 1.345759,-12.63774 -0.715152,-5.24199 -3.608828,-10.20485 -8.03471,-13.16169 -0.566263,-0.41857 -1.251663,-0.7558 -1.800044,-1.14119 0.651875,-5.329907 -1.880949,-10.996715 -6.488281,-13.832031 -5.206243,-3.409306 -10.534603,-6.869897 -15.796179,-10.286756 l -5.05343,-3.283556 c 5.555911,-4.622385 9.652795,-10.920749 11.746093,-17.830078 2.500089,-0.388497 5.182267,-0.929798 7.109773,-2.683992 1.786663,-1.764175 2.504981,-4.2689 3.204414,-6.606751 1.569755,-6.249564 0.581702,-13.00757 -2.238015,-18.752226 -1.45959,-2.328606 -4.248938,-3.195477 -6.801608,-3.680016 -0.801568,-0.168018 -1.60716,-0.317551 -2.417142,-0.439125 -3.0709,-7.766828 -8.802613,-14.525307 -16.141766,-18.5413538 -3.445105,-2.013976 -7.313172,-3.1696361 -11.230479,-3.8279369 -9.291184,-1.7149972 -18.77116,-1.9715228 -28.195308,-2.0542533 -2.308852,-0.00764 -4.617728,-0.00837 -10.31589,0.3739352 -5.69817,0.3823051 -14.85631,1.1133522 -23.68291,3.4635528 z"
       transform="translate(170.8519,3.5216282)"
       sodipodi:nodetypes="ccccccccccccccccccccccccccccccccccccccccccccccc" /></g><g
     inkscape:groupmode="layer"
     id="layer2"
     inkscape:label="Yumi-body"><g
       transform="matrix(0.14277103,-0.00169617,-0.00169617,-0.14277103,-103.187,282.87105)"
       id="g10"><g
         id="g12"><g
           clip-path="url(#clipPath18)"
           id="g14"><g
             transform="translate(1552.1523,1305.5713)"
             id="g20"><path
               id="path22"
               style="fill:#f15a24;fill-opacity:1;fill-rule:nonzero;stroke:none"
               d="M 0,0 C 0,0 -103.01,35.324 -264.107,34.934 -425.203,35.324 -528.123,0 -528.123,0 -568.682,-685.026 -304.072,-685.924 -264.15,-682.204 -224.207,-685.924 40.559,-685.026 0,0" /></g></g></g><g
         id="g24"><g
           clip-path="url(#clipPath30)"
           id="g26"><g
             transform="translate(1552.1523,1304.6353)"
             id="g32"><path
               id="path34"
               style="fill:#db481b;fill-opacity:1;fill-rule:nonzero;stroke:none"
               d="m 0,0 c 0,0 -103.01,35.365 -264.107,35.365 h -0.045 v -718 h 0.002 C -224.207,-685.635 40.559,-685.027 0,0" /></g></g></g><g
         id="g36"><g
           clip-path="url(#clipPath42)"
           id="g38"><g
             transform="translate(1530.625,1847)"
             id="g44"><path
               id="path46"
               style="fill:#f15a24;fill-opacity:1;fill-rule:nonzero;stroke:none"
               d="m 0,0 c 0,0 -49.625,28 -243.625,30 -194,-2 -243.713,-30 -243.713,-30 -107.175,-50.397 -128.563,-154.918 -130.003,-224 1.44,-69.082 22.828,-173.603 130.003,-224 0,0 49.713,-28 243.713,-30 194,2 243.625,30 243.625,30 107.175,50.397 128.526,154.918 129.94,224 C 128.526,-154.918 107.175,-50.397 0,0" /></g></g></g><g
         id="g48"><g
           clip-path="url(#clipPath54)"
           id="g50"><g
             transform="translate(1531.625,1848)"
             id="g56"><path
               id="path58"
               style="fill:#db481b;fill-opacity:1;fill-rule:nonzero;stroke:none"
               d="m 0,0 c 0,0 -49.625,28 -243.625,30 v -508 c 194,2 243.625,30 243.625,30 107.175,50.397 128.526,154.918 129.94,224 C 128.526,-154.918 107.175,-50.397 0,0" /></g></g></g><g
         id="g60"><g
           clip-path="url(#clipPath66)"
           id="g62"><g
             transform="translate(921.5,1706)"
             id="g68"><path
               id="path70"
               style="fill:#f15a24;fill-opacity:1;fill-rule:nonzero;stroke:none"
               d="m 0,0 c 0,0 -24,-57 -6,-148 0,0 -49.5,4 -50,12 0,0 -31.5,49 0,123 0,0 3.5,6 56,13" /></g></g></g><g
         id="g72"><g
           clip-path="url(#clipPath78)"
           id="g74"><g
             transform="translate(1653.5,1706)"
             id="g80"><path
               id="path82"
               style="fill:#db481b;fill-opacity:1;fill-rule:nonzero;stroke:none"
               d="m 0,0 c 0,0 24,-57 6,-148 0,0 49.5,4 50,12 0,0 31.5,49 0,123 0,0 -3.5,6 -56,13" /></g></g></g><g
         id="g84"><g
           clip-path="url(#clipPath90)"
           id="g86"><g
             transform="translate(1554.9258,1692)"
             id="g92"><path
               id="path94"
               style="fill:#333333;fill-opacity:1;fill-rule:nonzero;stroke:none"
               d="m 0,0 c 11.785,-23.893 15.505,-48.548 15.999,-68.5 -1.075,-43.38 -17.305,-109.014 -98.767,-140.662 0,0 -37.718,-17.582 -185.175,-18.838 -147.458,1.256 -185.244,18.838 -185.244,18.838 -81.462,31.648 -97.719,97.282 -98.814,140.662 0.503,19.951 4.228,44.606 16.016,68.5 z" /></g></g></g><g
         id="g96"><g
           clip-path="url(#clipPath102)"
           id="g98"><g
             transform="translate(1555.002,1556)"
             id="g104"><path
               id="path106"
               style="fill:#333333;fill-opacity:1;fill-rule:nonzero;stroke:none"
               d="m 0,0 c 11.784,23.893 15.504,48.548 15.998,68.5 -1.074,43.38 -17.305,109.014 -98.767,140.662 0,0 -37.718,17.582 -185.175,18.838 -147.458,-1.256 -185.244,-18.838 -185.244,-18.838 -81.462,-31.648 -97.719,-97.282 -98.814,-140.662 0.503,-19.951 4.228,-44.606 16.017,-68.5 z" /></g></g></g><g
         id="g108"><g
           clip-path="url(#clipPath114)"
           id="g110"><g
             transform="translate(1101.8135,1737.291)"
             id="g116"><path
               id="path118"
               style="fill:#1a1a1a;fill-opacity:1;fill-rule:nonzero;stroke:none"
               d="M 0,0 C 0,0 37.787,16.995 185.244,18.209 332.701,16.995 370.42,0 370.42,0 c 74.382,-27.931 94.374,-83.248 98.106,-124.572 0.356,4.069 0.567,8.01 0.661,11.781 -1.075,43.38 -17.305,109.014 -98.767,140.662 0,0 -37.719,17.582 -185.176,18.838 C 37.787,45.453 0,27.871 0,27.871 -81.462,-3.777 -97.719,-69.411 -98.813,-112.791 c 0.095,-3.771 0.308,-7.712 0.665,-11.781 C -94.397,-83.248 -74.382,-27.931 0,0" /></g></g></g><g
         id="g120"><g
           clip-path="url(#clipPath126)"
           id="g122"><g
             transform="translate(1472.2334,1765.1616)"
             id="g128"><path
               id="path130"
               style="fill:#1a1a1a;fill-opacity:1;fill-rule:nonzero;stroke:none"
               d="m 0,0 c 0,0 -37.719,17.583 -185.176,18.838 -0.019,0 -0.038,0 -0.057,0 v -319 h 0.057 c 147.457,1 185.176,18.839 185.176,18.839 81.462,31.647 97.692,97.281 98.767,140.661 C 97.692,-97.282 81.462,-31.647 0,0" /></g></g></g><g
         id="g132"><g
           clip-path="url(#clipPath138)"
           id="g134"><g
             transform="translate(1187.3335,1626)"
             id="g140"><path
               id="path142"
               style="fill:#f2f2f2;fill-opacity:1;fill-rule:nonzero;stroke:none"
               d="m 0,0 c 0,-25.773 -20.894,-46.667 -46.667,-46.667 -25.773,0 -46.666,20.894 -46.666,46.667 0,25.773 20.893,46.667 46.666,46.667 C -20.894,46.667 0,25.773 0,0" /></g><g
             transform="translate(1482.333,1626)"
             id="g144"><path
               id="path146"
               style="fill:#f2f2f2;fill-opacity:1;fill-rule:nonzero;stroke:none"
               d="m 0,0 c 0,-25.773 -20.893,-46.667 -46.666,-46.667 -25.773,0 -46.667,20.894 -46.667,46.667 0,25.773 20.894,46.667 46.667,46.667 C -20.893,46.667 0,25.773 0,0" /></g><g
             transform="translate(1229.8413,1570)"
             id="g148"><path
               id="path150"
               style="fill:#f2f2f2;fill-opacity:1;fill-rule:nonzero;stroke:none"
               d="m 0,0 c 7.004,-29.402 30.232,-51 57.826,-51 27.593,0 50.821,21.598 57.825,51 z" /></g></g></g><g
         id="g168"><g
           clip-path="url(#clipPath174)"
           id="g170"><g
             transform="translate(1234.6665,1176)"
             id="g176"><path
               id="path178"
               style="fill:#333333;fill-opacity:1;fill-rule:nonzero;stroke:none"
               d="m 0,0 c 0,-28.719 -23.281,-52 -52,-52 -28.719,0 -52,23.281 -52,52 0,28.719 23.281,52 52,52 C -23.281,52 0,28.719 0,0" /></g></g></g><g
         id="g192"><g
           clip-path="url(#clipPath198)"
           id="g194"><g
             transform="translate(1168.0864,1195.4727)"
             id="g200"><path
               id="path202"
               style="fill:#ffffff;fill-opacity:1;fill-rule:nonzero;stroke:none"
               d="m 0,0 c 1.417,-2.373 2.805,-4.698 4.189,-7.018 -9.654,-6.835 -9.584,-21.162 0.015,-28.136 -1.394,-2.342 -2.794,-4.693 -4.23,-7.105 -0.296,0.163 -0.548,0.27 -0.764,0.426 -4.666,3.399 -7.866,7.848 -9.582,13.366 -0.193,0.621 -0.181,1.056 0.338,1.583 3.279,3.33 3.243,8.254 0.018,11.623 -0.273,0.285 -0.487,0.878 -0.387,1.232 1.619,5.716 4.92,10.262 9.723,13.735 0.114,0.083 0.236,0.155 0.361,0.22 C -0.259,-0.043 -0.184,-0.041 0,0" /></g><g
             transform="translate(1207.5605,1172.8574)"
             id="g204"><path
               id="path206"
               style="fill:#ffffff;fill-opacity:1;fill-rule:nonzero;stroke:none"
               d="m 0,0 c -0.413,-5.444 -2.164,-10.053 -5.317,-14.13 -0.13,-0.167 -0.281,-0.319 -0.397,-0.495 -0.928,-1.414 -1.929,-2.036 -3.875,-1.632 -3.798,0.789 -7.699,-1.967 -8.79,-5.834 -0.217,-0.766 -0.561,-1.076 -1.312,-1.238 -5.484,-1.184 -10.803,-0.735 -15.961,1.495 -0.258,0.111 -0.513,0.234 -0.762,0.366 -0.087,0.046 -0.152,0.134 -0.282,0.253 1.335,2.392 2.671,4.785 4.03,7.22 2.329,-1.013 4.669,-1.568 7.143,-1.564 8.555,0.015 15.654,6.045 16.96,14.5 0.132,0.852 0.415,1.098 1.256,1.079 C -4.918,-0.036 -2.528,0 0,0" /></g><g
             transform="translate(1207.4907,1175.9609)"
             id="g208"><path
               id="path210"
               style="fill:#ffffff;fill-opacity:1;fill-rule:nonzero;stroke:none"
               d="m 0,0 h -8.295 c -0.734,5.688 -3.457,10.247 -8.526,13.185 -5.05,2.925 -10.325,3.005 -15.783,0.751 -1.344,2.405 -2.679,4.794 -4.064,7.272 0.371,0.191 0.667,0.366 0.98,0.503 5.254,2.279 10.67,2.771 16.256,1.495 0.632,-0.144 0.911,-0.433 1.087,-1.07 1.234,-4.449 5.598,-6.941 10.064,-5.754 0.594,0.157 0.94,0.07 1.365,-0.381 3.99,-4.236 6.26,-9.253 6.912,-15.018 C 0.027,0.712 0,0.435 0,0" /></g><g
             transform="translate(1202.9321,1148.4443)"
             id="g212"><path
               id="path214"
               style="fill:#ffffff;fill-opacity:1;fill-rule:nonzero;stroke:none"
               d="m 0,0 c -0.059,-3.244 -2.703,-5.857 -5.904,-5.836 -3.251,0.022 -5.92,2.748 -5.865,5.991 0.057,3.29 2.73,5.873 6.019,5.815 C -2.536,5.912 0.058,3.219 0,0" /></g><g
             transform="translate(1152.2441,1180.2471)"
             id="g216"><path
               id="path218"
               style="fill:#ffffff;fill-opacity:1;fill-rule:nonzero;stroke:none"
               d="m 0,0 c 3.295,0.016 5.937,-2.612 5.924,-5.894 -0.011,-3.237 -2.611,-5.845 -5.849,-5.87 -3.269,-0.024 -5.934,2.631 -5.922,5.902 C -5.836,-2.616 -3.242,-0.016 0,0" /></g><g
             transform="translate(1191.1616,1200.3154)"
             id="g220"><path
               id="path222"
               style="fill:#ffffff;fill-opacity:1;fill-rule:nonzero;stroke:none"
               d="M 0,0 C 0.068,3.249 2.706,5.817 5.937,5.782 9.237,5.745 11.831,3.087 11.771,-0.199 11.712,-3.469 8.976,-6.098 5.737,-5.995 2.504,-5.893 -0.067,-3.206 0,0" /></g></g></g><g
         id="g168-6"
         transform="rotate(-10.510404,32.491532,-356.98579)" /></g><path
       id="path328"
       clip-path="url(#clipPath256)"
       style="fill:#786a65;fill-opacity:1;fill-rule:nonzero;stroke:none;stroke-width:0.142781"
       d="m -93.446113,9.0795307 0.002,0.1445312 c -0.05035,5.3e-5 -0.09405,-0.00203 -0.144531,-0.00195 -27.694126,0.6145979 -34.744136,4.6972651 -34.744136,4.6972651 -15.21598,7.377004 -18.09127,22.335841 -18.17969,32.201172 0.32277,9.860446 3.55252,24.746335 18.93945,31.759766 0,0 7.1448,3.914609 34.845704,3.871094 1.768744,-0.03925 3.344584,-0.110023 4.933594,-0.177735 l -2.75586,4.242188 c -0.657292,-5.07e-4 -1.303438,-0.0077 -1.978515,0.002 -23.000443,0.217566 -37.634763,5.435547 -37.634763,5.435547 -0.0414,0.874809 -0.0552,1.683779 -0.0898,2.542969 -7.99801,0.581356 -13.05021,4.231286 -13.66602,16.394532 -0.59137,11.68053 11.51275,18.00696 14.34375,19.32422 0.46251,4.93497 1.11013,9.36225 1.85547,13.50195 l -6.26367,9.64063 c -2.51702,3.87346 -1.40862,9.08649 2.46484,11.60351 l 15.07227,9.79297 c 7.74549,11.35557 16.685868,13.77788 21.761713,14.14063 l 3.375,2.19335 c 3.873465,2.51702 9.086499,1.41253 11.603515,-2.46093 l 2.001953,-3.08203 c 6.665733,-3.94523 14.143205,-12.17654 18.908204,-29.09766 l 8.542968,-13.14648 c 0.738362,0.0807 28.940789,3.05034 33.1875,-14.13868 3.451808,-13.97165 -5.147997,-18.86854 -10.990234,-20.01953 l 0.474609,-0.73047 c 2.517014,-3.87346 1.410575,-9.088449 -2.46289,-11.605466 L -58.834785,77.39789 c 0.264283,-0.117506 0.839844,-0.34375 0.839844,-0.34375 2.994133,-1.451615 5.494516,-3.204305 7.605469,-5.146484 8.747168,-7.935383 10.638596,-19.22869 10.707031,-27.199219 -0.319052,-9.86049 -3.544705,-24.746335 -18.931641,-31.759766 0,0 -7.131115,-3.9126551 -34.832031,-3.8691403 z m 52.474609,23.9355473 c 0,0 3.522944,8.098425 1.107422,21.121093 0,0 7.059372,-0.655815 7.117188,-1.798828 0,0 4.41381,-7.048941 -0.208985,-17.560547 0,0 -0.508288,-0.851372 -8.015625,-1.761718 z m -104.509766,1.242187 c -7.48359,1.088444 -7.97266,1.951172 -7.97266,1.951172 -4.37176,10.618464 0.20899,17.560547 0.20899,17.560547 0.085,1.141318 7.1582,1.628906 7.1582,1.628906 -2.72422,-12.961607 0.60547,-21.140625 0.60547,-21.140625 z"
       transform="translate(405.06916,3.5216282)" /></g><g
     inkscape:groupmode="layer"
     inkscape:label="Phone-new-logo"
     id="g1"><g
       id="g11-7"
       transform="matrix(1.2244772,1.8691015e-4,-1.8691015e-4,1.2244772,1352.865,-1146.964)" /><g
       id="g99"
       transform="matrix(0.10708548,2.6172134e-4,-2.6172134e-4,0.10708548,-130.35424,220.82644)"><g
         id="g97"
         transform="rotate(-16.702458,2179.1982,-4704.808)"><g
           id="g94"
           transform="matrix(2.037339,-0.47940197,0.47940197,2.037339,148.46203,-2451.8672)"><rect
             style="fill:url(#linearGradient97);fill-opacity:1;stroke:#000000;stroke-width:14.2299;stroke-dasharray:none;stroke-opacity:1;paint-order:markers fill stroke"
             id="rect93"
             width="274.57855"
             height="487.44217"
             x="1009.5223"
             y="377.15158"
             transform="rotate(29.79923)"
             ry="30.310513" /><path
             id="path93"
             style="opacity:1;stroke:none;stroke-width:7.42677;paint-order:markers fill stroke"
             transform="rotate(29.645623)"
             d="m 1035.1039,381.78313 228.2894,2.69631 c 20.8535,0.2463 15.6548,13.11661 18.2679,27.15483 l -271.5355,-0.70483 c 1.1921,-16.78326 1.2484,-29.42658 24.9782,-29.14631 z"
             sodipodi:nodetypes="ssccs" /><circle
             style="opacity:1;fill:#454545;fill-opacity:1;stroke:none;stroke-width:7.42677;stroke-dasharray:none;stroke-opacity:1;paint-order:markers fill stroke"
             id="circle93"
             cx="854.20319"
             cy="941.78381"
             r="7.8856425" /></g></g><g
         id="g8-4"
         transform="matrix(2.8841275,4.4024723e-4,-4.4024723e-4,2.8841275,-1335.5756,-4717.7752)"><g
           id="g168-9-5"
           transform="matrix(1.3333333,0,0,-1.3333333,25.4447,2918.3333)"><g
             clip-path="url(#clipPath174-6-7)"
             id="g170-4-2"><g
               transform="translate(1234.6665,1176)"
               id="g176-7-5"><path
                 id="path178-8-4"
                 style="fill:#333333;fill-opacity:1;fill-rule:nonzero;stroke:none"
                 d="m 0,0 c 0,-28.719 -23.281,-52 -52,-52 -28.719,0 -52,23.281 -52,52 0,28.719 23.281,52 52,52 C -23.281,52 0,28.719 0,0" /></g></g></g></g><g
         id="g125"
         transform="matrix(1.3326471,0,0,1.3326471,-1420.1359,-206.19137)"><rect
           class="cls-1"
           x="3430"
           y="-551"
           width="193.57001"
           height="193.57001"
           id="rect16"
           style="fill:none" /><circle
           class="cls-3"
           cx="3457.8401"
           cy="-464.45999"
           r="26.299999"
           id="circle16"
           style="fill:#ffffff" /><circle
           class="cls-3"
           cx="3567.3799"
           cy="-522.13"
           r="26.299999"
           id="circle17"
           style="fill:#ffffff" /><path
           class="cls-3"
           d="m 3517.16,-396.76 c -18.95,-4.06 -34.78,-16.16 -43.68,-33.32 -7.01,3.19 -14.9,4.16 -22.49,2.76 10.77,26.45 33.61,45.66 61.65,51.67 6.15,1.32 12.42,1.96 18.68,1.92 -4.83,-6.35 -7.52,-14.01 -7.7,-21.99 -2.17,-0.24 -4.33,-0.59 -6.45,-1.05 z"
           id="path17"
           style="fill:#ffffff" /><circle
           class="cls-3"
           cx="3561.46"
           cy="-396.62"
           r="26.299999"
           id="circle18"
           style="fill:#ffffff" /><path
           class="cls-3"
           d="m 3598.06,-406.28 c 8.18,-10.31 13.94,-22.5 16.71,-35.45 4.84,-22.59 0.32,-46.29 -12.4,-65.51 -3.03,7.14 -8.17,13.17 -14.79,17.32 7.1,13.38 9.26,28.82 6.08,43.67 -1.56,7.27 -4.31,14.12 -8.18,20.38 6.19,5.08 10.56,11.91 12.59,19.6 z"
           id="path18"
           style="fill:#ffffff" /><path
           class="cls-3"
           d="m 3455.81,-502.18 c 0.67,-0.04 1.34,-0.05 2,-0.05 2.66,0 5.31,0.28 7.94,0.85 4.29,0.92 8.32,2.54 12.01,4.84 11.84,-17.03 30.95,-27.25 51.65,-27.63 0.11,-1.99 0.38,-3.97 0.79,-5.92 1.21,-5.63 3.67,-10.9 7.19,-15.41 -33.08,-2.62 -65.22,14.45 -81.59,43.33 z"
           id="path19"
           style="fill:#ffffff" /></g><text
         xml:space="preserve"
         style="font-style:normal;font-variant:normal;font-weight:normal;font-stretch:normal;font-size:37.3159px;line-height:1.25;font-family:Ubuntu;-inkscape-font-specification:Ubuntu;font-variant-ligatures:none;fill:#fffbfa;fill-opacity:1;stroke-width:1.55483"
         x="1458.1539"
         y="490.99347"
         id="text8-9"
         transform="matrix(1.2244772,1.8691015e-4,-1.8691015e-4,1.2244772,1352.865,-1146.964)"><tspan
           sodipodi:role="line"
           id="tspan8-2"
           x="1458.1539"
           y="490.99347"
           style="fill:#fffbfa;fill-opacity:1;stroke-width:1.55483">powered by</tspan></text><text
         xml:space="preserve"
         style="font-style:normal;font-variant:normal;font-weight:normal;font-stretch:normal;font-size:65.8043px;line-height:1.25;font-family:Ubuntu;-inkscape-font-specification:Ubuntu;font-variant-ligatures:none;stroke-width:2.74184"
         x="1456.9442"
         y="579.46155"
         id="text9-0"
         transform="matrix(1.2244772,1.8691015e-4,-1.8691015e-4,1.2244772,1352.865,-1146.964)"><tspan
           sodipodi:role="line"
           id="tspan9-6"
           x="1456.9442"
           y="579.46155"
           style="stroke-width:2.74184">UBports</tspan></text><g
         id="g15-8"
         transform="rotate(-0.20241045,-356406.65,-571337.33)"
         style="fill:#ebebeb;fill-opacity:1"><g
           id="g16-9"
           style="fill:#ebebeb;fill-opacity:1"><text
             xml:space="preserve"
             style="font-style:normal;font-variant:normal;font-weight:normal;font-stretch:normal;font-size:45.171px;line-height:1.25;font-family:Ubuntu;-inkscape-font-specification:Ubuntu;font-variant-ligatures:none;fill:#ebebeb;fill-opacity:1;stroke-width:1.88213"
             x="1159.2567"
             y="973.48712"
             id="text11-2"><tspan
               sodipodi:role="line"
               x="1159.2567"
               y="973.48712"
               id="tspan12-6"
               style="fill:#ebebeb;fill-opacity:1;stroke-width:1.88213">the device</tspan></text><text
             xml:space="preserve"
             style="font-style:normal;font-variant:normal;font-weight:normal;font-stretch:normal;font-size:45.171px;line-height:1.25;font-family:Ubuntu;-inkscape-font-specification:Ubuntu;font-variant-ligatures:none;fill:#ebebeb;fill-opacity:1;stroke-width:1.88213"
             x="1180.1709"
             y="1011.9545"
             id="text13-6"><tspan
               sodipodi:role="line"
               id="tspan13-4"
               x="1180.1709"
               y="1011.9545"
               style="fill:#ebebeb;fill-opacity:1;stroke-width:1.88213"><tspan
   style="font-style:normal;font-variant:normal;font-weight:500;font-stretch:normal;font-family:Ubuntu;-inkscape-font-specification:'Ubuntu Medium';fill:#ebebeb;fill-opacity:1;stroke-width:1.88213"
   id="tspan14-9">you</tspan> own</tspan></text></g></g></g><g
       id="g147"
       transform="matrix(0.08964577,0.0585748,-0.0585748,0.08964577,-243.28345,0.51275742)"><g
         id="g133"
         transform="rotate(-16.702458,2179.1982,-4704.808)"><g
           id="g131"
           transform="matrix(2.037339,-0.47940197,0.47940197,2.037339,148.46203,-2451.8672)"><rect
             style="fill:url(#linearGradient147);fill-opacity:1;stroke:#000000;stroke-width:14.2299;stroke-dasharray:none;stroke-opacity:1;paint-order:markers fill stroke"
             id="rect130"
             width="274.57855"
             height="487.44217"
             x="1009.5223"
             y="377.15158"
             transform="rotate(29.79923)"
             ry="30.310513" /><path
             id="path131"
             style="opacity:1;stroke:none;stroke-width:7.42677;paint-order:markers fill stroke"
             transform="rotate(29.645623)"
             d="m 1035.1039,381.78313 228.2894,2.69631 c 20.8535,0.2463 15.6548,13.11661 18.2679,27.15483 l -271.5355,-0.70483 c 1.1921,-16.78326 1.2484,-29.42658 24.9782,-29.14631 z"
             sodipodi:nodetypes="ssccs" /><circle
             style="opacity:1;fill:#454545;fill-opacity:1;stroke:none;stroke-width:7.42677;stroke-dasharray:none;stroke-opacity:1;paint-order:markers fill stroke"
             id="circle131"
             cx="854.20319"
             cy="941.78381"
             r="7.8856425" /></g></g><g
         id="g138"
         transform="matrix(2.8841275,4.4024723e-4,-4.4024723e-4,2.8841275,-1335.5756,-4717.7752)"><g
           id="g137"
           transform="matrix(1.3333333,0,0,-1.3333333,25.4447,2918.3333)"><g
             clip-path="url(#clipPath174-6-7)"
             id="g136"><g
               transform="translate(1234.6665,1176)"
               id="g135"><path
                 id="path133"
                 style="fill:#333333;fill-opacity:1;fill-rule:nonzero;stroke:none"
                 d="m 0,0 c 0,-28.719 -23.281,-52 -52,-52 -28.719,0 -52,23.281 -52,52 0,28.719 23.281,52 52,52 C -23.281,52 0,28.719 0,0" /></g></g></g></g><g
         id="g141"
         transform="matrix(1.3326471,0,0,1.3326471,-1420.1359,-206.19137)"><rect
           class="cls-1"
           x="3430"
           y="-551"
           width="193.57001"
           height="193.57001"
           id="rect138"
           style="fill:none" /><circle
           class="cls-3"
           cx="3457.8401"
           cy="-464.45999"
           r="26.299999"
           id="circle138"
           style="fill:#ffffff" /><circle
           class="cls-3"
           cx="3567.3799"
           cy="-522.13"
           r="26.299999"
           id="circle139"
           style="fill:#ffffff" /><path
           class="cls-3"
           d="m 3517.16,-396.76 c -18.95,-4.06 -34.78,-16.16 -43.68,-33.32 -7.01,3.19 -14.9,4.16 -22.49,2.76 10.77,26.45 33.61,45.66 61.65,51.67 6.15,1.32 12.42,1.96 18.68,1.92 -4.83,-6.35 -7.52,-14.01 -7.7,-21.99 -2.17,-0.24 -4.33,-0.59 -6.45,-1.05 z"
           id="path139"
           style="fill:#ffffff" /><circle
           class="cls-3"
           cx="3561.46"
           cy="-396.62"
           r="26.299999"
           id="circle140"
           style="fill:#ffffff" /><path
           class="cls-3"
           d="m 3598.06,-406.28 c 8.18,-10.31 13.94,-22.5 16.71,-35.45 4.84,-22.59 0.32,-46.29 -12.4,-65.51 -3.03,7.14 -8.17,13.17 -14.79,17.32 7.1,13.38 9.26,28.82 6.08,43.67 -1.56,7.27 -4.31,14.12 -8.18,20.38 6.19,5.08 10.56,11.91 12.59,19.6 z"
           id="path140"
           style="fill:#ffffff" /><path
           class="cls-3"
           d="m 3455.81,-502.18 c 0.67,-0.04 1.34,-0.05 2,-0.05 2.66,0 5.31,0.28 7.94,0.85 4.29,0.92 8.32,2.54 12.01,4.84 11.84,-17.03 30.95,-27.25 51.65,-27.63 0.11,-1.99 0.38,-3.97 0.79,-5.92 1.21,-5.63 3.67,-10.9 7.19,-15.41 -33.08,-2.62 -65.22,14.45 -81.59,43.33 z"
           id="path141"
           style="fill:#ffffff" /></g><text
         xml:space="preserve"
         style="font-style:normal;font-variant:normal;font-weight:normal;font-stretch:normal;font-size:37.3159px;line-height:1.25;font-family:Ubuntu;-inkscape-font-specification:Ubuntu;font-variant-ligatures:none;fill:#fffbfa;fill-opacity:1;stroke-width:1.55483"
         x="1458.1539"
         y="490.99347"
         id="text141"
         transform="matrix(1.2244772,1.8691015e-4,-1.8691015e-4,1.2244772,1352.865,-1146.964)"><tspan
           sodipodi:role="line"
           id="tspan141"
           x="1458.1539"
           y="490.99347"
           style="fill:#fffbfa;fill-opacity:1;stroke-width:1.55483">powered by</tspan></text><text
         xml:space="preserve"
         style="font-style:normal;font-variant:normal;font-weight:normal;font-stretch:normal;font-size:65.8043px;line-height:1.25;font-family:Ubuntu;-inkscape-font-specification:Ubuntu;font-variant-ligatures:none;stroke-width:2.74184"
         x="1456.9442"
         y="579.46155"
         id="text142"
         transform="matrix(1.2244772,1.8691015e-4,-1.8691015e-4,1.2244772,1352.865,-1146.964)"><tspan
           sodipodi:role="line"
           id="tspan142"
           x="1456.9442"
           y="579.46155"
           style="stroke-width:2.74184">UBports</tspan></text><g
         id="g146"
         transform="rotate(-0.20241045,-356406.65,-571337.33)"
         style="fill:#ebebeb;fill-opacity:1"><g
           id="g145"
           style="fill:#ebebeb;fill-opacity:1"><text
             xml:space="preserve"
             style="font-style:normal;font-variant:normal;font-weight:normal;font-stretch:normal;font-size:45.171px;line-height:1.25;font-family:Ubuntu;-inkscape-font-specification:Ubuntu;font-variant-ligatures:none;fill:#ebebeb;fill-opacity:1;stroke-width:1.88213"
             x="1159.2567"
             y="973.48712"
             id="text143"><tspan
               sodipodi:role="line"
               x="1159.2567"
               y="973.48712"
               id="tspan143"
               style="fill:#ebebeb;fill-opacity:1;stroke-width:1.88213">the device</tspan></text><text
             xml:space="preserve"
             style="font-style:normal;font-variant:normal;font-weight:normal;font-stretch:normal;font-size:45.171px;line-height:1.25;font-family:Ubuntu;-inkscape-font-specification:Ubuntu;font-variant-ligatures:none;fill:#ebebeb;fill-opacity:1;stroke-width:1.88213"
             x="1180.1709"
             y="1011.9545"
             id="text145"><tspan
               sodipodi:role="line"
               id="tspan145"
               x="1180.1709"
               y="1011.9545"
               style="fill:#ebebeb;fill-opacity:1;stroke-width:1.88213"><tspan
   style="font-style:normal;font-variant:normal;font-weight:500;font-stretch:normal;font-family:Ubuntu;-inkscape-font-specification:'Ubuntu Medium';fill:#ebebeb;fill-opacity:1;stroke-width:1.88213"
   id="tspan144">you</tspan> own</tspan></text></g></g></g><g
       id="rect130-0"
       transform="rotate(33.016216)" /></g><g
     inkscape:groupmode="layer"
     id="layer3"
     inkscape:label="Phone-old-loo"
     style="display:none"><g
       id="g124"
       transform="rotate(6.1752407,-7240.3549,-15738.58)"><g
         id="g101"
         transform="rotate(-16.702458,2179.1982,-4704.808)"><g
           id="g100"
           transform="matrix(2.037339,-0.47940197,0.47940197,2.037339,148.46203,-2451.8672)"><rect
             style="fill:url(#linearGradient124);fill-opacity:1;stroke:#000000;stroke-width:14.2299;stroke-dasharray:none;stroke-opacity:1;paint-order:markers fill stroke"
             id="rect99"
             width="274.57855"
             height="487.44217"
             x="1009.5223"
             y="377.15158"
             transform="rotate(29.79923)"
             ry="30.310513" /><path
             id="path99"
             style="opacity:1;stroke:none;stroke-width:7.42677;paint-order:markers fill stroke"
             transform="rotate(29.645623)"
             d="m 1035.1039,381.78313 228.2894,2.69631 c 20.8535,0.2463 15.6548,13.11661 18.2679,27.15483 l -271.5355,-0.70483 c 1.1921,-16.78326 1.2484,-29.42658 24.9782,-29.14631 z"
             sodipodi:nodetypes="ssccs" /><circle
             style="opacity:1;fill:#454545;fill-opacity:1;stroke:none;stroke-width:7.42677;stroke-dasharray:none;stroke-opacity:1;paint-order:markers fill stroke"
             id="circle99"
             cx="854.20319"
             cy="941.78381"
             r="7.8856425" /></g></g><g
         id="g117"
         transform="matrix(2.8841275,4.4024723e-4,-4.4024723e-4,2.8841275,-1335.5756,-4717.7752)"><g
           id="g105"
           transform="matrix(1.3333333,0,0,-1.3333333,25.4447,2918.3333)"><g
             clip-path="url(#clipPath174-6-7)"
             id="g103"><g
               transform="translate(1234.6665,1176)"
               id="g102"><path
                 id="path101"
                 style="fill:#333333;fill-opacity:1;fill-rule:nonzero;stroke:none"
                 d="m 0,0 c 0,-28.719 -23.281,-52 -52,-52 -28.719,0 -52,23.281 -52,52 0,28.719 23.281,52 52,52 C -23.281,52 0,28.719 0,0" /></g></g></g><g
           id="g115"
           transform="matrix(1.3333333,0,0,-1.3333333,25.4447,2918.3333)"><g
             clip-path="url(#clipPath198-2-5)"
             id="g114"><g
               transform="translate(1168.0864,1195.4727)"
               id="g106"><path
                 id="path105"
                 style="fill:#ffffff;fill-opacity:1;fill-rule:nonzero;stroke:none"
                 d="m 0,0 c 1.417,-2.373 2.805,-4.698 4.189,-7.018 -9.654,-6.835 -9.584,-21.162 0.015,-28.136 -1.394,-2.342 -2.794,-4.693 -4.23,-7.105 -0.296,0.163 -0.548,0.27 -0.764,0.426 -4.666,3.399 -7.866,7.848 -9.582,13.366 -0.193,0.621 -0.181,1.056 0.338,1.583 3.279,3.33 3.243,8.254 0.018,11.623 -0.273,0.285 -0.487,0.878 -0.387,1.232 1.619,5.716 4.92,10.262 9.723,13.735 0.114,0.083 0.236,0.155 0.361,0.22 C -0.259,-0.043 -0.184,-0.041 0,0" /></g><g
               transform="translate(1207.5605,1172.8574)"
               id="g107"><path
                 id="path107"
                 style="fill:#ffffff;fill-opacity:1;fill-rule:nonzero;stroke:none"
                 d="m 0,0 c -0.413,-5.444 -2.164,-10.053 -5.317,-14.13 -0.13,-0.167 -0.281,-0.319 -0.397,-0.495 -0.928,-1.414 -1.929,-2.036 -3.875,-1.632 -3.798,0.789 -7.699,-1.967 -8.79,-5.834 -0.217,-0.766 -0.561,-1.076 -1.312,-1.238 -5.484,-1.184 -10.803,-0.735 -15.961,1.495 -0.258,0.111 -0.513,0.234 -0.762,0.366 -0.087,0.046 -0.152,0.134 -0.282,0.253 1.335,2.392 2.671,4.785 4.03,7.22 2.329,-1.013 4.669,-1.568 7.143,-1.564 8.555,0.015 15.654,6.045 16.96,14.5 0.132,0.852 0.415,1.098 1.256,1.079 C -4.918,-0.036 -2.528,0 0,0" /></g><g
               transform="translate(1207.4907,1175.9609)"
               id="g109"><path
                 id="path108"
                 style="fill:#ffffff;fill-opacity:1;fill-rule:nonzero;stroke:none"
                 d="m 0,0 h -8.295 c -0.734,5.688 -3.457,10.247 -8.526,13.185 -5.05,2.925 -10.325,3.005 -15.783,0.751 -1.344,2.405 -2.679,4.794 -4.064,7.272 0.371,0.191 0.667,0.366 0.98,0.503 5.254,2.279 10.67,2.771 16.256,1.495 0.632,-0.144 0.911,-0.433 1.087,-1.07 1.234,-4.449 5.598,-6.941 10.064,-5.754 0.594,0.157 0.94,0.07 1.365,-0.381 3.99,-4.236 6.26,-9.253 6.912,-15.018 C 0.027,0.712 0,0.435 0,0" /></g><g
               transform="translate(1202.9321,1148.4443)"
               id="g111"><path
                 id="path109"
                 style="fill:#ffffff;fill-opacity:1;fill-rule:nonzero;stroke:none"
                 d="m 0,0 c -0.059,-3.244 -2.703,-5.857 -5.904,-5.836 -3.251,0.022 -5.92,2.748 -5.865,5.991 0.057,3.29 2.73,5.873 6.019,5.815 C -2.536,5.912 0.058,3.219 0,0" /></g><g
               transform="translate(1152.2441,1180.2471)"
               id="g112"><path
                 id="path111"
                 style="fill:#ffffff;fill-opacity:1;fill-rule:nonzero;stroke:none"
                 d="m 0,0 c 3.295,0.016 5.937,-2.612 5.924,-5.894 -0.011,-3.237 -2.611,-5.845 -5.849,-5.87 -3.269,-0.024 -5.934,2.631 -5.922,5.902 C -5.836,-2.616 -3.242,-0.016 0,0" /></g><g
               transform="translate(1191.1616,1200.3154)"
               id="g113"><path
                 id="path113"
                 style="fill:#ffffff;fill-opacity:1;fill-rule:nonzero;stroke:none"
                 d="M 0,0 C 0.068,3.249 2.706,5.817 5.937,5.782 9.237,5.745 11.831,3.087 11.771,-0.199 11.712,-3.469 8.976,-6.098 5.737,-5.995 2.504,-5.893 -0.067,-3.206 0,0" /></g></g></g></g><text
         xml:space="preserve"
         style="font-style:normal;font-variant:normal;font-weight:normal;font-stretch:normal;font-size:37.3159px;line-height:1.25;font-family:Ubuntu;-inkscape-font-specification:Ubuntu;font-variant-ligatures:none;fill:#fffbfa;fill-opacity:1;stroke-width:1.55483"
         x="1458.1539"
         y="490.99347"
         id="text117"
         transform="matrix(1.2244772,1.8691015e-4,-1.8691015e-4,1.2244772,1352.865,-1146.964)"><tspan
           sodipodi:role="line"
           id="tspan117"
           x="1458.1539"
           y="490.99347"
           style="fill:#fffbfa;fill-opacity:1;stroke-width:1.55483">powered by</tspan></text><text
         xml:space="preserve"
         style="font-style:normal;font-variant:normal;font-weight:normal;font-stretch:normal;font-size:65.8043px;line-height:1.25;font-family:Ubuntu;-inkscape-font-specification:Ubuntu;font-variant-ligatures:none;stroke-width:2.74184"
         x="1456.9442"
         y="579.46155"
         id="text118"
         transform="matrix(1.2244772,1.8691015e-4,-1.8691015e-4,1.2244772,1352.865,-1146.964)"><tspan
           sodipodi:role="line"
           id="tspan118"
           x="1456.9442"
           y="579.46155"
           style="stroke-width:2.74184">UBports</tspan></text><g
         id="g123"
         transform="rotate(-0.20241045,-356406.65,-571337.33)"
         style="fill:#ebebeb;fill-opacity:1"><g
           id="g121"
           style="fill:#ebebeb;fill-opacity:1"><text
             xml:space="preserve"
             style="font-style:normal;font-variant:normal;font-weight:normal;font-stretch:normal;font-size:45.171px;line-height:1.25;font-family:Ubuntu;-inkscape-font-specification:Ubuntu;font-variant-ligatures:none;fill:#ebebeb;fill-opacity:1;stroke-width:1.88213"
             x="1159.2567"
             y="973.48712"
             id="text119"><tspan
               sodipodi:role="line"
               x="1159.2567"
               y="973.48712"
               id="tspan119"
               style="fill:#ebebeb;fill-opacity:1;stroke-width:1.88213">the device</tspan></text><text
             xml:space="preserve"
             style="font-style:normal;font-variant:normal;font-weight:normal;font-stretch:normal;font-size:45.171px;line-height:1.25;font-family:Ubuntu;-inkscape-font-specification:Ubuntu;font-variant-ligatures:none;fill:#ebebeb;fill-opacity:1;stroke-width:1.88213"
             x="1180.1709"
             y="1011.9545"
             id="text121"><tspan
               sodipodi:role="line"
               id="tspan121"
               x="1180.1709"
               y="1011.9545"
               style="fill:#ebebeb;fill-opacity:1;stroke-width:1.88213"><tspan
   style="font-style:normal;font-variant:normal;font-weight:500;font-stretch:normal;font-family:Ubuntu;-inkscape-font-specification:'Ubuntu Medium';fill:#ebebeb;fill-opacity:1;stroke-width:1.88213"
   id="tspan120">you</tspan> own</tspan></text></g></g></g></g><g
     inkscape:groupmode="layer"
     id="layer1"
     inkscape:label="Yumi-arms"
     style="display:inline"><path
       style="fill:#f15a24;fill-opacity:1;stroke:none;stroke-width:0.0731122px;stroke-linecap:butt;stroke-linejoin:miter;stroke-opacity:1"
       d="m 120.57743,146.07261 c 0,0 29.01682,3.29055 33.31969,-14.12578 4.26343,-17.2568 -9.92293,-20.72862 -14.50236,-20.3153 -9.06155,0.81782 -11.577,15.8553 -10.65201,18.20811 0.85541,2.17588 -8.23929,16.24778 -8.23929,16.24778 z"
       id="path6"
       sodipodi:nodetypes="cssscc" /><path
       style="opacity:0.536237;fill:#000000;fill-opacity:1;stroke:none;stroke-width:0.69386px;stroke-linecap:butt;stroke-linejoin:miter;stroke-opacity:1;filter:url(#filter7)"
       d="m 1058.5455,483.33682 c 0,0 -127.74189,-22.86699 -142.65559,-145.54274 -14.91363,-122.67574 34.28871,-161.30762 119.10399,-176.91784 39.0257,-7.18269 139.9285,3.31029 229.0708,52.67042 49.1089,27.19275 95.5384,74.21955 86.9595,116.74504 -8.579,42.52549 -92.161,90.29053 -118.2646,92.42512 -26.1037,2.13458 -129.7802,-27.366 -158.2522,13.20324 -28.472,40.56922 -15.9619,47.41676 -15.9619,47.41676 z"
       id="path1"
       sodipodi:nodetypes="cssssssc"
       transform="matrix(0.09621312,0.01667033,-0.01667033,0.09621312,-51.999045,67.917885)" /><path
       style="fill:#f15a24;fill-opacity:1;stroke:none;stroke-width:0.0743025px;stroke-linecap:butt;stroke-linejoin:miter;stroke-opacity:1"
       d="m 41.805566,133.27819 c 0,0 -15.637107,-6.38643 -14.967971,-19.60306 0.669138,-13.21663 6.566901,-16.393336 15.801463,-16.489848 4.249051,-0.04441 14.703872,2.907418 23.207207,9.745288 4.684532,3.76701 8.301008,9.26617 6.618345,13.59635 -1.68263,4.33018 -11.374892,7.84203 -14.168214,7.59003 -2.793315,-0.25198 -10.193891,-3.31014 -13.93976,0.44995 -3.745851,3.76008 -2.55107,4.71129 -2.55107,4.71129 z"
       id="path7"
       sodipodi:nodetypes="cssssssc" /></g></svg>
