<?xml version="1.0" encoding="UTF-8"?>
<svg viewBox="0 0 255.92668 200.17091" xmlns="http://www.w3.org/2000/svg">
 <g transform="translate(-182.99 -467.41)">
  <path d="m358.34 468.41c-4.1947 0-8.369 0.34342-10.625 0.46875-2.4021 0.13345-4.1903 1.2012-6.125 2.6562s-4.0682 3.316-7.25 5.25c-3.1306 1.9029-8.6138 3.8521-13.875 5.2812s-10.358 2.3364-12.594 2.2188-5.5274-1.389-9.25-2.6562-7.9212-2.5312-12.125-2.5312c-4.2935 0-7.9963 2.4432-11.188 5.875s-5.9083 7.8868-8.3125 12.062c-2.3503 4.0822-5.1341 6.2523-9.0312 7.5s-8.9092 1.5296-15.531 1.7188c-13.592 0.38833-17.701 14.184-20.031 18.844-1.0999 2.1998-3.359 3.0992-6.2188 3.4375s-6.2357 0.06445-9.2188-0.0625c-3.2236-0.13717-6.6114 2.1283-9.4688 4.9375s-5.1662 6.2141-6.1562 8.6562c-1.0323 2.5462-0.67385 6.3448-0.4375 9.9688 0.11817 1.812 0.21127 3.571 0.125 5.0625s-0.37749 2.6924-0.90625 3.4062c-0.55947 0.75528-1.5059 1.4636-2.5312 2.25s-2.129 1.6468-2.8438 2.8438-1.0095 2.7454-0.53125 4.6562 1.7006 4.219 4.0312 7.1562l0.0625 0.0625 0.125 0.0625c0.18064 0.09032 0.26152 0.06285 0.34375 0.0625h0.21875c0.12322-0.00158 0.21605 0.0299 0.28125 0.0625s0.13254 0.07129 0.21875 0.28125 0.15625 0.56657 0.15625 1.1562c0 0.262 0.06082 0.56889 0.15625 1.0312s0.22978 1.072 0.40625 1.7812c0.35295 1.4185 0.85327 3.2805 1.4688 5.4688 1.231 4.3765 2.9259 9.9777 4.6875 15.531s3.5891 11.069 5.1875 15.25c0.79921 2.0906 1.5514 3.8425 2.1875 5.125 0.31805 0.64126 0.59913 1.1665 0.875 1.5625s0.48081 0.71427 0.90625 0.84375c1.4077 0.42843 1.9562 0.74712 2.3438 1.4688s0.62007 1.973 1 4.0625c0.38683 2.1276 1.0297 3.7232 3.2812 5.2188s6.0479 3.0044 12.938 5.4062h0.03125c9.819 3.0555 18.093 5.1884 26.906 0.875 0.65175 0.68179 2.2731 2.5998 4.5312 4.8125 2.3715 2.3238 5.3142 4.8486 8.375 6.2812h0.0625c12.444 4.0255 20.494 1.1661 28.156-0.65625s14.948-2.666 26.531 5.2812l0.03125 0.03125h0.03125c6.5164 3.3886 19.691 4.7187 23.969 4.7188 2.2248 0 3.2668-0.98426 4.1875-1.4375 0.46032-0.22662 0.87784-0.33232 1.5312-0.25s1.5506 0.38605 2.8438 1.125c2.8165 1.6094 8.7722 2.966 14.875 3.5938s12.293 0.54694 15.562-1.1875c3.2817-1.7408 7.8152-5.6901 11.688-9.1875 1.9362-1.7487 3.675-3.387 5-4.5625 0.6625-0.58777 1.2247-1.0665 1.625-1.375 0.20017-0.15425 0.36731-0.25374 0.46875-0.3125l0.09375-0.0625c0.09949-1.3e-4 0.1937 0.00789 0.28125-0.03125 0.14549-0.06504 0.24112-0.15506 0.3125-0.25 0.14275-0.18988 0.21337-0.37191 0.28125-0.59375 0.13577-0.44369 0.25568-1.01 0.40625-1.625 0.30114-1.23 0.77618-2.6176 1.75-3.375 1.2804-0.9959 26.7-21.764 28.562-23.375 0.78621-0.68022 1.6431-0.96971 2.4375-1.6562s1.3996-1.791 1.5625-3.875c0.16162-2.0677 0.29044-8.1877 0.40625-14.469s0.21514-12.687 0.3125-15.219c0.13593-3.5342-2.2575-8.1078-5.4375-12.719s-7.2019-9.2313-10.5-12.656c-3.1398-3.2606-4.9347-9.2478-5.875-15.312s-1.0625-12.194-1.0625-15.781c0-1.9558-0.87117-4.5096-2.25-7.375s-3.256-6.0147-5.3438-9.0312-4.3735-5.8996-6.5312-8.2188-4.1711-4.0899-5.8438-4.875c-1.3819-0.64867-3.528-2.6362-5.875-5.2812s-4.9368-5.93-7.5-9.2188-5.0843-6.5621-7.25-9.1875-3.9275-4.609-5.25-5.3438c-2.4656-1.3698-6.6491-1.6562-10.844-1.6562z" fill="#fdc78b" fill-rule="evenodd" stroke="#000" stroke-width="2"/>
  <path d="m326.43 502.72c15-19.286 20.357-16.786 27.857-18.214s21.429 2.8571 25 4.2857 9.2857 20.714 9.6429 26.071-7.5 16.071-12.5 18.571-25.357 3.9286-30.714 2.1429-20-13.929-20-19.643 1.0714-12.857 0.71428-13.214z" fill="none" stroke="#000" stroke-width="2"/>
  <path d="m336.79 512.36c1.7857-11.071 11.071-12.5 15.714-13.929s10.357-2.1429 14.643 0.71429 12.5 9.6428 12.857 11.071-2.8571 3.5714-5.7143 3.5714-12.857-3.2143-19.286-2.5-17.5 1.7857-18.214 1.0714z" fill="#f8deb8" fill-rule="evenodd" stroke="#000"/>
  <path d="m382.69 491.25c-0.21572 0.10007-0.24886 0.88861-0.1875 2.0312 3.05 6.3939 6.177 17.687 6.4375 21.594 0.35715 5.3571-7.5 16.062-12.5 18.562s-25.362 3.9107-30.719 2.125c-4.3767-1.4589-14.963-9.806-18.688-15.938-0.14045 0.07208-0.25 0.17111-0.25 0.25 0 0.26412 0.17973 1.1113 0.4375 2.2188 1.9072 5.5677 3.4197 10.499 3.5312 11.281 0.73216 5.1347 8.841 13.523 14.969 15.438 8.0812 2.5254 25.275 3.2619 32.094-1.0312 6.1302-3.8598 16.614-17.009 18.879-22.54 0.91719-0.2494 0.29888-1.2936 0 0 0.21453 0.20294 0.64588-0.64667 0.70932-0.32601s0.07146 0.67323 0.0643 1.0037-0.34199 1.7773-0.33925 2.0097 0.03055 0.38881 0.12367 0.41524c0.30368 0.08619 0.42295 0.23951 0.41525 0.44862s-0.14236 0.47401-0.34655 0.78338-0.47791 0.66322-0.76372 1.0502-0.58369 0.80711-0.83623 1.249c-1.0102 1.7678-21.977 30.048-24.25 34.594-1.0861 2.1721-2.0763 5.322-2 7.7188 0.88511 1.2321 1.8959 2.4773 2.9375 3.4375 0.71468 0.00353 1.5855-0.16239 2.625-0.53125 7.8287-2.7779 16.896-21.472 17.906-24.25s2.2973-5.815 3.8125-5.5625 3.5178 2.7736 1.75 3.5312-3.5287 1.7686-3.7812 3.0312-5.2998 13.126-6.5625 16.156-0.50682 5.3234 3.2812 7.3438c0.39459 0.21045 0.79841 0.37332 1.2188 0.53125 2.7388 0.1782 5.9631 0.17155 8.375-0.03125 0.49663-0.99322 3.8853-2.2088 4-2.25-0.30002-1.5948-2.1823-4.1112-3.5938-7.875-2.1429-5.7143 3.5491-29.638 3.9062-36.781s-5-15.013-22.5-39.656c-0.06696-0.04464-0.10794-0.05366-0.15625-0.03125z" fill="#ccc" fill-opacity=".34397" fill-rule="evenodd" stroke="#000" stroke-linecap="round" stroke-linejoin="round" stroke-width="2"/>
  <path d="m293.95 493.75c3.5355 4.0406 5.5558 10.607 8.5863 13.637s1.5152-4.0406 1.5152-9.5964 3.5355-8.0812 0-9.0914-9.5964 4.0406-10.102 5.0508z" fill="#4c4c4c" fill-opacity=".50355" fill-rule="evenodd"/>
  <path d="m321.31 504.81c-0.19741-0.05007-0.34957 0.14672-0.71875 0.78125 1.5692 2.6526 3.9693 8.8759 6.0312 14.781-0.95507-5.22-1.9542-10.876-2.5625-14.281-1.9286-0.45727-2.421-1.1978-2.75-1.2812zm5.3125 15.562c1.2141 6.6358 2.3655 12.688 2.6875 13.688 1.1001 3.4156 1.4121 9.8516-0.25 16.5-2.5254 10.102-9.6123 10.12-10.875 10.625s6.5666 0.23988 12.375 1.25 13.656 11.125 13.656 11.125 7.3225-4.5566 15.656-2.0312 9.0912 10.855 9.3438 12.875-5.0458 5.0685 8.8438-1.75 18.672-0.50507 20.188 0-1.2486 1.5076 14.156 0.75l-7.3438-7.8438s-3.5262 1.2711-4.0312 2.2812-5.8057 1.5203-9.5938-0.5-4.5439-4.3133-3.2812-7.3438 6.31-14.894 6.5625-16.156 2.0135-2.2736 3.7812-3.0312-0.23476-3.2787-1.75-3.5312-2.8024 2.7846-3.8125 5.5625-10.078 21.472-17.906 24.25-5.8354-6.0793-3.5625-10.625 23.24-32.826 24.25-34.594 3.0351-10.557 2.067-5.2277c0.03934 2.7434 2.0253-7.7947 1.6916-11.767-0.15128-1.0792-2.7622-4.3187-2.8412-4.4387 0.34019 5.3733 0.5801 10.39-1.1332 14.964-2.5788 6.4364-12.077 18.841-17.69 22.375-6.8185 4.2932-24.013 3.5566-32.094 1.0312-6.1278-1.9149-14.237-10.303-14.969-15.438-0.12312-0.86343-1.9398-6.7418-4.125-13zm87.531 13.438c-0.12925 1.7735-0.39121 7.3368-1.875 9.5625-1.5152 2.2728-2.1562 21.466-2.1562 24.875s1.0186 4.03 2.2812 4.1562 0.73985-4.046 1.75-5.6875 7.7203 2.4268 13.781 6.5938c5.8459 4.0191 6.9027 11.01 8.7812 20.562 0.06806-3.787 0.12373-7.1856 0.1875-8.8438 0.11661-3.0318-2.1165-7.5815-5.25-12.125s-7.1384-9.1376-10.406-12.531c-3.4262-3.5579-5.1712-9.6919-6.125-15.844-0.58839-3.7951-0.84158-7.5135-0.96875-10.719z" fill-rule="evenodd"/>
  <path d="m367.7 586.68c-6.8185 3.7881-8.0812 5.3033-14.142 3.5355s-14.647-5.8084-24.749-4.7982-4.7982 1.5152-15.152 2.5254-26.517 20.708-21.466 37.376 33.588 17.678 37.628 19.445 11.364 2.7779 19.193 2.5254 23.234 4.5457 26.769 3.5355 15.405-9.3439 16.162-11.364 1.0102-26.011 0.75761-29.042-2.2728-3.283-2.2728-3.283" fill="none" stroke="#000" stroke-width="2"/>
  <path d="m402.29 616.73c-0.75761 10.607-2.0203 22.223-2.0203 22.223m-23.991-3.7881c1.0102-10.859 1.7678-13.89 1.7678-13.89m-6.566-6.566c-2.0203 26.769-2.2728 27.779-2.2728 27.779" fill="none" stroke="#000"/>
  <g fill="#f8deb8" fill-rule="evenodd" stroke="#000">
   <path d="m337.9 601.83c-21.466-9.0914-19.951-9.5964-28.032-7.8287s-14.9 22.476-11.617 33.84 9.849 6.8185 11.869 7.5762 9.0914 5.3033 14.395 4.7982 13.385-7.8287 15.91-18.94 0.25254-15.91-2.5254-19.445z"/>
   <path d="m324.13 628.22c1.7678-9.0914 2.7779-15.531 4.5457-17.678s-6.3134 4.5457-6.6923 7.3236l-0.3788 2.7779m1.894-14.395c-4.1669 9.0914-4.2932 11.869-5.3033 12.248s-3.0305 2.2728-3.0305 2.9042 0.12627 1.6415 0.12627 1.6415m-2.7779-5.3033c0.12627-1.2627 1.389-1.2627 2.2728-3.0305s0.50507-2.9042 0.50507-2.9042"/>
  </g>
  <path d="m263.81 635.62c-0.32301-0.00203-0.62215 0.03093-0.90625 0.0625-3.347 0.37188-6.7175 2.3826-11.375 7.25 0.16496-0.07642 0.33467-0.13783 0.5-0.21875 0.65175 0.68179 2.2731 2.5998 4.5312 4.8125 2.3715 2.3238 5.3142 4.8486 8.375 6.2812h0.0625c12.444 4.0255 20.494 1.1661 28.156-0.65625s14.948-2.666 26.531 5.2812l0.03125 0.03125h0.03125c6.5164 3.3886 19.691 4.7187 23.969 4.7188 2.2248 0 3.2668-0.98426 4.1875-1.4375 0.46032-0.22662 0.87784-0.33232 1.5312-0.25s1.5506 0.38605 2.8438 1.125c2.8165 1.6094 8.7722 2.966 14.875 3.5938s12.293 0.54694 15.562-1.1875c3.2817-1.7408 7.8152-5.6901 11.688-9.1875 1.9362-1.7487 3.675-3.387 5-4.5625 0.6625-0.58777 1.2247-1.0665 1.625-1.375 0.20017-0.15425 0.36731-0.25374 0.46875-0.3125l0.09375-0.0625c-7.9178 1.0736-18.64 2.3743-22.781 2.5625-5.5558 0.25253-18.948-2.7948-20.969-4.5625s-4.5438-0.25001-12.625-0.25-12.136-0.23222-14.156-2-2.7482-0.52868-6.0312-0.78125-5.076-2.75-6.8438-2.75-14.123-3.2838-17.406-3.0312-13.889 2.0076-18.688 1.25c-4.4983-0.71027-13.436-4.3132-18.281-4.3438z" fill-opacity=".2234" fill-rule="evenodd" stroke="#140d06" stroke-opacity=".62766"/>
  <path d="m313.88 566.41c-15.482 0.15598-30.252 6.7771-41.597 17.124-21.269 15.295-46.202 24.116-70.246 33.97 0.36457 7.2761 7.7498 10.472 8.7168 17.79 8.2047 5.5234 18.288 8.0889 27.957 9.7235 11.34 3.6055 16.675-10.259 27.099-9.2226 9.1139 1.8866 18.057 6.0492 27.562 3.7855 4.0887-1.3063 14.134-0.32538 14.911-0.02743-9.6031-2.8821-18.326-11.473-17.007-22.189 1.0923-12.151 8.8399-24.415 20.383-29.02 10.746-1.6584 21.862-5.2225 32.588-1.1397 8.043 3.6961 19.641 6.0586 24.977-2.7947-0.16704-7.911-7.1884-14.707-15.306-13.623-7.015 2.354-10.644 2.2006-15.739-2.2918-8.1001-0.64914-16.173-1.9328-24.299-2.0852z" fill="#adadad" fill-opacity=".24113" fill-rule="evenodd" opacity=".98621"/>
  <path d="m283.35 554.1c-13.89 6.3134-14.142 6.3134-14.142 6.3134m-0.75761 8.8388c10.607-5.5558 11.112-5.8084 11.112-5.8084m-10.607 10.102c6.566-5.5558 20.456-9.5964 22.476-11.112l2.0203-1.5152m-26.769 26.516c11.617-6.8185 13.89-12.627 19.951-12.122s15.657 0.75762 16.92 0.25254 5.8084-2.5254 5.8084-2.5254" fill="none" stroke="#000"/>
  <path d="m247.74 580.12c-7.3236 2.2728-5.8084 1.2627-8.3338 2.5254s-4.0406 2.5254-6.8185 2.5254-3.7881 0.25254-3.7881 0.25254m-4.0406 6.3134c3.7881-2.0203 6.0609-1.5152 9.5964-3.283l4.0406-2.0203m11.364 10.354c-10.102 3.7881-13.637 4.0406-15.91 5.5558s-3.5355 3.0305-5.8084 2.7779-2.5254-0.50507-2.5254-0.50507m12.374 13.132c2.7779-1.7678 6.0609 0 7.5762-1.5152s4.7982-3.7881 6.8185-3.7881h1.7678" fill="none" stroke="#000"/>
  <path d="m225.77 618.5c-4.7982 0-4.2931 1.2627-7.0711 2.0203s-4.0406 4.0406-4.0406 4.0406-3.5355 0-4.7982 0.75761-1.7678 1.0102-1.7678 1.0102m-2.5254-13.132c5.5558-0.50507 6.8185-4.2932 8.8388-3.7881l2.0203 0.50508" fill="none" stroke="#000"/>
  <path d="m222.49 540.47c-3.7881 46.972-5.3033 54.548 2.2728 64.65s35.355 30.557 38.386 31.82l3.0305 1.2627m-3.5355-122.73c-2.7779 43.689-2.7779 62.882 2.2728 70.206s8.8388 15.91 15.405 20.203 11.112 5.8084 11.112 5.8084m-100.83-34.156c-0.44195-4.9245-1.894-5.0508-0.44195-7.7024l1.4521-2.6516" fill="none" stroke="#000" stroke-linecap="round" stroke-linejoin="round" stroke-width="3"/>
 </g>
</svg>
