<?xml version="1.0" encoding="UTF-8" standalone="no"?>
<svg
   xmlns:dc="http://purl.org/dc/elements/1.1/"
   xmlns:cc="http://creativecommons.org/ns#"
   xmlns:rdf="http://www.w3.org/1999/02/22-rdf-syntax-ns#"
   xmlns:svg="http://www.w3.org/2000/svg"
   xmlns="http://www.w3.org/2000/svg"
   xmlns:sodipodi="http://sodipodi.sourceforge.net/DTD/sodipodi-0.dtd"
   xmlns:inkscape="http://www.inkscape.org/namespaces/inkscape"
   height="526"
   width="1920"
   version="1.1"
   viewBox="0 0 507.99999 139.17084"
   id="svg115"
   sodipodi:docname="banner-11stepSwan.svg"
   inkscape:version="0.92.4 (unknown)"
   inkscape:export-filename="/home/cibersheep/Ubuntu_Touch_Projects/design/OTA11/banner-11stepSwan.png"
   inkscape:export-xdpi="96"
   inkscape:export-ydpi="96">
  <metadata
     id="metadata119">
    <rdf:RDF>
      <cc:Work
         rdf:about="">
        <dc:format>image/svg+xml</dc:format>
        <dc:type
           rdf:resource="http://purl.org/dc/dcmitype/StillImage" />
        <dc:title></dc:title>
      </cc:Work>
    </rdf:RDF>
  </metadata>
  <sodipodi:namedview
     pagecolor="#ffffff"
     bordercolor="#666666"
     borderopacity="1"
     objecttolerance="10"
     gridtolerance="10"
     guidetolerance="10"
     inkscape:pageopacity="0"
     inkscape:pageshadow="2"
     inkscape:window-width="1859"
     inkscape:window-height="1056"
     id="namedview117"
     showgrid="false"
     inkscape:zoom="0.43328205"
     inkscape:cx="1060.8937"
     inkscape:cy="170.57309"
     inkscape:window-x="61"
     inkscape:window-y="24"
     inkscape:window-maximized="1"
     inkscape:current-layer="svg115" />
  <defs
     id="defs5">
    <filter
       id="a"
       style="color-interpolation-filters:sRGB"
       height="1.168"
       width="1.194"
       y="-.08395"
       x="-.09699">
      <feGaussianBlur
         stdDeviation="12.947969"
         id="feGaussianBlur2" />
    </filter>
    <filter
       inkscape:collect="always"
       style="color-interpolation-filters:sRGB"
       id="filter5390"
       x="-0.090806151"
       width="1.1816123"
       y="-0.14077622"
       height="1.2815524">
      <feGaussianBlur
         inkscape:collect="always"
         stdDeviation="0.5109045"
         id="feGaussianBlur5392" />
    </filter>
    <filter
       inkscape:collect="always"
       style="color-interpolation-filters:sRGB"
       id="filter5480"
       x="-0.12423437"
       width="1.2484687"
       y="-0.24826264"
       height="1.4965253">
      <feGaussianBlur
         inkscape:collect="always"
         stdDeviation="0.80036945"
         id="feGaussianBlur5482" />
    </filter>
    <filter
       inkscape:collect="always"
       style="color-interpolation-filters:sRGB"
       id="filter5514"
       x="-0.26025627"
       width="1.5205125"
       y="-0.21255603"
       height="1.4251121">
      <feGaussianBlur
         inkscape:collect="always"
         stdDeviation="0.4393094"
         id="feGaussianBlur5516" />
    </filter>
    <filter
       inkscape:collect="always"
       style="color-interpolation-filters:sRGB"
       id="filter5528"
       x="-0.080044749"
       width="1.1600895"
       y="-0.25995245"
       height="1.5199049">
      <feGaussianBlur
         inkscape:collect="always"
         stdDeviation="0.47348186"
         id="feGaussianBlur5530" />
    </filter>
    <filter
       inkscape:collect="always"
       style="color-interpolation-filters:sRGB"
       id="filter5644"
       x="-0.092043614"
       width="1.1840872"
       y="-0.17234688"
       height="1.3446938">
      <feGaussianBlur
         inkscape:collect="always"
         stdDeviation="1.2869108"
         id="feGaussianBlur5646" />
    </filter>
  </defs>
  <rect
     style="opacity:0.4;color-rendering:auto;color:#000000;isolation:auto;mix-blend-mode:normal;paint-order:markers fill stroke;shape-rendering:auto;solid-color:#000000;image-rendering:auto;fill:#ec2259"
     height="139.6"
     width="509.1"
     y="-.2146"
     x="-0.55"
     id="rect9" />
  <g
     id="g5698"
     transform="translate(-5.6131368)">
    <g
       transform="matrix(0.79522935,0,0,0.79522935,8.4790653,14.396428)"
       id="g4976">
      <g
         id="g15"
         transform="matrix(0.23350709,-0.23350709,0.23350709,0.23350709,82.825789,-14.77373)"
         style="fill:#ec2259;fill-opacity:1">
        <rect
           id="rect13"
           x="-185.7"
           y="39.599998"
           width="81.93"
           height="81.93"
           style="color:#000000;isolation:auto;mix-blend-mode:normal;solid-color:#000000;fill:#ec2259;fill-opacity:1;paint-order:markers fill stroke;color-rendering:auto;image-rendering:auto;shape-rendering:auto" />
      </g>
      <g
         id="g4933"
         transform="matrix(0.52941178,0,0,0.52941178,58.947077,-16.994475)">
        <path
           inkscape:connector-curvature="0"
           id="path4916"
           d="m -30.766433,156.41356 -27.554553,24.84981 29.752155,73.36611 24.8498116,-73.39496 z"
           style="fill:#ec2259;fill-opacity:1;fill-rule:evenodd;stroke:none;stroke-width:0.26458335px;stroke-linecap:butt;stroke-linejoin:miter;stroke-opacity:1"
           sodipodi:nodetypes="ccccc" />
        <path
           sodipodi:nodetypes="cccc"
           style="fill:#dcdcdc;fill-rule:evenodd;stroke-width:0.79650003"
           d="m -31.735829,181.18679 -26.585157,0.0766 29.752155,73.36611 z"
           id="path19"
           inkscape:connector-curvature="0" />
        <path
           inkscape:connector-curvature="0"
           id="path4918"
           d="m -30.50613,181.30632 26.7871106,-0.0718 -24.8498116,73.395 z"
           style="fill:#dcdcdc;fill-opacity:1;fill-rule:evenodd;stroke-width:0.79650003"
           sodipodi:nodetypes="cccc" />
      </g>
      <g
         transform="matrix(0.52941178,0,0,0.52941178,153.93576,63.053469)"
         id="g4941">
        <g
           id="g4946"
           transform="translate(-19.158584,-146.88248)">
          <path
             sodipodi:nodetypes="ccccc"
             inkscape:connector-curvature="0"
             id="path4935"
             d="m -30.766433,156.41356 -14.684747,23.94667 16.882349,74.26925 15.592582,-74.37803 z"
             style="fill:#dcdcdc;fill-opacity:1;fill-rule:evenodd;stroke:none;stroke-width:0.26458335px;stroke-linecap:butt;stroke-linejoin:miter;stroke-opacity:1" />
          <path
             sodipodi:nodetypes="cccc"
             style="fill:#ec2259;fill-rule:evenodd;stroke-width:0.79650003"
             d="m -29.736755,188.86352 -15.714425,-8.50329 16.882349,74.26927 z"
             id="path4937"
             inkscape:connector-curvature="0" />
          <path
             inkscape:connector-curvature="0"
             id="path4939"
             d="m -28.737218,188.86352 15.760969,-8.61207 -15.592582,74.37803 z"
             style="fill:#ec2259;fill-opacity:1;fill-rule:evenodd;stroke-width:0.79650003"
             sodipodi:nodetypes="cccc" />
        </g>
      </g>
      <g
         style="fill:#dcdcdc;fill-opacity:1"
         transform="matrix(0.23350709,-0.23350709,0.23350709,0.23350709,125.15914,-11.598738)"
         id="g4950">
        <path
           style="color:#000000;isolation:auto;mix-blend-mode:normal;solid-color:#000000;fill:#dcdcdc;fill-opacity:1;paint-order:markers fill stroke;color-rendering:auto;image-rendering:auto;shape-rendering:auto"
           d="m -102.63692,27.136063 v 81.930057 h -81.93 z"
           id="rect4948"
           inkscape:connector-curvature="0"
           sodipodi:nodetypes="cccc" />
      </g>
      <g
         transform="matrix(0.52941178,0,0,0.52941178,104.77674,-16.994475)"
         id="g4959">
        <path
           sodipodi:nodetypes="ccccc"
           style="fill:#dcdcdc;fill-opacity:1;fill-rule:evenodd;stroke:none;stroke-width:0.26458335px;stroke-linecap:butt;stroke-linejoin:miter;stroke-opacity:1"
           d="m -30.766433,156.41356 -27.554553,24.84981 29.752155,73.36611 24.8498116,-73.39496 z"
           id="path4953"
           inkscape:connector-curvature="0" />
      </g>
    </g>
    <g
       transform="matrix(1.2418911,0,0,1.2418911,-3.2670516,106.52292)"
       id="g5237">
      <g
         id="g5072"
         transform="translate(15.345839,-0.52916667)">
        <path
           id="path4935-6"
           transform="scale(0.26458334)"
           d="m 1253.748,-234.57227 -29.3828,47.91407 13.0879,57.57617 h 39.7774 l 12.1152,-57.79297 z"
           style="fill:#dcdcdc;fill-opacity:1;fill-rule:evenodd;stroke:none;stroke-width:0.52941179px;stroke-linecap:butt;stroke-linejoin:miter;stroke-opacity:1"
           inkscape:connector-curvature="0" />
        <path
           id="path4937-0"
           transform="scale(0.26458334)"
           d="m 1224.3652,-186.6582 13.0879,57.57617 h 19.0762 l -0.7207,-40.56055 z"
           style="fill:#ec2259;fill-rule:evenodd;stroke-width:1.59373784"
           inkscape:connector-curvature="0" />
        <path
           id="path4939-7"
           transform="scale(0.26458334)"
           d="m 1289.3457,-186.875 -31.5371,17.23242 0.1035,40.56055 h 19.3184 z"
           style="fill:#ec2259;fill-opacity:1;fill-rule:evenodd;stroke-width:1.59373784"
           inkscape:connector-curvature="0" />
        <path
           sodipodi:nodetypes="ccccc"
           inkscape:connector-curvature="0"
           id="path5015"
           d="m 335.91733,-47.999457 -6.26867,-0.257431 -2.23919,14.103933 h 10.52444 z"
           style="fill:#dcdcdc;fill-opacity:1;fill-rule:evenodd;stroke:none;stroke-width:0.13240582px;stroke-linecap:butt;stroke-linejoin:miter;stroke-opacity:1" />
        <path
           sodipodi:nodetypes="cccc"
           inkscape:connector-curvature="0"
           id="path5017"
           d="m 332.86067,-59.524778 -5.4512,25.371823 5.00324,-0.168899 z"
           style="fill:#ec2259;fill-rule:evenodd;stroke-width:0.38076371" />
        <path
           sodipodi:nodetypes="cccc"
           inkscape:connector-curvature="0"
           id="path5019"
           d="m 332.86067,-59.524778 -0.0648,25.202924 h 4.81929 z"
           style="fill:#ec2259;fill-opacity:1;fill-rule:evenodd;stroke-width:0.38076371" />
      </g>
      <g
         id="g5132"
         transform="translate(20.637506,-0.52916667)">
        <g
           transform="translate(26.458334)"
           id="g5100">
          <path
             inkscape:connector-curvature="0"
             id="path5088"
             transform="scale(0.26458334)"
             d="m 1253.748,-234.57227 -29.3828,47.91407 13.0879,57.57617 h 39.7774 l 12.1152,-57.79297 z"
             style="fill:#dcdcdc;fill-opacity:1;fill-rule:evenodd;stroke:none;stroke-width:0.52941179px;stroke-linecap:butt;stroke-linejoin:miter;stroke-opacity:1" />
          <path
             inkscape:connector-curvature="0"
             id="path5090"
             transform="scale(0.26458334)"
             d="m 1224.3652,-186.6582 13.0879,57.57617 h 19.0762 l -0.7207,-40.56055 z"
             style="fill:#ec2259;fill-rule:evenodd;stroke-width:1.59373784" />
          <path
             inkscape:connector-curvature="0"
             id="path5092"
             transform="scale(0.26458334)"
             d="m 1289.3457,-186.875 -31.5371,17.23242 0.1035,40.56055 h 19.3184 z"
             style="fill:#ec2259;fill-opacity:1;fill-rule:evenodd;stroke-width:1.59373784" />
          <path
             sodipodi:nodetypes="ccccc"
             inkscape:connector-curvature="0"
             id="path5094"
             d="m 335.91733,-47.999457 -6.26867,-0.257431 -2.23919,14.103933 h 10.52444 z"
             style="fill:#dcdcdc;fill-opacity:1;fill-rule:evenodd;stroke:none;stroke-width:0.13240582px;stroke-linecap:butt;stroke-linejoin:miter;stroke-opacity:1" />
          <path
             id="path5096"
             transform="matrix(0.26458334,0,0,0.26458334,-26.458334,0)"
             d="m 1349.0039,-182.8457 -11.5508,53.76367 18.9102,-0.63867 0.9453,-53.125 z"
             style="fill:#ec2259;fill-rule:evenodd;stroke-width:1.43910694"
             inkscape:connector-curvature="0" />
          <path
             id="path5098"
             transform="matrix(0.26458334,0,0,0.26458334,-26.458334,0)"
             d="m 1357.9473,-182.8457 -0.1368,53.125 h 18.2149 l -10.0215,-53.125 z"
             style="fill:#ec2259;fill-opacity:1;fill-rule:evenodd;stroke-width:1.43910694"
             inkscape:connector-curvature="0" />
          <path
             inkscape:connector-curvature="0"
             id="path5108"
             d="m 330.46562,-48.377926 h 4.49792 l -2.3423,13.208701 -2.15562,-13.208701"
             style="fill:#eeeeee;fill-opacity:1;fill-rule:evenodd;stroke:none;stroke-width:0.26458335px;stroke-linecap:butt;stroke-linejoin:miter;stroke-opacity:1" />
        </g>
      </g>
      <g
         id="g5122"
         transform="translate(5.5031345e-6,37.041668)">
        <path
           style="fill:#ec2259;fill-opacity:1;fill-rule:evenodd;stroke:none;stroke-width:0.52941179px;stroke-linecap:butt;stroke-linejoin:miter;stroke-opacity:1"
           d="m 1255.748,-234.57227 -31.3828,47.91407 13.0879,57.57617 h 39.7774 l 12.1152,-57.79297 z"
           transform="scale(0.26458334)"
           id="path5110"
           inkscape:connector-curvature="0"
           sodipodi:nodetypes="cccccc" />
        <path
           style="fill:#dcdcdc;fill-opacity:1;fill-rule:evenodd;stroke-width:1.59373784"
           d="m 1224.3652,-186.6582 13.0879,57.57617 h 19.0762 l -0.7207,-48.56055 z"
           transform="scale(0.26458334)"
           id="path5112"
           inkscape:connector-curvature="0"
           sodipodi:nodetypes="ccccc" />
        <path
           style="fill:#dcdcdc;fill-opacity:1;fill-rule:evenodd;stroke-width:1.59373784"
           d="m 1289.3457,-186.875 -31.5371,9.23242 0.1035,48.56055 h 19.3184 z"
           transform="scale(0.26458334)"
           id="path5114"
           inkscape:connector-curvature="0"
           sodipodi:nodetypes="ccccc" />
      </g>
      <g
         id="g5183"
         transform="translate(6.6104545)">
        <path
           id="path5134"
           transform="scale(0.26458334)"
           d="m 1353.748,-94.572266 -29.3828,47.914063 13.0879,57.576172 h 19.9239 V -89.708984 Z"
           style="fill:#dcdcdc;fill-opacity:1;fill-rule:evenodd;stroke:none;stroke-width:0.52941179px;stroke-linecap:butt;stroke-linejoin:miter;stroke-opacity:1"
           inkscape:connector-curvature="0" />
        <path
           inkscape:connector-curvature="0"
           id="path5136"
           d="m 350.40497,-12.344982 3.46284,15.2336954 h 5.04724 l -0.19068,-10.7316458 z"
           style="fill:#ec2259;fill-rule:evenodd;stroke-width:0.42167649" />
        <path
           id="path5140"
           transform="scale(0.26458334)"
           d="m 1345.916,-42.388672 -8.4629,53.306641 h 19.9239 v -52.835938 z"
           style="fill:#dcdcdc;fill-opacity:1;fill-rule:evenodd;stroke:none;stroke-width:0.50043142px;stroke-linecap:butt;stroke-linejoin:miter;stroke-opacity:1"
           inkscape:connector-curvature="0" />
        <path
           inkscape:connector-curvature="0"
           id="path5142"
           d="m 356.92396,-11.336258 -3.05615,14.2249714 5.00332,-0.1689815 0.25011,-14.0559899 z"
           style="fill:#ec2259;fill-rule:evenodd;stroke-width:0.38076371" />
        <path
           id="path5146"
           transform="scale(0.26458334)"
           d="m 1349.0039,-42.845703 8.1465,49.9218749 0.2266,-1.2773438 V -42.845703 Z"
           style="fill:#eeeeee;fill-opacity:1;fill-rule:evenodd;stroke:none;stroke-width:1px;stroke-linecap:butt;stroke-linejoin:miter;stroke-opacity:1"
           inkscape:connector-curvature="0" />
      </g>
      <g
         id="g5195"
         transform="translate(20.637538)">
        <g
           id="g5202"
           transform="translate(10.583333)">
          <path
             inkscape:connector-curvature="0"
             id="path5185"
             transform="scale(0.26458334)"
             d="m 1353.748,-94.572266 -29.3828,47.914063 13.0879,57.576172 h 19.9239 V -89.708984 Z"
             style="fill:#dcdcdc;fill-opacity:1;fill-rule:evenodd;stroke:none;stroke-width:0.52941179px;stroke-linecap:butt;stroke-linejoin:miter;stroke-opacity:1" />
          <path
             inkscape:connector-curvature="0"
             id="path5187"
             d="m 350.40497,-12.344982 3.46284,15.2336954 h 5.04724 l -0.19068,-10.7316458 z"
             style="fill:#ec2259;fill-rule:evenodd;stroke-width:0.42167649" />
          <path
             inkscape:connector-curvature="0"
             id="path5189"
             transform="scale(0.26458334)"
             d="m 1345.916,-42.388672 -8.4629,53.306641 h 19.9239 v -52.835938 z"
             style="fill:#dcdcdc;fill-opacity:1;fill-rule:evenodd;stroke:none;stroke-width:0.50043142px;stroke-linecap:butt;stroke-linejoin:miter;stroke-opacity:1" />
          <path
             sodipodi:nodetypes="ccccc"
             inkscape:connector-curvature="0"
             id="path5191"
             d="m 362.67061,-10.923425 -8.8028,13.8121384 5.21988,-0.081698 5.61277,-12.8891514 z"
             style="fill:#ec2259;fill-rule:evenodd;stroke-width:0.38076371" />
          <path
             sodipodi:nodetypes="ccccc"
             inkscape:connector-curvature="0"
             id="path5193"
             d="m 362.67061,-10.923425 0.95283,14.0306152 0.0838,-0.3328635 0.91265,-12.8381317 z"
             style="fill:#eeeeee;fill-opacity:1;fill-rule:evenodd;stroke:none;stroke-width:0.26458335px;stroke-linecap:butt;stroke-linejoin:miter;stroke-opacity:1" />
        </g>
      </g>
    </g>
  </g>
  <path
     transform="matrix(-1.0195024,-3.8048346,-3.8048346,1.0195024,594.02873,1446.6647)"
     style="opacity:0.1;fill:#150006;fill-opacity:1;fill-rule:evenodd;stroke:none;stroke-width:0.14925182px;stroke-linecap:butt;stroke-linejoin:miter;stroke-opacity:1;filter:url(#filter5644)"
     d="m 368.68807,-7.8751952 -0.0329,0.039785 -0.96719,13.6058486 -0.0893,0.3546201 -0.0287,-0.6012809 -0.0202,0.2837084 -0.0893,0.3546201 -0.56748,-11.8719213 -7.75207,9.3500706 -1.4e-4,3.62e-5 6e-5,0.025599 -0.23891,5.2e-5 -5.378,-6.39e-5 -0.046,-0.2024366 -0.30462,4.7e-6 -2.12415,-10.3718936 0.0628,-0.03666 -1.27774,-5.6208502 0.23023,-0.375438 -0.0783,-0.34444 0.25198,0.06113 7.8796,-12.849205 1.02308,1.371011 4e-5,13.47331 -10e-6,9.4186354 7.58486,-7.3957219 -0.004,-0.093442 0.0553,0.043794 0.083,-0.080842 1.8009,1.428152 -8e-4,0.011067 z"
     id="path5545"
     inkscape:connector-curvature="0" />
  <g
     transform="matrix(-1.0195024,-3.8048347,-3.8048347,1.0195024,604.52679,1480.5368)"
     id="g5195-5">
    <g
       transform="translate(10.583333)"
       id="g5202-2">
      <g
         id="g5543">
        <path
           inkscape:connector-curvature="0"
           id="path5185-1"
           transform="scale(0.26458334)"
           d="m 1353.748,-94.572266 -29.3828,47.914063 13.0879,57.576172 h 19.9239 V -89.708984 Z"
           style="fill:#dcdcdc;fill-opacity:1;fill-rule:evenodd;stroke:none;stroke-width:0.52941179px;stroke-linecap:butt;stroke-linejoin:miter;stroke-opacity:1" />
        <path
           style="opacity:0.1;fill:#10080a;fill-opacity:1;fill-rule:evenodd;stroke-width:0.38539952;filter:url(#filter5480)"
           d="m 350.54767,-13.020627 3.16493,13.92313548 h 4.61302 l 0.18502,-11.98816748 z"
           id="path5394"
           inkscape:connector-curvature="0"
           sodipodi:nodetypes="ccccc" />
        <path
           sodipodi:nodetypes="ccccc"
           inkscape:connector-curvature="0"
           id="path5187-5"
           d="m 350.40497,-12.344982 3.46284,15.2336954 h 5.04724 l 0.20243,-13.1165914 z"
           style="fill:#ec2259;fill-rule:evenodd;stroke-width:0.42167649" />
        <path
           style="opacity:0.2;fill:#190e0e;fill-opacity:1;fill-rule:evenodd;stroke:none;stroke-width:0.13240582px;stroke-linecap:butt;stroke-linejoin:miter;stroke-opacity:1;filter:url(#filter5390)"
           d="m 351.54523,-7.0353029 1.99352,9.7340324 h 5.27153 V -11.28078 Z"
           id="path5272"
           inkscape:connector-curvature="0"
           sodipodi:nodetypes="ccccc" />
        <path
           sodipodi:nodetypes="ccccc"
           inkscape:connector-curvature="0"
           id="path5189-9"
           d="m 351.87429,-6.8453197 1.99352,9.7340324 h 5.27153 V -11.090796 Z"
           style="fill:#dcdcdc;fill-opacity:1;fill-rule:evenodd;stroke:none;stroke-width:0.13240582px;stroke-linecap:butt;stroke-linejoin:miter;stroke-opacity:1" />
        <path
           transform="matrix(1.1285949,-0.03323005,0.03111709,1.1246812,-45.483587,11.266502)"
           style="opacity:0.25;fill:#0e0004;fill-opacity:1;fill-rule:evenodd;stroke-width:0.31520098;filter:url(#filter5514)"
           d="m 358.37533,-1.966384 -4.03254,4.1154995 4.3535,-0.00742 z"
           id="path5484"
           inkscape:connector-curvature="0"
           sodipodi:nodetypes="cccc" />
        <path
           sodipodi:nodetypes="ccccc"
           inkscape:connector-curvature="0"
           id="path5191-9"
           d="m 366.38331,-9.3147623 -12.5155,12.203475 5.25905,-0.00896 8.97267,-10.8224123 z"
           style="fill:#ec2259;fill-rule:evenodd;stroke-width:0.38076371" />
        <path
           style="opacity:0.128;fill:#000000;fill-opacity:1;fill-rule:evenodd;stroke:none;stroke-width:0.26458335px;stroke-linecap:butt;stroke-linejoin:miter;stroke-opacity:1;filter:url(#filter5528)"
           d="m 366.25355,-9.2799929 0.69377,14.5114187 0.0838,-0.3328635 0.91265,-12.8381317 z"
           id="path5518"
           inkscape:connector-curvature="0"
           sodipodi:nodetypes="ccccc" />
        <path
           sodipodi:nodetypes="ccccc"
           inkscape:connector-curvature="0"
           id="path5193-1"
           d="m 366.38331,-9.3147623 0.69377,14.5114187 0.0838,-0.3328635 0.91265,-12.8381317 z"
           style="fill:#eeeeee;fill-opacity:1;fill-rule:evenodd;stroke:none;stroke-width:0.26458335px;stroke-linecap:butt;stroke-linejoin:miter;stroke-opacity:1" />
      </g>
    </g>
  </g>
  <rect
     style="opacity:.1;color-rendering:auto;color:#000000;isolation:auto;mix-blend-mode:normal;paint-order:markers fill stroke;shape-rendering:auto;solid-color:#000000;image-rendering:auto;fill:#e5e5e5"
     height="74.64"
     width="509.1"
     y="65.7"
     x=".5474"
     id="rect11" />
</svg>
