<?xml version="1.0" encoding="UTF-8" standalone="no"?>
<svg
   height="630"
   width="1200"
   version="1.1"
   viewBox="0 0 317.5 166.6875"
   id="svg115"
   sodipodi:docname="banner-fosa-04-banner1200x630.svg"
   inkscape:version="1.3.2 (1:1.3.2+202311252150+091e20ef0f)"
   inkscape:export-filename="banner-fosa-04-banner-1200x630.png"
   inkscape:export-xdpi="96"
   inkscape:export-ydpi="96"
   xml:space="preserve"
   xmlns:inkscape="http://www.inkscape.org/namespaces/inkscape"
   xmlns:sodipodi="http://sodipodi.sourceforge.net/DTD/sodipodi-0.dtd"
   xmlns:xlink="http://www.w3.org/1999/xlink"
   xmlns="http://www.w3.org/2000/svg"
   xmlns:svg="http://www.w3.org/2000/svg"
   xmlns:rdf="http://www.w3.org/1999/02/22-rdf-syntax-ns#"
   xmlns:cc="http://creativecommons.org/ns#"
   xmlns:dc="http://purl.org/dc/elements/1.1/"><metadata
     id="metadata119"><rdf:RDF><cc:Work
         rdf:about=""><dc:format>image/svg+xml</dc:format><dc:type
           rdf:resource="http://purl.org/dc/dcmitype/StillImage" /></cc:Work></rdf:RDF></metadata><sodipodi:namedview
     pagecolor="#ffffff"
     bordercolor="#666666"
     borderopacity="1"
     objecttolerance="10"
     gridtolerance="10"
     guidetolerance="10"
     inkscape:pageopacity="0"
     inkscape:pageshadow="2"
     inkscape:window-width="1854"
     inkscape:window-height="1053"
     id="namedview117"
     showgrid="false"
     inkscape:zoom="0.25729861"
     inkscape:cx="1385.5497"
     inkscape:cy="400.31308"
     inkscape:window-x="66"
     inkscape:window-y="27"
     inkscape:window-maximized="1"
     inkscape:current-layer="svg115"
     inkscape:document-rotation="0"
     inkscape:pagecheckerboard="0"
     inkscape:showpageshadow="2"
     inkscape:deskcolor="#d1d1d1"
     showguides="true"><sodipodi:guide
       position="0,166.6875"
       orientation="0,1200"
       id="guide4"
       inkscape:locked="false" /><sodipodi:guide
       position="317.5,166.6875"
       orientation="630,0"
       id="guide5"
       inkscape:locked="false" /><sodipodi:guide
       position="317.5,0"
       orientation="0,-1200"
       id="guide6"
       inkscape:locked="false" /><sodipodi:guide
       position="0,0"
       orientation="-630,0"
       id="guide7"
       inkscape:locked="false" /></sodipodi:namedview><defs
     id="defs5"><linearGradient
       inkscape:collect="always"
       id="linearGradient5008"><stop
         style="stop-color:#ab0374;stop-opacity:1;"
         offset="0"
         id="stop5004" /><stop
         style="stop-color:#0a8bcf;stop-opacity:1;"
         offset="1"
         id="stop5006" /></linearGradient><filter
       id="a"
       style="color-interpolation-filters:sRGB"
       height="1.168"
       width="1.194"
       y="-0.083949998"
       x="-0.096989997"><feGaussianBlur
         stdDeviation="12.947969"
         id="feGaussianBlur2" /></filter><linearGradient
       inkscape:collect="always"
       xlink:href="#linearGradient5008"
       id="linearGradient5010"
       x1="313.84827"
       y1="234.65866"
       x2="169.66451"
       y2="1.877334"
       gradientUnits="userSpaceOnUse"
       gradientTransform="translate(-148.1667,-139.17082)" /></defs><g
     id="g4"
     transform="matrix(1.2036459,0,0,1.2036459,-4.2348052,-0.05746032)"><rect
       style="color:#000000;opacity:1;isolation:auto;mix-blend-mode:normal;solid-color:#000000;fill:#ffffff;fill-opacity:1;paint-order:markers fill stroke;color-rendering:auto;image-rendering:auto;shape-rendering:auto"
       height="139.60001"
       width="509.09988"
       y="-0.21458541"
       x="-148.71669"
       id="rect1180" /><rect
       style="color:#000000;opacity:1;isolation:auto;mix-blend-mode:normal;solid-color:#000000;fill:url(#linearGradient5010);fill-opacity:1;paint-order:markers fill stroke;color-rendering:auto;image-rendering:auto;shape-rendering:auto"
       height="139.60001"
       width="509.09988"
       y="-139.38542"
       x="-148.71669"
       id="rect9"
       inkscape:export-filename="/home/cibersheep/Ubuntu-Touch-Projects/Design/Banners/rect9.png"
       inkscape:export-xdpi="200.03041"
       inkscape:export-ydpi="200.03041"
       transform="scale(1,-1)" /><path
       style="opacity:0.05;fill:#000000;fill-opacity:1;fill-rule:evenodd;stroke:none;stroke-width:0.264583px;stroke-linecap:butt;stroke-linejoin:miter;stroke-opacity:1"
       d="M -253.42966,-19.359677 208.52173,-126.83382 107.00015,160.87422 Z"
       id="path5014"
       inkscape:connector-curvature="0"
       sodipodi:nodetypes="cccc" /><path
       style="color:#000000;opacity:0.15;isolation:auto;mix-blend-mode:normal;solid-color:#000000;fill:#e5e5e5;stroke-width:1.99845;paint-order:markers fill stroke;color-rendering:auto;image-rendering:auto;shape-rendering:auto"
       d="M 604.75038,113.26564 269.97225,173.63644 515.82306,-37.024152 Z"
       id="rect11"
       inkscape:connector-curvature="0"
       sodipodi:nodetypes="cccc" /><path
       style="color:#000000;opacity:0.15;isolation:auto;mix-blend-mode:normal;solid-color:#000000;fill:#e5e5e5;stroke-width:1.99845;paint-order:markers fill stroke;color-rendering:auto;image-rendering:auto;shape-rendering:auto"
       d="M -274.60899,154.97763 96.037633,186.1545 -140.05269,-35.389779 Z"
       id="path1254"
       inkscape:connector-curvature="0"
       sodipodi:nodetypes="cccc" /><g
       id="g20"
       transform="matrix(-0.69227577,0,0,0.69227577,206.56636,-42.38426)"><path
         style="font-variation-settings:normal;opacity:1;vector-effect:none;fill:none;fill-opacity:1;stroke:#ffffff;stroke-width:0.887305;stroke-linecap:butt;stroke-linejoin:miter;stroke-miterlimit:4;stroke-dasharray:none;stroke-dashoffset:0;stroke-opacity:1;-inkscape-stroke:none;stop-color:#000000;stop-opacity:1"
         d="M 103.77288,202.38622 123.61731,166.56195 121.48877,142.83697 48.320155,103.5909 -68.418228,146.56252 37.623347,136.0301 93.291808,174.34792 Z"
         id="path1-6"
         sodipodi:nodetypes="cccccccc" /><path
         style="font-variation-settings:normal;opacity:1;vector-effect:none;fill:none;fill-opacity:1;stroke:#ffffff;stroke-width:0.887305;stroke-linecap:butt;stroke-linejoin:miter;stroke-miterlimit:4;stroke-dasharray:none;stroke-dashoffset:0;stroke-opacity:1;-inkscape-stroke:none;stop-color:#000000;stop-opacity:1"
         d="m 103.65086,201.52029 0.62592,-40.19035 -62.211507,-38.98679 -109.37245,23.90751"
         id="path2-8"
         sodipodi:nodetypes="cccc" /><path
         style="font-variation-settings:normal;opacity:1;vector-effect:none;fill:none;fill-opacity:1;stroke:#ffffff;stroke-width:0.887305;stroke-linecap:butt;stroke-linejoin:miter;stroke-miterlimit:4;stroke-dasharray:none;stroke-dashoffset:0;stroke-opacity:1;-inkscape-stroke:none;stop-color:#000000;stop-opacity:1"
         d="M 37.683645,136.26887 48.162829,103.56483"
         id="path3-8"
         sodipodi:nodetypes="cc" /><path
         style="font-variation-settings:normal;opacity:1;vector-effect:none;fill:none;fill-opacity:1;stroke:#ffffff;stroke-width:0.887305;stroke-linecap:butt;stroke-linejoin:miter;stroke-miterlimit:4;stroke-dasharray:none;stroke-dashoffset:0;stroke-opacity:1;-inkscape-stroke:none;stop-color:#000000;stop-opacity:1"
         d="M 92.635029,174.31296 121.24211,143.09252"
         id="path5-4" /><path
         style="font-variation-settings:normal;opacity:1;vector-effect:none;fill:none;fill-opacity:1;stroke:#ffffff;stroke-width:0.887305;stroke-linecap:butt;stroke-linejoin:miter;stroke-miterlimit:4;stroke-dasharray:none;stroke-dashoffset:0;stroke-opacity:1;-inkscape-stroke:none;stop-color:#000000;stop-opacity:1"
         d="m 122.41274,154.238 1.53418,-1.50773 20.23878,19.51196 -30.99805,33.47928 -23.564651,-7.5389 7.505713,-13.28198"
         id="path6-3"
         sodipodi:nodetypes="cccccc" /><path
         style="font-variation-settings:normal;opacity:1;vector-effect:none;fill:none;fill-opacity:1;stroke:#ffffff;stroke-width:0.887305;stroke-linecap:butt;stroke-linejoin:miter;stroke-miterlimit:4;stroke-dasharray:none;stroke-dashoffset:0;stroke-opacity:1;-inkscape-stroke:none;stop-color:#000000;stop-opacity:1"
         d="m 122.30644,151.86599 4.12534,-1.06411 6.3223,4.61252"
         id="path7-1"
         sodipodi:nodetypes="ccc" /><path
         style="font-variation-settings:normal;opacity:1;vector-effect:none;fill:none;fill-opacity:1;stroke:#ffffff;stroke-width:0.887305;stroke-linecap:butt;stroke-linejoin:miter;stroke-miterlimit:4;stroke-dasharray:none;stroke-dashoffset:0;stroke-opacity:1;-inkscape-stroke:none;stop-color:#000000;stop-opacity:1"
         d="m 126.32257,150.95401 1.87771,5.59546"
         id="path8-4" /><path
         style="font-variation-settings:normal;opacity:1;vector-effect:none;fill:none;fill-opacity:1;stroke:#ffffff;stroke-width:0.887305;stroke-linecap:butt;stroke-linejoin:miter;stroke-miterlimit:4;stroke-dasharray:none;stroke-dashoffset:0;stroke-opacity:1;-inkscape-stroke:none;stop-color:#000000;stop-opacity:1"
         d="m 128.96346,157.36542 23.34859,-12.76941 -7.99525,27.77706"
         id="path9-9" /><path
         style="font-variation-settings:normal;opacity:1;vector-effect:none;fill:none;fill-opacity:1;stroke:#ffffff;stroke-width:0.887305;stroke-linecap:butt;stroke-linejoin:miter;stroke-miterlimit:4;stroke-dasharray:none;stroke-dashoffset:0;stroke-opacity:1;-inkscape-stroke:none;stop-color:#000000;stop-opacity:1"
         d="m 152.28035,165.6996 2.25038,11.79758 23.44175,19.3815 z"
         id="path10-2" /><path
         style="font-variation-settings:normal;opacity:1;vector-effect:none;fill:none;fill-opacity:1;stroke:#ffffff;stroke-width:0.887305;stroke-linecap:butt;stroke-linejoin:miter;stroke-miterlimit:4;stroke-dasharray:none;stroke-dashoffset:0;stroke-opacity:1;-inkscape-stroke:none;stop-color:#000000;stop-opacity:1"
         d="m 177.40882,195.9742 -7.50094,-21.0225"
         id="path11-0"
         sodipodi:nodetypes="cc" /><path
         style="font-variation-settings:normal;opacity:1;vector-effect:none;fill:none;fill-opacity:1;stroke:#ffffff;stroke-width:0.887305;stroke-linecap:butt;stroke-linejoin:miter;stroke-miterlimit:4;stroke-dasharray:none;stroke-dashoffset:0;stroke-opacity:1;-inkscape-stroke:none;stop-color:#000000;stop-opacity:1"
         d="m 166.23562,182.6097 8.45923,-19.09434 -12.32555,-19.52248 -8.01358,3.28965"
         id="path12-6"
         sodipodi:nodetypes="cccc" /><path
         style="font-variation-settings:normal;opacity:1;vector-effect:none;fill:none;fill-opacity:1;stroke:#ffffff;stroke-width:0.887305;stroke-linecap:butt;stroke-linejoin:miter;stroke-miterlimit:4;stroke-dasharray:none;stroke-dashoffset:0;stroke-opacity:1;-inkscape-stroke:none;stop-color:#000000;stop-opacity:1"
         d="m 152.28368,144.5578 11.76649,17.92425 0.92769,18.7949"
         id="path13"
         sodipodi:nodetypes="ccc" /><path
         style="font-variation-settings:normal;opacity:1;vector-effect:none;fill:none;fill-opacity:1;stroke:#ffffff;stroke-width:0.887305;stroke-linecap:butt;stroke-linejoin:miter;stroke-miterlimit:4;stroke-dasharray:none;stroke-dashoffset:0;stroke-opacity:1;-inkscape-stroke:none;stop-color:#000000;stop-opacity:1"
         d="m 152.24378,165.80478 11.71644,-2.87631"
         id="path14" /><path
         style="font-variation-settings:normal;opacity:1;vector-effect:none;fill:none;fill-opacity:1;stroke:#ffffff;stroke-width:0.887305;stroke-linecap:butt;stroke-linejoin:miter;stroke-miterlimit:4;stroke-dasharray:none;stroke-dashoffset:0;stroke-opacity:1;-inkscape-stroke:none;stop-color:#000000;stop-opacity:1"
         d="m 113.90957,205.08222 40.17436,-29.34624"
         id="path15" /><path
         style="font-variation-settings:normal;opacity:1;vector-effect:none;fill:none;fill-opacity:1;stroke:#ffffff;stroke-width:0.887305;stroke-linecap:butt;stroke-linejoin:miter;stroke-miterlimit:4;stroke-dasharray:none;stroke-dashoffset:0;stroke-opacity:1;-inkscape-stroke:none;stop-color:#000000;stop-opacity:1"
         d="m 131.47251,154.26423 0.0965,-13.77083"
         id="path17"
         sodipodi:nodetypes="cc" /><path
         style="font-variation-settings:normal;opacity:1;vector-effect:none;fill:none;fill-opacity:1;stroke:#ffffff;stroke-width:0.887305;stroke-linecap:butt;stroke-linejoin:miter;stroke-miterlimit:4;stroke-dasharray:none;stroke-dashoffset:0;stroke-opacity:1;-inkscape-stroke:none;stop-color:#000000;stop-opacity:1"
         d="m 122.21727,150.3204 9.40719,-10.16915 59.61348,-25.29054 -26.55613,23.88769 -12.64853,6.03852"
         id="path18"
         sodipodi:nodetypes="ccccc" /><path
         style="font-variation-settings:normal;opacity:1;vector-effect:none;fill:none;fill-opacity:1;stroke:#ffffff;stroke-width:0.887305;stroke-linecap:butt;stroke-linejoin:miter;stroke-miterlimit:4;stroke-dasharray:none;stroke-dashoffset:0;stroke-opacity:1;-inkscape-stroke:none;stop-color:#000000;stop-opacity:1"
         d="m 165.07741,138.61972 102.63904,3.68937 -76.82591,-27.33533"
         id="path19"
         sodipodi:nodetypes="ccc" /><path
         style="font-variation-settings:normal;opacity:1;vector-effect:none;fill:none;fill-opacity:1;stroke:#ffffff;stroke-width:0.887305;stroke-linecap:butt;stroke-linejoin:miter;stroke-miterlimit:4;stroke-dasharray:none;stroke-dashoffset:0;stroke-opacity:1;-inkscape-stroke:none;stop-color:#000000;stop-opacity:1"
         d="m 179.15574,126.01803 86.32455,15.73926"
         id="path20"
         sodipodi:nodetypes="cc" /></g></g></svg>
