[
  {
    "group": "UBports",
    "links": [
      {
        "label": "The foundation",
        "attrs": {
          "href": "https://ubports.com/governance",
          "target": "_blank"
        }
      },
      {
        "label": "Manifesto",
        "attrs": {
          "href": "https://ubports.com/manifesto",
          "target": "_blank"
        }
      },
      {
        "label": "Donate",
        "attrs": {
          "href": "https://ubports.com/donate",
          "target": "_blank"
        }
      },
      {
        "label": "Sponsors",
        "attrs": {
          "href": "https://ubports.com/sponsorship",
          "target": "_blank"
        }
      }
    ]
  },
  {
    "group": "Community",
    "links": [
      {
        "label": "Documentation",
        "attrs": { "href": "https://docs.ubports.com/", "target": "_blank" }
      },
      {
        "label": "Blog and Q&A",
        "attrs": { "href": "https://ubports.com/blog", "target": "_blank" }
      },
      {
        "label": "Forum",
        "attrs": { "href": "https://forums.ubports.com", "target": "_blank" }
      },
      {
        "label": "Get involved",
        "attrs": { "href": "https://ubports.com/get-involved", "target": "_blank" }
      }
    ]
  },
  {
    "group": "Channels",
    "links": [
      {
        "label": "Announcement",
        "attrs": { "href": "https://t.me/ubports_news/", "target": "_blank" }
      },
      {
        "label": "Main",
        "attrs": { "href": "https://t.me/ubports", "target": "_blank" }
      },
      {
        "label": "Installation",
        "attrs": { "href": "https://t.me/WelcomePlus/", "target": "_blank" }
      },
      {
        "label": "Porting",
        "attrs": { "href": "https://t.me/ubports_porting", "target": "_blank" }
      },
      {
        "label": "FAQ",
        "attrs": { "href": "https://t.me/UTFAQ/", "target": "_blank" }
      }
    ]
  }
]
