1407486	3426609		Punta Peligrosa						
4334756	3426609		Dangerous Point						
1407487	3426610		Roca Young						
4334757	3426610		Young Rock						
1407488	3426611		Punta Yorke						
4334759	3426611		Yorke Point						
1407489	3426612		Bahía Yorke						
4334760	3426612		Yorke Bay						
8681103	3426612	link	https://en.wikipedia.org/wiki/Yorke_Bay						
1407490	3426613	es	Roca Wolf						
4334765	3426613		Wolf Rock						
1407491	3426614		Isla Wolf						
4334766	3426614		Wolfe Island						
15574385	3426614	wkdt	Q24570884						
15558304	3426615	wkdt	Q24570883						
1407492	3426616		Baye Choisel						
1407493	3426616		Puerto William						
1407494	3426616		Port Firm						
4334767	3426616		Port William						
13189052	3426616	link	https://en.wikipedia.org/wiki/Port_William%2C_Falkland_Islands						
1407495	3426618		Alturas Wickham						
4334768	3426618		Wickham Heights						
7158706	3426618	link	https://en.wikipedia.org/wiki/Wickham_Heights						
1407496	3426619		Cerro Wickham						
4334769	3426619		Mount Wickham						
5903393	3426619	link	https://en.wikipedia.org/wiki/Mount_Wickham						
1407497	3426620		Punta Roca Blanca						
4334770	3426620		White Rock Point						
1407498	3426621		Bahía White Rock						
1407499	3426621		Bahía Roca Blanca						
4334771	3426621		White Rock Bay						
1407500	3426624		Punta Blanca						
4334773	3426624		White Point						
1407501	3426625		Punta White						
4334774	3426625		White Point						
15558610	3426626	wkdt	Q24570876						
15969659	3426626		White Island						
1407502	3426630		Puerto Wharton						
4334775	3426630		Wharton Harbour						
1407503	3426632		Whalebone Bay						
4334779	3426632		Whalebone Cove						
1407504	3426633		Isla West Swan						
4334780	3426633		West Swan Island						
1407505	3426634		Punta West						
1407506	3426634		Punta Oeste						
4334783	3426634		West Point						
1407507	3426636		Isla Oeste						
1407508	3426636		Islote West						
1407509	3426636		West Islet						
4334785	3426636		West Island						
15466195	3426636	wkdt	Q24570867						
1407510	3426637		Cerro Oeste						
4334787	3426637		West Hill						
1407511	3426638		Isla Malvina del Oeste						
1407512	3426638		Gran Malvina						
1407513	3426638		West Falkland Island						
1407514	3426638		Malvina del Oeste						
2984783	3426638	link	https://en.wikipedia.org/wiki/West_Falkland						
4334789	3426638		West Falkland						
16629356	3426638	ru	Западный Фолкленд						
1407515	3426639		Caleta Oeste						
1407516	3426639		Caleta West						
4334790	3426639		West Cove						
1407517	3426641		Islote Wedge						
4334795	3426641		Wedge Islet						
15310845	3426641	wkdt	Q24570865						
1407518	3426642		Watts Cove						
4334798	3426642		Watt Cove						
1407519	3426643		Río Warrah						
1407520	3426643		Warrah River						
4334799	3426643		River Warrah						
6891253	3426643	link	https://en.wikipedia.org/wiki/Warrah_River						
16949407	3426643		Warrah						
8672986	3426645	link	https://en.wikipedia.org/wiki/Walker_Creek%2C_Falkland_Islands						
8802933	3426645		Walker Creek						
15422538	3426645	wkdt	Q7962247						
1407521	3426646		Ensenada Walker						
4334800	3426646		Walker Creek						
1407522	3426647	es	Punta de la Barra						
1407523	3426647	es	Punta Volunteer						
4334801	3426647		Volunteer Point						
7491044	3426647	link	https://en.wikipedia.org/wiki/Volunteer_Point						
1407524	3426649		The Dodge Viper						
4334802	3426649		The Viper						
1407525	3426650		Puerto Victoria						
4334803	3426650		Victoria Harbour						
1407526	3426651		Cerro Vernet						
4334804	3426651		Mount Vernet						
15543826	3426651	wkdt	Q24570861						
1407527	3426652		Cerro Osborne						
4334805	3426652		Mount Usborne						
5713592	3426652	link	https://en.wikipedia.org/wiki/Mount_Usborne						
1407528	3426653		Roca Uranie						
4334806	3426653		Uranie Rock						
1407529	3426654		Bahía Uranie						
4334807	3426654		Uranie Bay						
7033649	3426654	link	https://en.wikipedia.org/wiki/Uranie_Bay						
1407530	3426655		Manchón Tyssen						
4334808	3426655		Tyssen Patch						
1407531	3426656		Islas Tyssen						
4334809	3426656		Tyssen Islands						
7510403	3426656	link	https://en.wikipedia.org/wiki/Tyssen_Islands						
1407532	3426657		Cerro de la Silla						
1407533	3426657		Saddle Hill						
1407534	3426657		The Two Sisters						
4334810	3426657		Two Sisters						
1407535	3426661		Dettleff’s Point						
1407536	3426661		Old Man Point						
1407537	3426661		Punta Tussac						
4334811	3426661		Tussac Point						
1407538	3426662		William Islets						
1407539	3426662		Port William Islands						
1407540	3426662		Islas Tussac						
4334813	3426662		Tussac Islands						
13755307	3426662	unlc	FKPWI						
15572453	3426663	wkdt	Q24570852						
15969661	3426663		Tussac Island						
1407541	3426664		Isla Tussac						
4334814	3426664		Tussac Island						
15860001	3426664	wkdt	Q24570851						
15556465	3426665	wkdt	Q24570850						
15969662	3426665		Tussac Island						
1407542	3426666		Punta Turn						
4334815	3426666		Turn Point						
1407543	3426667		Islote Turn						
4334816	3426667		Turn Islet						
15447202	3426667	wkdt	Q24570848						
1407544	3426669		The Tumbledown						
4334817	3426669		Tumbledown Mountain						
1407545	3426670		Islas Triste						
4334818	3426670		Triste Islands						
15260592	3426670	wkdt	Q24570845						
1407546	3426673		Roca Tide						
4334820	3426673		Tide Rock						
1407547	3426674		Evelyn Station						
1407548	3426674		Teal Inlet						
2984784	3426674	link	https://en.wikipedia.org/wiki/Teal_Inlet						
4334825	3426674		Teal Inlet Settlement						
1407549	3426675		Caleta Teal						
4334826	3426675		Teal Inlet						
1407550	3426676		Arroyo Teal						
4334827	3426676		Teal Creek						
1407551	3426677		Paso Tamar						
4334830	3426677		Tamar Pass						
1407552	3426678		Puerto Tamar						
4334831	3426678		Tamar Harbour						
1407553	3426679		Cabo Tamar						
4334832	3426679		Cape Tamar						
1407554	3426681		Pasaje Swan						
4334835	3426681		Swan Passage						
1407555	3426682		Isla Swan						
4334836	3426682		Swan Island						
1407556	3426683		Paso Swan						
4334837	3426683		Swan Inlet						
1407557	3426684		Puerto Sussex						
4334838	3426684		Port Sussex						
1407558	3426686		Roca Sunk						
4334839	3426686		Sunk Rock						
1407559	3426687		Puerto Sulivan						
4334840	3426687		Sulivan Harbour						
1407560	3426690		Beau Port						
1407561	3426690	es	Puerto Stanley						
1407562	3426690		Jackson Harbour						
4334849	3426690		Stanley Harbour						
1407563	3426691		Port Stanley						
1407564	3426691		Stanley Harbour						
1596422	3426691	de	Port Stanley						
1596423	3426691	en	Stanley	1					
1596424	3426691	es	Puerto Argentino						
1596425	3426691	fi	Port Stanley						
1596426	3426691	fr	Port Stanley						
1596427	3426691	he	סטנלי						
1596428	3426691	io	Port Stanley						
1596429	3426691	it	Port Stanley						
1596430	3426691	nl	Port Stanley						
1596431	3426691	nl	Stanley						
1596432	3426691	pl	Stanley						
1596433	3426691	pt	Port Stanley						
1596434	3426691	sv	Port Stanley						
1639742	3426691	bg	Порт Стенли						
1639743	3426691	sk	Port Stanley						
1649497	3426691	da	Stanley						
1649597	3426691	el	Stanley						
1904255	3426691	ja	スタンレー						
1904256	3426691	lt	Puerto Archentinas/Stenlis						
1904257	3426691	sk	Stanley						
1991960	3426691	ja	スタンリー						
1991961	3426691	lt	Stenlis						
2920799	3426691	link	https://en.wikipedia.org/wiki/Stanley%2C_Falkland_Islands						
4334850	3426691		Stanley						
8291886	3426691	lv	Stenli						
8291887	3426691	uk	Порт-Стенлі						
8291888	3426691	ur	اسٹینلے، جزائر فاکلینڈ						
8291889	3426691	os	Порт-Стэнли						
8291890	3426691	mr	पोर्ट स्टॅन्ली						
8291891	3426691	hy	Պորտ Սթենլի						
8291892	3426691	el	Στάνλεϋ						
8291893	3426691	ko	스탠리						
8291894	3426691	eo	Stanlejo						
8291895	3426691	th	สแตนลีย์						
8291896	3426691	be	Стэнлі						
8291897	3426691	az	Stenli						
8291898	3426691	ar	ستانلي						
8291899	3426691	ru	Порт-Стэнли						
8291900	3426691	zh	斯坦利						
8705971	3426691	sgs	Port Stenlis						
8705972	3426691	fa	استنلی، جزایر فالکلند						
8705973	3426691	ml	സ്റ്റാൻലി						
9061307	3426691	es	Port Stanley	1					
9709684	3426691	en	Port Stanley						
11328773	3426691	gl	Porto Arxentino/Stanley						
11328774	3426691	kbd	Стенли						
11328775	3426691	kk	Порт-Стэнли						
11328776	3426691	pnb	سٹینلے						
11328777	3426691	sr	Стенли						
11328778	3426691	ta	இசுடான்லி						
11328779	3426691	yi	סטאנלי						
11328780	3426691	yue	斯坦利港						
12186829	3426691	iata	PSY						
13755306	3426691	unlc	FKPSY						
15792626	3426691	wkdt	Q12245						
1407565	3426692		Rada Stag						
4334851	3426692		Stag Road						
1407566	3426693		Punta Squib						
4334854	3426693		Squib Point						
1407567	3426694		Isla Águila						
1407568	3426694		Isla Speedwell						
2984785	3426694	link	https://en.wikipedia.org/wiki/Speedwell_Island						
4334858	3426694		Speedwell Island						
1407569	3426695		Punta Sparrow						
4334859	3426695		Sparrow Point						
1407570	3426696		Caleta Sparrow						
4334860	3426696		Sparrow Cove						
1407571	3426697		Caleta Snug						
4334866	3426697		Snug Cove						
1407572	3426699		Las Seis Colinas						
4334870	3426699		The Six Hills						
14847890	3426699	wkdt	Q24570829						
1407573	3426700		Islas Sisters						
4334871	3426700		Sisters						
1407574	3426701		Monte Simón						
1407575	3426701		Mount Saint Simon						
4334872	3426701		Mount Simon						
5902802	3426701	link	https://en.wikipedia.org/wiki/Mount_Simon						
15216487	3426701	wkdt	Q6923654						
1407576	3426705		Isla Shell						
4334874	3426705		Shell Island						
15286533	3426705	wkdt	Q24570824						
1407577	3426708		Caleta Shallow						
4334876	3426708		Shallow Cove						
1407578	3426709		Bahía Shallow						
4334878	3426709		Shallow Bay						
1407579	3426711		Roca Shag						
4334879	3426711		Shag Rock						
15486364	3426711	wkdt	Q24570819						
1407580	3426712		Islote Shag						
1407581	3426712		Shag Islet						
4334880	3426712		Little Shag Island						
15265523	3426712	wkdt	Q24570818						
1407582	3426713		Puerto Shag						
4334881	3426713		Shag Harbour						
15203044	3426714	wkdt	Q24570816						
15969663	3426714		Settlement Rocks						
1407583	3426718	es	Rocas Seal						
4334887	3426718		Seal Rocks						
1407584	3426720		Punta Seal						
4334888	3426720		Seal Point						
1407585	3426721		Isla Seal						
4334889	3426721		Seal Island						
15360283	3426721	wkdt	Q24570810						
1407586	3426722		Isla Seal						
4334890	3426722		Seal Island						
15446262	3426722	wkdt	Q24570809						
1407587	3426723		Rocas Sea Lion						
4334891	3426723		Sea Lion Rocks						
1407588	3426724		Punta Sea Lion						
4334892	3426724		Sea Lion Point						
1407589	3426725		Islas de Leones Marinos						
1407590	3426725		Islas Sea Lion						
1407591	3426725		Islas de los Leones Marinos						
4334893	3426725		Sea Lion Islands						
1407592	3426726		Isla León Marino						
1407593	3426726		Isla Sea Lion						
4334894	3426726		Sea Lion Island						
15863520	3426726	wkdt	Q16579911						
1407594	3426727		Caleta Seal						
4334896	3426727		Seal Cove						
1407595	3426728		Isla Scott						
4334898	3426728		Scott Island						
15429095	3426728	wkdt	Q24570804						
7161420	3426730	link	https://en.wikipedia.org/wiki/Sapper_Hill						
7323802	3426730		Sapper Hill						
1407596	3426731		Salvador Settlement Corral						
1407597	3426731		Salvador						
4334900	3426731		Salvador Settlement						
7073491	3426731	link	https://en.wikipedia.org/wiki/Salvador_Settlement						
15415515	3426731	wkdt	Q7406458						
15688156	3426732	wkdt	Q24570802						
15969666	3426732		Sandy Island						
1407598	3426734		Isla Sandy Bay						
4334901	3426734		Sandy Bay Island						
15816625	3426734	wkdt	Q16493443						
1407599	3426736		Cantera de Arena						
4334902	3426736		Sand Fountain						
1407600	3426738		Isla Sandbar						
4334903	3426738		Sandbar Island						
15749976	3426738	wkdt	Q24570799						
7123640	3426739	link	https://en.wikipedia.org/wiki/San_Carlos_Water						
7323803	3426739		San Carlos Water						
1407601	3426740		Río San Carlos						
4334904	3426740		San Carlos River						
7508451	3426740	link	https://en.wikipedia.org/wiki/San_Carlos_River_%28Falkland_Islands%29						
16949409	3426740		San Carlos						
1407602	3426741		San Carlos						
1407603	3426741		San Carlos Estate						
4334905	3426741		San Carlos Settlement						
8672187	3426741	link	https://en.wikipedia.org/wiki/San_Carlos%2C_Falkland_Islands						
1407604	3426742		Puerto San Carlos						
2984786	3426742	link	https://en.wikipedia.org/wiki/Port_San_Carlos						
4334906	3426742		Port San Carlos						
1407605	3426743		Islas Samuel						
4334907	3426743		Samuel Islands						
15743226	3426743	wkdt	Q16580120						
1407606	3426744		Cerro Salvador						
4334908	3426744		Salvador Hill						
15249634	3426744	wkdt	Q24570796						
1407607	3426745		Bahía del Aceite						
1407608	3426745		Bahía del Oeste						
1407609	3426745		Baye Marville						
1407610	3426745		Puerto Salvador						
1407611	3426745		Pembroke Bay						
1407612	3426745		Port San Salvador						
1407613	3426745		Salvador Waters						
4334909	3426745		Port Salvador						
1407614	3426746		Laguna de la Sal						
4334910	3426746		Salt Lagoon						
1407615	3426747		Punta Sal						
4334911	3426747		Sal Point						
1407616	3426748		Rincon de Zaino						
1407617	3426748		Rincon del Saino						
4334912	3426748		Rincon de Saino						
1407618	3426750		Isla Ruggles						
4334915	3426750		Ruggles Island						
7521210	3426750	link	https://en.wikipedia.org/wiki/Ruggles_Island						
1407619	3426751		Bahía Ruggles						
4334916	3426751		Ruggles Bay						
15556257	3426752	wkdt	Q24570791						
15969667	3426752		Rugged Hill						
1407620	3426754		Round Mountains						
1407621	3426754		Round Mountain						
4334921	3426754		Mount Round						
15827936	3426756	wkdt	Q24570788						
15969668	3426756		Round Island						
1407622	3426757		Monte Rosalia						
4334923	3426757		Mount Rosalie						
15305784	3426757	wkdt	Q24570787						
15414139	3426758	wkdt	Q24570786						
15969669	3426758		Rookery Valley						
1407623	3426761		Punta Rock						
4334926	3426761		Rock Point						
1407624	3426764		Point Robinson						
4334927	3426764		Robinson Point						
1407625	3426765		Isla de Rio						
4334928	3426765		River Island						
6889819	3426765	link	https://en.wikipedia.org/wiki/River_Island%2C_Falkland_Islands						
1407626	3426767		Puerto River						
4334929	3426767		River Harbour						
1407627	3426768		Rincon Grande						
4334930	3426768		Rincon Grande Settlement						
7530639	3426768	link	https://en.wikipedia.org/wiki/Rincon_Grande						
15338638	3426768	wkdt	Q7334613						
1407628	3426769		Punta Reef						
4334933	3426769		Reef Point						
1407629	3426770		Punta Reef						
4334934	3426770		Reef Point						
1407630	3426771		Isla Reef						
4334935	3426771		Reef Island						
15453890	3426771	wkdt	Q24570779						
14895120	3426773	wkdt	Q24570777						
15969671	3426773		Rat Island						
1407631	3426774		Caleta Rain						
4334937	3426774		Rain Cove						
1407632	3426775		Punta Race						
4334940	3426775		Race Point						
1407633	3426778		Isla Rabbit						
4334941	3426778		Rabbit Island						
15344988	3426778	wkdt	Q24570773						
15573595	3426779	wkdt	Q24570772						
15969672	3426779		Rabbit Island						
1407634	3426781		Caleta Rabbit						
4334943	3426781		Rabbit Cove						
1407635	3426782		Punta Pirámide						
4334948	3426782		Pyramid Point						
1407636	3426783		Caleta Pirámide						
4334949	3426783		Pyramid Cove						
1407637	3426786		Punta Aguda						
4334950	3426786		Prong Point						
1407638	3426788		Port San Carlos						
4334952	3426788		Port San Carlos Settlement						
15538849	3426788	wkdt	Q3321257						
1407639	3426790		Puerto Louis						
1407640	3426790		Port Louis						
4334953	3426790		Port Louis Harbour						
1407641	3426791		Anson						
1407642	3426791		Saint Louis						
1407643	3426791		Soledad						
1407644	3426791		Port Louis						
4334954	3426791		Port Louis Settlement						
4334955	3426792		Port Howard						
1407645	3426793		Punta Porpoise						
4334958	3426793		Porpoise Point						
14848543	3426794	wkdt	Q24570767						
15969674	3426794		Porpoise Island						
1407646	3426797		Punta Poke						
4334959	3426797		Poke Point						
1407647	3426798		Rada Pleasant						
4334960	3426798		Pleasant Road						
1407648	3426799		Punta Pleasant						
4334961	3426799		Pleasant Point						
1407649	3426800		Laguna Pleasant						
4334962	3426800		Pleasant Lagoon						
1407650	3426801		Isla Pleasant						
4334963	3426801		Pleasant Island						
1407651	3426802		Puerto Pleasant						
4334964	3426802		Port Pleasant						
13287354	3426803	en	Mount Pleasant						
13294082	3426803		Mount Pleasant						
13755305	3426803	unlc	FKMPN						
1407652	3426805		Rio Piloto						
4334965	3426805		Pilot River						
16949410	3426805		Pilot						
1407653	3426807		Rincon de Picaso						
1407654	3426807		Rincon del Picasso						
4334966	3426807		Rincon del Picaso						
1407655	3426808		Isla Phillimore						
4334971	3426808		Phillimore Island						
15328862	3426808	wkdt	Q16579964						
1407656	3426809		Phillips Point						
4334972	3426809		Philips Point						
1407657	3426812	es	Cabo San Felipe						
1407658	3426812	es	Cabo Pembroke						
4334976	3426812		Cape Pembroke						
7517093	3426812	link	https://en.wikipedia.org/wiki/Cape_Pembroke						
1407659	3426813		Río Pedro						
4334977	3426813		River Pedro						
16949411	3426813		Pedro						
1407660	3426815		Seno Pebble						
4334978	3426815		Pebble Sound						
1407661	3426816		Pebble Island Farm						
4334979	3426816		Pebble Island Settlement						
7504784	3426816	link	https://en.wikipedia.org/wiki/Pebble_Island_Settlement						
1407662	3426817		Isla de Borbón						
1407663	3426817		Isla Pebble						
1407664	3426817		Isla de Pebble						
2984788	3426817	link	https://en.wikipedia.org/wiki/Pebble_Island						
4334980	3426817		Pebble Island						
1407665	3426819		Islote Peat						
1407666	3426819		Peat Island						
4334981	3426819		Peat Islet						
15420866	3426819	wkdt	Q24570752						
1407667	3426821		Isla Passage						
4334984	3426821		Passage Island						
15605523	3426821	wkdt	Q24570751						
15414751	3426822	wkdt	Q24570750						
15969677	3426822		Paloma Sand Beach						
1407668	3426824		Rada Owen						
4334985	3426824		Owen Roads						
1407669	3426825		Horqueta						
4334986	3426825		Orqueta						
1407670	3426826		Punta Ordnance						
4334989	3426826		Ordnance Point						
1407671	3426828		Caleta Norton						
4334990	3426828		Norton Inlet						
1407672	3426829		Bahia de la Cruzada						
1407673	3426829		Paso North-West						
1407674	3426829		La Cruzada						
4334991	3426829		North West Passage						
1407675	3426830		North West Islets						
4334992	3426830		North West Islands						
1407676	3426831		Brazo Noroeste						
1407677	3426831		Brazo North-West						
4334995	3426831		North West Arm						
1407678	3426832		Isla North Swan						
4334996	3426832		North Swan Island						
15582886	3426832	wkdt	Q16579864						
1407679	3426833		Isla Punta Norte						
1407680	3426833		Isla North Point						
4334997	3426833		North Point Island						
15787038	3426833	wkdt	Q24570743						
1407681	3426834		Punta North						
4334998	3426834		North Point						
1407682	3426835		North Lookout Hill						
4334999	3426835		North Lookout						
1407683	3426836		Isla North						
4335000	3426836		North Island						
15822424	3426836	wkdt	Q24570740						
1407684	3426839		Estero Noreste						
4335005	3426839		North East Creek						
1407685	3426841		Rolon Cove						
1407686	3426841		Dársena North						
1407687	3426841		Hoya Norte						
4335007	3426841		North Basin						
1407688	3426842		North Arm						
4335008	3426842		North Arm Settlement						
7054995	3426842	link	https://en.wikipedia.org/wiki/North_Arm						
15793907	3426842	wkdt	Q7053964						
1407689	3426843		Brazo North						
1407690	3426843		Brazo Norte						
4335009	3426843		North Arm						
1407691	3426846		Puerto Nuevo						
4335014	3426846		New Haven						
8673811	3426846	link	https://en.wikipedia.org/wiki/New_Haven%2C_Falkland_Islands						
1407692	3426847		Punta Navy						
4335016	3426847		Navy Point						
1407693	3426852		Murrel River						
1407694	3426852		Río Murrell						
4335017	3426852		Murrell River						
6890474	3426852	link	https://en.wikipedia.org/wiki/Murrell_River						
16949412	3426852		Murrell						
1407695	3426853		Alturas Murray						
4335018	3426853		Murray Heights						
15164951	3426853	wkdt	Q24570729						
1407696	3426856		Rada Muddy						
4335019	3426856		Muddy Creek						
1407697	3426857		Isla Motley						
4335020	3426857		Motley Island						
15859381	3426857	wkdt	Q16579940						
7137581	3426861	link	https://en.wikipedia.org/wiki/Moody_Brook						
5902477	3426862	link	https://en.wikipedia.org/wiki/Mount_Moody						
6129101	3426862		Mount Moody						
1407698	3426864		Punta Monkey						
4335021	3426864		Monkey Point						
1407699	3426865		Moffitt Creek						
1407700	3426865		Puerto Moffit						
1407701	3426865		Moffit Harbour						
1407702	3426865		Puerto Moffitt						
1407703	3426865		Moffat Harbour						
4335022	3426865		Moffitt Harbour						
1407704	3426866		Bahía Moffit						
4335023	3426866		Moffit Bay						
1407705	3426867		Mintay Roca						
1407706	3426867		Mintay Rock						
4335024	3426867		Mintay						
1407707	3426870		Roca Mid						
4335025	3426870		Mid Rock						
1407708	3426872		Isla Central						
1407709	3426872		Isla Mid						
4335026	3426872		Mid Island						
15626935	3426872	wkdt	Q16579862						
1407710	3426873		Bajofondo Middle						
4335027	3426873		Middle Shoal						
1407711	3426876		Isla Middle						
1407712	3426876		Isla del Medio						
4335028	3426876		Middle Island						
15837640	3426876	wkdt	Q16580091						
1407713	3426877		Isla Middle						
4335030	3426877		Middle Island						
1407714	3426878		Estero Central						
4335031	3426878		Middle Creek						
1407715	3426879		Bahia Middle						
1407716	3426879		Bahía del Medio						
4335032	3426879		Middle Bay						
1407717	3426880		William Point						
1407718	3426880		Punta Celebroña						
1407719	3426880		Memgeary Point						
1407720	3426880		Mengeary Punta						
4335034	3426880		Mengeary Point						
1407721	3426883		Mariqueta						
4335036	3426883		Mariquita						
1407722	3426884		Monte Maria						
4335037	3426884		Mount Maria						
5759608	3426884	link	https://en.wikipedia.org/wiki/Mount_Maria						
1407723	3426887		Puerto Mare						
4335038	3426887		Mare Harbour						
1407724	3426888		Port Surrey						
1407725	3426888		Puerto Many-branch						
1407726	3426888		Hell’s Gates						
4335039	3426888		Many-branch Harbour						
1407727	3426889		Punta Mayor						
4335040	3426889		Main Point						
1407728	3426890		Pasaje Main						
4335041	3426890		Main Passage						
1407729	3426891		Roca Maggie Elliot						
4335042	3426891		Maggie Elliot Rock						
15419357	3426891	wkdt	Q24571576						
1407730	3426893		Caleta Magellan						
1407731	3426893		Caleta Magallanes						
4335043	3426893		Magellan Cove						
1407732	3426895		Morro Macbride						
1407733	3426895		Cabo Macbride						
4335044	3426895		Macbride Head						
7490196	3426895	link	https://en.wikipedia.org/wiki/MacBride_Head						
1407734	3426896		Punta Low						
4335048	3426896		Low Point						
1407735	3426897		Punta Low						
4335049	3426897		Low Point						
1407736	3426899		Lowe Bay						
1407737	3426899		Bahía Low						
1407738	3426899		Bahía Baja						
4335051	3426899		Low Bay						
1407739	3426900	es	Monte Low						
1407740	3426900		Mount Lowe						
1407741	3426900	es	Monte Bajo						
4335052	3426900		Mount Low						
5902145	3426900	link	https://en.wikipedia.org/wiki/Mount_Low						
1407742	3426902		Laguna Lorenzo						
4335053	3426902		Lorenzo Lagoon						
15609819	3426904	wkdt	Q24571569						
15969680	3426904		Long Island Sand Beach						
1407743	3426905		Beagle Ridge						
4335055	3426905		Long Island Ridge						
1407744	3426907		Isle Brûlée						
1407745	3426907		Isla Larga						
1407746	3426907		Hog Island						
1407747	3426907		Isla Long						
1407748	3426907		Isle aux Pinguins						
1407749	3426907		Poulet Island						
4335056	3426907		Long Island						
8679373	3426907	link	https://en.wikipedia.org/wiki/Long_Island%2C_Falkland_Islands						
5901841	3426908	link	https://en.wikipedia.org/wiki/Mount_Longdon						
6129102	3426908		Mount Longdon						
1407750	3426909		Seno Lively						
1407751	3426909		Ensenada de Luisa						
4335057	3426909		Lively Sound						
1407752	3426910		Volunteer Island						
1407753	3426910		Isla Lively						
1407754	3426910	ar	Isla Bougainville						
2984789	3426910	link	https://en.wikipedia.org/wiki/Lively_Island						
4335058	3426910		Lively Island						
1407755	3426912		Isla Chica						
1407756	3426912		Isla Little						
4335059	3426912		Little Island						
15260211	3426912	wkdt	Q24571565						
1407757	3426913		Isla Little Harbour						
4335060	3426913		Little Harbour Island						
15239619	3426913	wkdt	Q24571564						
15450194	3426914	wkdt	Q24571563						
15969681	3426914		Little East Island						
1407758	3426916		Punta León						
1407759	3426916		Punta Lion						
4335061	3426916		Lion Point						
1407760	3426919		Isla Large						
4335062	3426919		Large Island						
1407761	3426920		Punta Lancaster						
4335063	3426920		Lancaster Point						
1407762	3426921		Punta Lamarche						
4335064	3426921		Lamarche Point						
1407763	3426924		Bull Corner						
1407764	3426924		Rincon del Toro						
2984790	3426924	link	https://en.wikipedia.org/wiki/Lafonia						
4335065	3426924		Lafonia						
1407765	3426927		Puerto King						
1407766	3426927		Puerto Rey						
4335069	3426927		Port King						
1407767	3426929		Isla Kidney						
1407768	3426929		Hayes Island						
1407769	3426929		Isla Celebroña						
4335070	3426929		Kidney Island						
6889923	3426929	link	https://en.wikipedia.org/wiki/Kidney_Island						
1407770	3426930		Caleta Kidney						
4335071	3426930		Kidney Cove						
1407771	3426931		Seno Keppel						
4335072	3426931		Keppel Sound						
7514965	3426931	link	https://en.wikipedia.org/wiki/Keppel_Sound						
1407772	3426932		Islote Keppel						
4335073	3426932		Keppel Islet						
15808593	3426932	wkdt	Q24571550						
1407773	3426933		Isla de la Vigia						
1407774	3426933		Isla Keppel						
1407775	3426933		Isla Vigía						
4335074	3426933		Keppel Island						
7139486	3426933	link	https://en.wikipedia.org/wiki/Keppel_Island						
1407776	3426935		Cerro Kent						
1407777	3426935		Monte Kent						
4335075	3426935		Mount Kent						
5759796	3426935	link	https://en.wikipedia.org/wiki/Mount_Kent						
1407778	3426937		Laguna Kelp						
1407779	3426937		Puerto Pacheco						
4335076	3426937		Kelp Lagoon						
1407780	3426938		Islote Kelp						
4335077	3426938		Kelp Islet						
15560262	3426938	wkdt	Q24571546						
1407781	3426939		Islas Kelp						
4335078	3426939		Kelp Islands						
1407782	3426940		Isla Kelp						
4335079	3426940		Kelp Island						
1407783	3426941		Kelp Harbor						
4335080	3426941		Kelp Harbour						
1407784	3426942		Bahía Kelp						
4335081	3426942		Kelp Bay						
1407785	3426943		Rocas Kelly						
4335082	3426943		Kelly Rocks						
1407786	3426945		Johnsons Harbour						
4335083	3426945		Johnson Harbour Settlement						
1407787	3426946		Puerto Johnson						
4335084	3426946		Johnson Harbour						
1407788	3426947		Punta John						
4335085	3426947		John Point						
1407789	3426953		Puerto Island						
4335089	3426953		Island Harbour						
1407790	3426956		Punta Hut						
4335090	3426956		Hut Point						
1407791	3426957		Banco Hutchison						
1407792	3426957		Hutchinson Shoal						
4335091	3426957		Hutchison Shoal						
1407793	3426959		Puerto Howard						
1407794	3426959		Adair’s Harbour						
2984787	3426959	link	https://en.wikipedia.org/wiki/Port_Howard						
4335093	3426959		Port Howard						
1407795	3426962		Ensenada de Vuelta Perruca						
4335096	3426962		Horseshoe Bay						
1407796	3426963		Punta Horse						
4335097	3426963		Horse Point						
1407797	3426964		Montañas Hornby						
4335098	3426964		Hornby Mountains						
7533540	3426964	link	https://en.wikipedia.org/wiki/Hornby_Mountains						
1407798	3426966		Punta Hookers						
4335102	3426966		Hookers Point						
1407799	3426967		Isla Hog						
4335103	3426967		Hog Island						
1407800	3426968		Grietas Hill						
4335104	3426968		Hill Gap						
1407801	3426969		Roca High						
4335106	3426969		High Rock						
15351725	3426970	wkdt	Q16482799						
15969683	3426970		High Island						
1407802	3426971		Isla High Cliff						
4335107	3426971		High Cliff Island						
15699730	3426971	wkdt	Q24571523						
1407803	3426975		Puerto Harriet						
1407804	3426975		Port Firm						
4335110	3426975		Port Harriet						
1407805	3426977		Isla Hare						
4335111	3426977		Hare Island						
15606280	3426977	wkdt	Q24571520						
1407806	3426978		Bay of Harbors						
1407807	3426978		Bahía de Harbours						
1407808	3426978		Bahía de Havre						
1407809	3426978		Bahía de Puente						
4335112	3426978		Bay of Harbours						
7497732	3426978	link	https://en.wikipedia.org/wiki/Bay_of_Harbours						
1407810	3426979		Islas Harbour						
4335113	3426979		Harbour Islands						
1407811	3426982		Isla Halt						
4335114	3426982		Halt Island						
15253338	3426982	wkdt	Q24571518						
1407812	3426983		Caleta Halfway						
4335115	3426983		Halfway Cove						
1407813	3426984		Hadassah Bay						
1407814	3426984		Dettleff’s Bay						
4335117	3426984		Hadassa Bay						
15293092	3426985	wkdt	Q24571517						
15969685	3426985		Gull Island						
7501947	3426987	link	https://en.wikipedia.org/wiki/Green_Patch						
7566575	3426987		Green Patch						
1407815	3426988		Isla Green						
4335123	3426988		Green Island						
15755729	3426988	wkdt	Q24571515						
15890000	3426989	wkdt	Q17505589						
15969688	3426989		Green Island						
1407816	3426990		Isla Great						
4335124	3426990		Great Island						
15865621	3426990	wkdt	Q16580013						
1407817	3426991		Isla Grande						
1407818	3426991		Isla Great						
4335125	3426991		Great Island						
7537804	3426991	link	https://en.wikipedia.org/wiki/Great_Island%2C_Falkland_Islands						
1407819	3426992		Seno Grantham						
1407820	3426992		Bahía de Ruiz Puente						
4335127	3426992		Grantham Sound						
7130050	3426992	link	https://en.wikipedia.org/wiki/Grantham_Sound						
15831388	3426994	wkdt	Q16579892						
15969690	3426994		Government Islet						
1407821	3426996		Goose Green						
2984791	3426996	link	https://en.wikipedia.org/wiki/Goose_Green						
4335131	3426996		Goose Green Settlement						
15649538	3426996	wkdt	Q1537762						
1407822	3426999		Isla Golding						
4335132	3426999		Golding Island						
7176246	3426999	link	https://en.wikipedia.org/wiki/Golding_Island						
9061311	3427004		Gipsey Cove						
1407823	3427005		Isla George						
1407824	3427005		Isla Jorge						
2984792	3427005	link	https://en.wikipedia.org/wiki/George_Island						
4335135	3427005		George Island						
1407825	3427006		Punta Gascoigne						
4335136	3427006		Gascoigne Point						
1407826	3427008		Punta Garden						
4335137	3427008		Garden Point						
1407827	3427010		Roca Fripp						
4335138	3427010		Fripp Rock						
1407828	3427012		Cabo Frehel						
4335141	3427012		Cape Frehel						
1407829	3427014		Punta Fox						
4335142	3427014		Fox Point						
1407830	3427015		Puerto Fox						
4335144	3427015		Fox Harbour						
1407831	3427016		Bahia Foul						
1407832	3427016		Ensenada del Noroeste						
4335149	3427016		Foul Bay						
7502367	3427016	link	https://en.wikipedia.org/wiki/Foul_Bay%2C_Falkland_Islands						
1407833	3427017		Puerto Flores						
4335150	3427017		Flores Harbour						
1407834	3427018		Río Fits Roy						
4335152	3427018		Fitzroy River						
16949413	3427018		Fitzroy						
1407835	3427020		Corral Creek						
4335153	3427020		Fitzroy Creek						
1407836	3427021		Dársena Fitz Roy						
1407837	3427021		Bluff Cove						
1407838	3427021		Hoya Fitz Roy						
4335154	3427021		Fitzroy Basin						
7032849	3427021	link	https://en.wikipedia.org/wiki/Bluff_Cove						
1407839	3427022		Puerto Fitz Roy						
4335155	3427022		Port Fitzroy						
1407840	3427023		Fitzroy South						
1407841	3427023		Fitzroy						
4335156	3427023		Fitzroy Settlement						
15718399	3427023	wkdt	Q3431259						
1407842	3427024		Caleta Fitz						
4335157	3427024		Fitz Cove						
15536472	3427027	wkdt	Q24571495						
15969693	3427027		Findlay Rocks						
1407843	3427028		Puerto Findlay						
4335161	3427028		Findlay Harbour						
1407844	3427032		Rada Fanny						
4335162	3427032		Fanny Road						
1407845	3427033		Islotes Fanny						
4335163	3427033		Fanny Islets						
1407846	3427034		Tussac Island						
1407847	3427034		Isla Tussac						
4335164	3427034		Fanning Island						
15423554	3427034	wkdt	Q16579905						
1407848	3427035		Morro Fanning						
4335165	3427035		Fanning Head						
1407849	3427039		Carlisle Sound						
1407850	3427039		Seno Falkland						
1407851	3427039		Estrecho de San Carlos						
2984793	3427039	link	https://en.wikipedia.org/wiki/Falkland_Sound						
4335167	3427039		Falkland Sound						
16660900	3427039	ru	Фолклендский пролив						
1407852	3427040	es	Islas Malvinas						
1407853	3427040	en	Falklands						
1407854	3427040	fr	Iles Malouines						
4335168	3427040		Falkland Islands (Islas Malvinas)						
6129103	3427040		Islas Malvinas						
6129104	3427040		Iles Malouines						
6129105	3427040		Falklands						
13599073	3427040	link	https://en.wikipedia.org/wiki/Falkland_Islands						
1407855	3427043	es	Punta Engineer						
4335170	3427043		Engineer Point						
13499535	3427043	en	Engineers Point						
15669131	3427047	wkdt	Q16579881						
15969695	3427047		Elephant Island						
1407856	3427048		Cayos Elephant						
4335174	3427048		Elephant Cays						
8097014	3427048	link	https://en.wikipedia.org/wiki/Elephant_Cays						
1407857	3427050		Bahía Elephant						
1407858	3427050		Bahía Elefante Marino						
4335175	3427050		Elephant Bay						
1407859	3427051		Puerto Egmont						
1407860	3427051		Puerto de la Cruzada						
4335177	3427051		Port Egmont						
1407861	3427052		Puerto Egg						
4335178	3427052		Egg Harbour						
7033830	3427052	link	https://en.wikipedia.org/wiki/Egg_Harbour						
5903168	3427053	link	https://en.wikipedia.org/wiki/Mount_Edgeworth						
6129106	3427053		Mount Edgeworth						
1407862	3427054	es	Isla La Concha						
1407863	3427054	es	Isla Concha						
1407864	3427054	es	Roca Eddystone						
1407865	3427054	fr	Tour De Bissy				1		
4335182	3427054		Eddystone Rock						
7491811	3427054	link	https://en.wikipedia.org/wiki/Eddystone_Rock%2C_Falkland_Islands						
1407866	3427056		Rada East						
4335183	3427056		East Road						
1407867	3427057		Punta East						
4335184	3427057		East Point						
1407868	3427058		Isla East						
1407869	3427058		Isla del Este						
4335187	3427058		East Island						
15243772	3427058	wkdt	Q16580089						
1407870	3427059		Isla del Este						
4335188	3427059		East Island						
1407871	3427060		Morro East						
4335189	3427060		East Head						
1407872	3427061		Malvina del Este						
1407873	3427061		East Falkland Island						
1407874	3427061		Isla Soledad						
1407875	3427061		Isla Malvina del Este						
4335190	3427061		East Falkland						
11659779	3427061	link	https://en.wikipedia.org/wiki/East_Falkland						
16629347	3427061	ru	Восточный Фолкленд						
1407876	3427062		Caleta East						
4335191	3427062		East Cove						
15862570	3427063	wkdt	Q16579949						
15969696	3427063		Ear Island						
1407877	3427065		Punta Eagle						
1407878	3427065		Punta Águila						
1407879	3427065		Cape de Barra						
1407880	3427065		Nelsons Point						
4335193	3427065		Eagle Point						
1407881	3427066		Pasaje Eagle						
1407882	3427066		Canal Águila						
4335194	3427066		Eagle Passage						
7124424	3427066	link	https://en.wikipedia.org/wiki/Eagle_Passage						
1407883	3427068		Puerto Duperrey						
1407884	3427068		Long Island Creek						
4335196	3427068		Duperrey Harbour						
1407885	3427069		Punta Duclos						
4335200	3427069		Duclos Point						
15869893	3427070	wkdt	Q15861048						
15969697	3427070		Dry Island						
1407886	3427073		Punta Driftwood						
4335201	3427073		Driftwood Point						
1407887	3427074		Douglas Station						
4335203	3427074		Douglas Settlement						
7082830	3427074	link	https://en.wikipedia.org/wiki/Douglas%2C_Falkland_Islands						
1407888	3427078	es	Cabo Leal						
1407889	3427078	es	Cabo Leal Victoria						
1407890	3427078	es	Cabo Dolphin						
4335205	3427078		Cape Dolphin						
7504046	3427078	link	https://en.wikipedia.org/wiki/Cape_Dolphin						
1407891	3427081		Punta Doctor						
4335206	3427081		Doctor Point						
1407892	3427082		Islote Dirección						
1407893	3427082		Islote Direction						
4335207	3427082		Direction Islet						
15539884	3427082	wkdt	Q24571460						
1407894	3427085		Puerto Darwin						
4335210	3427085		Darwin Harbour						
13189051	3427085		Port Darwin						
1407895	3427086		Darwin						
4335211	3427086		Darwin Settlement						
7140012	3427086	link	https://en.wikipedia.org/wiki/Darwin%2C_Falkland_Islands						
1407896	3427087		Puerto Danson						
4335212	3427087		Danson Harbour						
1407897	3427088		Swan Island Harbour						
4335213	3427088		Cygnet Harbour						
1407898	3427090		Punta Creek						
4335216	3427090		Creek Point						
1407899	3427092		Punta Cow						
4335217	3427092		Cow Point						
1407900	3427094		Bahía Cow						
4335218	3427094		Cow Bay						
1407901	3427096		Cautley Hill						
4335219	3427096		Cortley Hill						
1407902	3427099		Bahía Commitee						
4335220	3427099		Committee Bay						
1407903	3427100		Kelp Island						
1407904	3427100		Isla Pájaros						
1407905	3427100		Bird Island						
4335223	3427100		Cochon Island						
1407906	3427101		Islote Clump						
4335224	3427101		Clump Islet						
15632382	3427101	wkdt	Q24571445						
1407907	3427103		Goose Point						
4335227	3427103		Clam-Bed Point						
1407908	3427105	es	Seno Choiseul						
1407909	3427105	es	Bahía Choiseul						
4335230	3427105		Choiseul Sound						
7123527	3427105	link	https://en.wikipedia.org/wiki/Choiseul_Sound						
16660924	3427105	ru	Шуазёль						
1407910	3427106		Galeway Point						
1407911	3427106		Punta Charles						
1407912	3427106		Rock Point						
4335234	3427106		Charles Point						
1407913	3427108		Colina del Canal						
4335236	3427108		Channel Hill						
5903191	3427110	link	https://en.wikipedia.org/wiki/Mount_Challenger						
6129107	3427110		Mount Challenger						
1407914	3427112		Ensenada Chabot						
4335238	3427112		Chabot Creek						
1407915	3427113		Cerritos						
4335239	3427113		Ceritos						
1407916	3427114		Isla Centro						
4335240	3427114		Centre Island						
15377182	3427114	wkdt	Q24571437						
16162477	3427114	link	https://en.wikipedia.org/wiki/Centre_Island						
1407917	3427115		Isla Centre						
4335241	3427115		Centre Island						
1407918	3427117		Punta Cattle						
4335242	3427117		Cattle Point						
1407919	3427118		Islote Cat						
4335243	3427118		Cat Islet						
15423330	3427118	wkdt	Q24571433						
1407920	3427119		Loma del Castillo						
4335245	3427119		Castle Hill						
1407921	3427120		Pointe de Duras						
1407922	3427120		Pointe de Barthelemy						
1407923	3427120		Cabo Carysfort						
1407924	3427120		Cabo Corrientes						
4335246	3427120		Cape Carysfort						
8094546	3427120	link	https://en.wikipedia.org/wiki/Cape_Carysfort						
1407925	3427122		Caleta Careening						
4335248	3427122		Careening Cove						
1407926	3427123		Carenage						
4335249	3427123		The Careenage						
1407927	3427124		Cantera						
4335252	3427124		Cantera House						
8075727	3427125	link	https://en.wikipedia.org/wiki/Canopus_Hill						
8108875	3427125		Canopus Hill						
1407928	3427129		Campo Verde						
4335253	3427129		Camp Verde						
1407929	3427131		Arroyo Camilla						
4335254	3427131		Camilla Creek						
1407930	3427132		Isla Calista						
4335256	3427132		Calista Island						
15535015	3427132	wkdt	Q24571426						
1407931	3427134		Isla Button						
4335258	3427134		Button Island						
1407932	3427136		Punta Burnt						
4335259	3427136		Burnt Point						
1407933	3427137		Isla Burnt						
4335260	3427137		Burnt Island						
15539466	3427137	wkdt	Q24571422						
16188723	3427137	link	https://en.wikipedia.org/wiki/Burnt_Island						
1407934	3427138		Isla Burnt						
4335261	3427138		Burnt Island						
15477119	3427138	wkdt	Q24571421						
1407935	3427140		Ensenada del Toro						
1407936	3427140		Rada Bull						
4335264	3427140		Bull Roads						
1407937	3427141		Punta del Toro						
1407938	3427141		Punta Bull						
4335266	3427141		Bull Point						
1407939	3427144		Islote Bull						
4335267	3427144		Bull Islet						
15575107	3427144	wkdt	Q24571416						
1407940	3427146		Caleta Bull						
4335268	3427146		Bull Cove						
6889543	3427147	link	https://en.wikipedia.org/wiki/Broken_Island						
6923394	3427147		Broken Island						
1407941	3427148		Cerro Brisbane						
4335271	3427148		Mount Brisbane						
1407942	3427149		Caleta Brenton						
4335273	3427149		Brenton Loch						
7543714	3427149	link	https://en.wikipedia.org/wiki/Brenton_Loch						
1407943	3427150		Caleta Bougainville						
4335275	3427150		Bougainville Creek						
1407944	3427151		Cabo Alto						
1407945	3427151		Cabo Bougainville						
4335276	3427151		Cape Bougainville						
8069869	3427151	link	https://en.wikipedia.org/wiki/Cape_Bougainville						
1407946	3427154		Cerro Bombilla						
4335277	3427154		Bombilia Hill						
15278867	3427154	wkdt	Q24571412						
1407947	3427155		Rocas Bold						
4335278	3427155		Bold Rocks						
1407948	3427156		Punta Bold						
4335279	3427156		Bold Point						
1407949	3427157		Punta Bold						
4335282	3427157		Bold Point						
1407950	3427161		Paso Bodie						
4335283	3427161		Bodie Inlet						
1407951	3427163		Roca Boat						
4335284	3427163		Boat Rock						
1407952	3427164		Punta Boat						
4335285	3427164		Boat Point						
1407953	3427165		Morro Bluff						
4335286	3427165		Bluff Head						
1407954	3427170		Isla Bleaker						
1407955	3427170		Long Island						
1407956	3427170		Isla Maria						
2984794	3427170	link	https://en.wikipedia.org/wiki/Bleaker_Island						
4335287	3427170		Bleaker Island						
1407957	3427171		Bahía Blanco						
4335288	3427171		Blanco Bay						
7492345	3427171	link	https://en.wikipedia.org/wiki/Blanco_Bay						
1407958	3427172		Rocas Negras						
1407959	3427172		Rocas Black						
4335289	3427172		Black Rocks						
1407960	3427173		Roca Negra						
4335291	3427173		Black Rock						
1407961	3427176		Río Brackburn						
4335292	3427176		Blackburn River						
6893014	3427176	link	https://en.wikipedia.org/wiki/Blackburn_River						
16949419	3427176		Blackburn						
1407962	3427177		Port William Rocks						
1407963	3427177		Billy Rocks						
1407964	3427177		Roca Billy						
4335294	3427177		Billy Rock						
1407965	3427178		Baye d’Acaron						
1407966	3427178		Baye Française						
1407967	3427178		Bahía de la Anunciación						
1407968	3427178		Puerto de la Soledad						
1407969	3427178		Seno Berkeley						
4335295	3427178		Berkeley Sound						
7126964	3427178	link	https://en.wikipedia.org/wiki/Berkeley_Sound						
1407970	3427179		Beecher Islands						
4335298	3427179		Becher Islands						
1407971	3427180	fr	Ile Beauchesne						
1407972	3427180		Beauchêne						
1407973	3427180	es	Isla Beauchêne						
2984795	3427180	link	https://en.wikipedia.org/wiki/Beauchene_Island						
4335303	3427180		Beauchêne Island						
1407974	3427182		Punta Beach						
4335305	3427182		Beach Point						
1407975	3427183		Punta Bay						
4335306	3427183		Bay Point						
1407976	3427185		Puerto Barrow						
4335307	3427185		Barrow Harbour						
1407977	3427186		Arrecifes Barren						
4335308	3427186		Barren Reefs						
1407978	3427187		Isla Barren						
1407979	3427187		Isla Pelada						
2984796	3427187	link	https://en.wikipedia.org/wiki/Barren_Island%2C_Falkland_Islands						
4335309	3427187		Barren Island						
1407980	3427188		Arroyo Malo River						
4335312	3427188		Arroyomalo						
1407981	3427189		Punta Arrow						
4335313	3427189		Arrow Point						
1407982	3427190		Islas Arrow						
4335314	3427190		Arrow Islands						
1407983	3427191		Puerto Arrow						
4335315	3427191		Arrow Harbour						
1407984	3427193		Paso Anxious						
4335318	3427193		Anxious Passage						
15858065	3427194	wkdt	Q15848290						
15969702	3427194		Anchor Island						
2984797	3427195	link	https://en.wikipedia.org/wiki/Ajax_Bay						
4335324	3427195		Ajax Bay						
1407985	3427197		Seno Adventure						
1407986	3427197		Bahía del Labertino						
4335325	3427197		Adventure Sound						
7033112	3427197	link	https://en.wikipedia.org/wiki/Adventure_Sound						
1407987	3427198		Puerto Adventure						
4335326	3427198		Adventure Harbour						
1407988	3427199		Monte Adam						
4335327	3427199		Mount Adam						
6895640	3427199	link	https://en.wikipedia.org/wiki/Mount_Adam%2C_Falkland_Islands						
15214397	3473342	wkdt	Q16579943						
16007514	3473342		North East Island						
15547546	3473345	wkdt	Q24571374						
16007515	3473345		Smoko Mountain						
1426650	3473351		Foam Creek House						
15830386	3473356	wkdt	Q16579980						
16007516	3473356		Pebble Islet						
5902004	3473357	link	https://en.wikipedia.org/wiki/Mount_Robinson						
6162229	3473357		Mount Robinson						
15225935	3473590	wkdt	Q24571363						
16015104	3473590		Armantine Beach						
15238805	3473594	wkdt	Q24571360						
16015105	3473594		Campa Menta Beach						
15532165	3473614	wkdt	Q24571349						
16015106	3473614		Cow Bay Ridge						
14877728	3473617	wkdt	Q24571348						
16015108	3473617		Volunteer Beach						
15234548	3473624	wkdt	Q24571342						
16015126	3473624		Gull Island						
1426651	3473626		Round Island						
4733613	3473626		Celery Island						
15283583	3473750	wkdt	Q24571334						
16015584	3473750		Wedge Island						
15723642	3473751	wkdt	Q24571333						
16015586	3473751		Hill Gap Island						
15306041	3473754	wkdt	Q24571330						
16015591	3473754		Stinker Island						
15201531	3473761	wkdt	Q24571323						
16015592	3473761		Peat Bog Ridge						
15821827	3473762	wkdt	Q16579970						
16015593	3473762		Flores Harbour Island						
1426665	3474414	es	Islas Malvinas	1					
1426666	3474414	en	Falkland Islands	1					
1426667	3474414	en	Colony of the Falkland Islands						
2256634	3474414	fr	Îles Malouines	1					
2296700	3474414	is	Falklandseyjar	1					
2418996	3474414	af	Falklandeilande	1					
2418997	3474414	am	የፎክላንድ ደሴቶች	1					
2418998	3474414	ar	جزر فوكلاند	1					
2418999	3474414	be	Фалклендскія астравы	1					
2419000	3474414	bg	Фолкландски острови	1					
2419001	3474414	bn	ফকল্যান্ড দ্বীপপুঞ্জ	1					
2419002	3474414	bo	ཕལྐ་ལནྜ་གླིང་ཕྲན།	1					
2419003	3474414	ca	Illes Malvines	1					
2419004	3474414	cs	Falklandské ostrovy	1					
2419005	3474414	cy	Ynysoedd y Falkland/Malvinas	1					
2419006	3474414	da	Falklandsøerne	1					
2419007	3474414	de	Falklandinseln	1					
2419008	3474414	el	Νήσοι Φόκλαντ	1					
2419009	3474414	es	Islas Falkland (Malvinas)						
2419010	3474414	et	Falklandi saared	1					
2419011	3474414	eu	Falklandak	1					
2419012	3474414	fa	جزایر فالکلند	1					
2419013	3474414	fi	Falklandinsaaret	1					
2419014	3474414	fr	Îles Falkland						
2419015	3474414	ga	Oileáin Fháclainne	1					
2419016	3474414	gl	Illas Malvinas	1					
2419017	3474414	he	איי פוקלנד	1					
2419018	3474414	hi	फ़ॉकलैंड द्वीपसमूह	1					
2419019	3474414	hr	Falklandski otoci	1					
2419020	3474414	hu	Falkland-szigetek	1					
2419021	3474414	id	Kepulauan Falkland	1					
2419022	3474414	it	Isole Falkland	1					
2419023	3474414	ja	フォークランド諸島	1					
2419024	3474414	ka	ფოლკლენდის კუნძულები	1					
2419025	3474414	ko	포클랜드 제도	1					
2419026	3474414	lt	Folklando Salos	1					
2419027	3474414	lv	Folklenda salas	1					
2419028	3474414	mk	Фолкландски Острови	1					
2419029	3474414	ms	Kepulauan Falkland	1					
2419030	3474414	mt	il-Gżejjer Falkland	1					
2419031	3474414	nb	Falklandsøyene	1					
2419032	3474414	nl	Falklandeilanden	1					
2419033	3474414	nn	Falklandsøyane	1					
2419034	3474414	pl	Falklandy	1					
2419035	3474414	pt	Ilhas Malvinas	1					
2419036	3474414	ro	Insulele Falkland	1					
2419037	3474414	ru	Фолклендские о-ва	1					
2419038	3474414	se	Falklandsullot	1					
2419039	3474414	sk	Falklandy	1					
2419040	3474414	sl	Falklandski otoki	1					
2419041	3474414	sr	Фокландска острва	1					
2419042	3474414	sv	Falklandsöarna	1					
2419043	3474414	th	หมู่เกาะฟอล์กแลนด์	1					
2419044	3474414	tr	Falkland Adaları	1					
2419045	3474414	uk	Фолклендські острови	1					
2419046	3474414	ur	فاکلینڈ جزائر	1					
2419047	3474414	vi	Quần Đảo Falkland	1					
2419048	3474414	zh-TW	福克兰群岛	1					
4765806	3474414		Falkland Islands (Islas Malvinas)						
5423962	3474414	link	https://en.wikipedia.org/wiki/Falkland_Islands						
6180243	3474414		Falkland Islands						
6180244	3474414		Islas Malvinas						
6180245	3474414		Colony of the Falkland Islands						
7086568	3474414	ak	Fɔlkman Aeland	1					
7086569	3474414	az	Folklend adaları	1					
7086570	3474414	bm	Maluwini Gun	1					
7086571	3474414	br	Inizi Falkland	1					
7086572	3474414	bs	Folklandska Ostrva	1					
7086573	3474414	ee	Falkland ƒudomekpowo nutome	1					
7086574	3474414	ff	Duuɗe Falkland	1					
7086575	3474414	fo	Falklandsoyggjar	1					
7086576	3474414	gu	ફૉકલેન્ડ આઇલેન્ડ્સ	1					
7086577	3474414	ha	Tsibiran Falkilan	1					
7086578	3474414	ki	Visiwa vya Falkland	1					
7086579	3474414	kl	Falklandi qeqertaq	1					
7086580	3474414	kn	ಫಾಕ್‌ಲ್ಯಾಂಡ್ ದ್ವೀಪಗಳು	1					
7086581	3474414	lg	Bizinga by’eFalikalandi	1					
7086582	3474414	ln	Bisanga bya Maluni	1					
7086583	3474414	lu	Lutanda lua Maluni	1					
7086584	3474414	mg	Nosy Falkand	1					
7086585	3474414	ml	ഫാക്ക്‌ലാന്റ് ദ്വീപുകൾ	1					
7086586	3474414	mr	फॉकलंड बेटे	1					
7086587	3474414	my	ဖော့ကလန် ကျွန်းစု	1					
7086588	3474414	nd	Falkland Islands	1					
7086589	3474414	ne	फकल्याण्ड टापुहरु	1					
7086590	3474414	or	ଫକ୍‌ଲ୍ୟାଣ୍ଡ ଦ୍ଵୀପପୁଞ୍ଜ	1					
7086591	3474414	rm	Inslas Falkland	1					
7086592	3474414	rn	Izinga rya Filikilandi	1					
7086593	3474414	sg	Âzûâ tî Mälüîni	1					
7086594	3474414	si	ෆෝක්ලන්ත දූපත්	1					
7086595	3474414	sn	Zvitsuwa zveFalklands	1					
7086596	3474414	so	Jasiiradaha Fookland	1					
7086597	3474414	sw	Visiwa vya Falkland	1					
7086598	3474414	ta	ஃபாக்லாந்து தீவுகள்	1					
7086599	3474414	te	ఫాక్‌ల్యాండ్ దీవులు	1					
7086600	3474414	ti	ደሴታት ፎክላንድ	1					
7086601	3474414	to	ʻOtumotu Malivina	1					
7086602	3474414	yo	Etikun Fakalandi	1					
7086603	3474414	zu	i-Falkland Islands	1					
7297469	3474414	link	https://no.wikipedia.org/wiki/Falklands%C3%B8yene						
8103213	3474414	en	Falkland Islands (Malvinas)						
16490069	3474414	zh-CN	福克兰群岛（马尔维纳斯）						
16925724	3474414	zh-Hant	福克蘭群島	1					
16928085	3474414	as	ফকলেণ্ড দ্বীপপুঞ্জ	1					
16928086	3474414	ce	Фолклендан гӀайренаш	1					
16928087	3474414	dz	ཕལྐ་ལནྜ་གླིང་ཚོམ	1					
16928088	3474414	fy	Falklâneilannen	1					
16928089	3474414	gd	Na h-Eileanan Fàclannach	1					
16928090	3474414	hy	Ֆոլքլենդյան կղզիներ	1					
16928091	3474414	ig	Agwaetiti Falkland	1					
16928092	3474414	jv	Kapuloan Falkland	1					
16928093	3474414	kk	Фолкленд аралдары	1					
16928094	3474414	km	កោះ​ហ្វក់ឡែន	1					
16928095	3474414	ks	فٕلاکلینڑ جٔزیٖرٕ	1					
16928096	3474414	ku	Giravên Malvîn	1					
16928097	3474414	ky	Фолкленд аралдары	1					
16928098	3474414	lb	Falklandinselen	1					
16928099	3474414	lo	ຫມູ່ເກາະຟອກແລນ	1					
16928100	3474414	mn	Фолклендийн арлууд	1					
16928101	3474414	no	Falklandsøyene	1					
16928102	3474414	pa	ਫ਼ਾਕਲੈਂਡ ਟਾਪੂ	1					
16928103	3474414	ps	فاکلينډ ټاپوګان	1					
16928104	3474414	qu	Islas Malvinas	1					
16928105	3474414	sd	فاڪ لينڊ ٻيٽ	1					
16928106	3474414	sq	Ishujt Falkland	1					
16928107	3474414	tg	Ҷазираҳои Фолкленд	1					
16928108	3474414	tk	Folklend adalary	1					
16928109	3474414	tt	Фолкленд утраулары	1					
16928110	3474414	ug	فالكلاند ئاراللىرى	1					
16928111	3474414	uz	Folklend orollari	1					
16928112	3474414	wo	Duni Falkland	1					
16928113	3474414	yi	פֿאַלקלאַנד אינזלען	1					
16928114	3474414	zh	福克兰群岛	1					
1507360	3831704		Monte Young						
4334758	3831704		Mount Young						
5903400	3831704	link	https://en.wikipedia.org/wiki/Mount_Young						
1507361	3831705		Punta Amarilla						
4334761	3831705		Yellow Point						
1507362	3831706		Isla Wreck						
1507363	3831706		Isla Los Hermanos						
4334762	3831706		Wreck Island						
15472481	3831706	wkdt	Q16579926						
1507364	3831707		Bajofondo Wood						
4334763	3831707		Wood Shoal						
1507365	3831708		Caleta de la Leña						
4334764	3831708		Wood Cove						
1507366	3831710		Roca Blanca						
4334772	3831710		White Rock						
1507367	3831712		Bahía Whaler						
4334776	3831712		Whaler Bay						
1507368	3831713		Pasaje Whale						
4334777	3831713		Whale Passage						
1507369	3831714		Islote Whate						
4334778	3831714		Whale Islet						
1507370	3831715		Wooley Gut						
1507371	3831715		Paso Westpoint						
1507372	3831715		Bahía de la Arboleda						
4334781	3831715		Westpoint Pass						
1507373	3831716		Isla Remolinos						
1507374	3831716		Albatross Island						
1507375	3831716		Isla Westpoint						
4334782	3831716		Westpoint Island						
7498190	3831716	link	https://en.wikipedia.org/wiki/West_Point_Island						
1507376	3831717		Llamado West						
4334784	3831717		West Passage						
1507377	3831718		Islote West						
1507378	3831718		Isla Oeste						
4334786	3831718		West Island						
15240966	3831718	wkdt	Q24571295						
1507379	3831719		Morro West						
4334788	3831719		West Head						
1507380	3831720		Caleta Oeste						
4334791	3831720		West Cove						
1507381	3831721		Punta West						
4334792	3831721		West Bluff						
1507382	3831722		Brazo West						
1507383	3831722		Brazo Oeste						
4334793	3831722		West Arm						
1507384	3831723		Brazo Oeste						
1507385	3831723		West Arm						
4334794	3831723		Double Creek West Arm						
1507386	3831724		Punta Weddell						
4334796	3831724		Weddell Point						
1507387	3831725		Isla de San José						
1507388	3831725		Isla Weddell						
1507389	3831725		Isla San José						
1507390	3831725		Swan Island						
2987896	3831725	link	https://en.wikipedia.org/wiki/Weddell_Island						
4334797	3831725		Weddell Island						
16157465	3831726	link	https://en.wikipedia.org/wiki/Mount_Weddell						
16212260	3831726		Mount Weddell						
1507391	3831731		Islote Clump Norte						
1507392	3831731		Northern Clump Islet						
4334812	3831731		Tussac Islet						
15571625	3831731	wkdt	Q24571286						
15850220	3831732	wkdt	Q24571285						
15969660	3831732		Tussac Island						
1507393	3831733		Punta Town						
4334819	3831733		Town Point						
1507394	3831736		Isla Tercera						
4334821	3831736		Third Island						
1507395	3831737		Cabo Terrible						
4334822	3831737		Cape Terrible						
1507396	3831738		Punta Tern						
4334823	3831738		Tern Point						
1507397	3831740		Río Teal						
4334824	3831740		Teal River						
16949408	3831740		Teal						
1507398	3831741		Isla Tea						
4334828	3831741		Tea Island						
6889621	3831741	link	https://en.wikipedia.org/wiki/Tea_Island						
1507399	3831742		Tea Channel						
1507400	3831742		Canal Tea						
1507401	3831742		Bahia de la Paz						
4334829	3831742		Tea Island Passage						
1507402	3831746		Puerto Symonds						
1507403	3831746		Bahía Symonds						
4334833	3831746		Symonds Harbour						
1507404	3831747		Punta Swan						
1507405	3831747		Punta del Caballo						
4334834	3831747		Swan Point						
1507406	3831748		Monte Sulivan						
4334841	3831748		Mount Sulivan						
5902063	3831748	link	https://en.wikipedia.org/wiki/Mount_Sulivan						
15574118	3831748	wkdt	Q15260070						
1507407	3831750		Islote Stop						
4334842	3831750		Stop Islet						
15589383	3831750	wkdt	Q24571270						
1507408	3831754		Pico Stephens						
4334843	3831754		Stephens Peak						
1507409	3831755		Acantilado Stephens						
4334844	3831755		Stephens Bluff						
1507410	3831756		Puerto Stephens						
1507411	3831756		Bahía San Felipe						
4334845	3831756		Port Stephens						
1507412	3831757		Punta Steep						
4334846	3831757		Steep Point						
2987897	3831758	link	https://en.wikipedia.org/wiki/Steeple_Jason_Island						
4334847	3831758		Steeple Jason						
1507413	3831759		States Bay						
4334848	3831759		States Cove						
1507414	3831762		Staate Island						
1507415	3831762		Isla Staats						
4334852	3831762		Staats Island						
6889196	3831762	link	https://en.wikipedia.org/wiki/Staats_Island						
1507416	3831763		Acantilado Staats						
4334853	3831763		Staats Bluff						
1507417	3831764		Punta Spring						
4334855	3831764		Spring Point						
1507418	3831765		Spring Point						
4334856	3831765		Spring Point Settlement						
1507419	3831767		Isla Split						
4334857	3831767		Split Island						
1507420	3831769		Isla Jason del Sur						
4334861	3831769		South Jason						
7185750	3831769	link	https://en.wikipedia.org/wiki/South_Jason_Island						
15308058	3831769	wkdt	Q7567567						
1507421	3831771	es	Morro South						
4334862	3831771		South Head						
1507422	3831772		Puerto South						
1507423	3831772		Puerto Sur						
4334863	3831772		South Harbour						
16202856	3831772	link	https://en.wikipedia.org/wiki/South_Harbor						
1507424	3831773		Puerto South						
1507425	3831773		Puerto Sur						
4334864	3831773		South Harbour						
1507426	3831774		Isla Fur del Sur						
4334865	3831774		South Fur Island						
15314550	3831774	wkdt	Q24571253						
1507427	3831776		Roca Smylie						
4334867	3831776		Smylie Rock						
1507428	3831777		Canal Smylie						
4334868	3831777		Smylie Channel						
16149050	3831777	link	https://en.wikipedia.org/wiki/Smylie_Channel						
1507429	3831778		Roca Sloop						
4334869	3831778		Sloop Rock						
1507430	3831780		Puerto Ship						
1507431	3831780		Bahía del Rosario						
4334873	3831780		Ship Harbour						
1507432	3831782		Puerto Shallow						
4334875	3831782		Shallow Harbour						
1507433	3831783		Acantilado Shallow						
4334877	3831783		Shallow Bluff						
1507434	3831786		Legua Settlement						
4334882	3831786		Settlement Spit						
1507435	3831787		Ensenada Settlement						
4334883	3831787		Settlement Creek						
1507436	3831788		Isla Sedge						
1507437	3831788		Isla Culebra						
4334884	3831788		Sedge Island						
6889490	3831788	link	https://en.wikipedia.org/wiki/Sedge_Island						
1507438	3831789		Isla Second						
1507439	3831789		Isla Segunda						
4334885	3831789		Second Island						
15468307	3831790	wkdt	Q24571239						
15969664	3831790		Second Flat Islet						
1507440	3831791		Rocas Seal						
4334886	3831791		Seal Rocks						
15902837	3831791	wkdt	Q16625757						
15812414	3831792	wkdt	Q16625755						
15969665	3831792		Seal Rocks						
15239891	3831793	wkdt	Q24571236						
1507441	3831795		Caleta Sealers						
1507442	3831795		Sealers Cove						
4334895	3831795		Sealer Cove						
1507443	3831796		Isla Sea Dog						
4334897	3831796		Sea Dog Island						
15430714	3831796	wkdt	Q16579884						
16200386	3831796	link	https://en.wikipedia.org/wiki/Sea_Dog_Island						
1507444	3831797		Isla Saunders						
1507445	3831797		Isla de la Población						
1507446	3831797		Isla Trinidad						
2987898	3831797	link	https://en.wikipedia.org/wiki/Saunders_Island%2C_Falkland_Islands						
4334899	3831797		Saunders Island						
1507447	3831798		Roca Sail						
4334913	3831798		Sail Rock						
1507448	3831799		Isla La Silla						
1507449	3831799		Isla Saddle						
4334914	3831799		Saddle Island						
15669917	3831799	wkdt	Q16579934						
1507450	3831800		Roy Cove						
4334917	3831800		Roy Cove Settlement						
7072602	3831800	link	https://en.wikipedia.org/wiki/Roy_Cove						
15769341	3831800	wkdt	Q7372703						
1507451	3831801		Caleta Roy						
4334918	3831801		Roy Cove						
1507452	3831802		Caleta Rous						
4334919	3831802		Rous Creek						
1507453	3831803		Punta Round						
4334920	3831803		Round Point						
1507454	3831804		Isla Round						
4334922	3831804		Round Island						
15280456	3831804	wkdt	Q24571231						
14897340	3831806	wkdt	Q24571229						
15969670	3831806		Rookery Hill						
1507455	3831807		Caleta Rodney						
4334924	3831807		Rodney Cove						
1507456	3831808	es	Acantilado Rodney						
4334925	3831808		Rodney Bluff						
1507457	3831809		Puerto Richards						
4334931	3831809		Port Richards						
1507458	3831811		Puerto Rees						
4334932	3831811		Rees Harbour						
1507459	3831814		El Canal Reef						
4334936	3831814		Reef Channel						
1507460	3831817		Rocas Race						
4334938	3831817		Race Rocks						
1507461	3831818		Punta Race						
4334939	3831818		Race Point						
16163611	3831818	link	https://en.wikipedia.org/wiki/Race_Point						
1507462	3831820		Isla Rabbit						
4334942	3831820		Rabbit Island						
1507463	3831822		Punta Queen						
4334944	3831822		Queen Point						
1507464	3831823		Bahía Queen Charlotte						
1507465	3831823		Bahía de San Julián						
1507466	3831823		Bahía San Julián						
4334945	3831823		Queen Charlotte Bay						
7505995	3831823	link	https://en.wikipedia.org/wiki/Queen_Charlotte_Bay						
1507467	3831824		Quaking Passage						
4334946	3831824		Quaker Passage						
15612115	3831825	wkdt	Q16580081						
15969673	3831825		Quaker Island						
1507468	3831826		Puerto de Ximénez						
4334947	3831826		Quaker Harbour						
16181283	3831826	link	https://en.wikipedia.org/wiki/Quaker_Harbour						
1507469	3831828		Port Stephens						
4334951	3831828		Port Stephens Settlement						
1507470	3831829		Port Egmont						
1507471	3831829		Old Settlement						
4334956	3831829		Port Egmont Settlement						
1507472	3831830		Cayos Port Egmont						
4334957	3831830		Port Egmont Cays						
16203796	3831834	link	https://en.wikipedia.org/wiki/Pitt_Heights						
16212261	3831834		Pitt Heights						
16159985	3831837	link	https://en.wikipedia.org/wiki/Pillar_Bluff						
16212262	3831837		Pillar Bluff						
15629303	3831839	wkdt	Q24571204						
15969675	3831839		Mount Pickthorne						
1507473	3831840		Rada Philomel						
4334967	3831840		Philomel Road						
1507474	3831841		Paso Philomel						
4334968	3831841		Philomel Pass						
1507475	3831842		Puerto Philomel						
4334969	3831842		Port Philomel						
1507476	3831843		Monte Philomel						
4334970	3831843		Mount Philomel						
1507477	3831845		Isla Baja						
4334973	3831845		Penn Island						
15836417	3831845	wkdt	Q16579958						
16202674	3831845	link	https://en.wikipedia.org/wiki/Penn_Island						
15898776	3831847	wkdt	Q24571197						
15969676	3831847		Penguin Island						
1507478	3831848		Caleta Penguin						
1507479	3831848		Caleta Pingüino						
4334974	3831848		Penguin Cove						
1507480	3831849		Punta Pencarrow						
4334975	3831849		Penarrow Point						
1507481	3831850		Punta Pea						
4334982	3831850		Pea Point						
1507482	3831852		Islas del Pasaje						
1507483	3831852		Islas Passage						
4334983	3831852		Passage Islands						
7504887	3831852	link	https://en.wikipedia.org/wiki/Passage_Islands						
15478142	3831853	wkdt	Q24571193						
15969678	3831853		Outer Island						
1507484	3831854		Colina Orford						
4334987	3831854		Orford Hill						
1507485	3831855		Cabo Orford						
4334988	3831855		Cape Orford						
1507486	3831856		Bahía Noroeste						
4334993	3831856		Northwest Bay						
1507487	3831857		Brazo North West						
1507488	3831857		Brazo Noroeste						
4334994	3831857		North West Arm						
1507489	3831858		Isla North						
1507490	3831858		Isla Norte						
4335001	3831858		North Island						
15094250	3831858	wkdt	Q16579946						
1507491	3831859		Morro North						
4335002	3831859		North Head						
1507492	3831860		Puerto Norte						
1507493	3831860		Puerto North						
4335003	3831860		North Harbour						
1507494	3831861		Isla Fur del Norte						
4335004	3831861		North Fur Island						
15414219	3831861	wkdt	Q24571186						
1507495	3831862		Morro Norte						
1507496	3831862		Acantilado North						
4335006	3831862		North Bluff						
1507497	3831864		Brazo North						
4335010	3831864		North Arm						
1507498	3831865		Puerto Norte						
4335011	3831865		Port North						
1507499	3831867		Caleta Año Nuevo						
1507500	3831867		Caleta New Year						
4335012	3831867		New Year Cove						
16144345	3831867	link	https://en.wikipedia.org/wiki/New_Year_Cove						
1507501	3831868		Isla New						
1507502	3831868		Isla Nueva						
1507503	3831868		San Felipe Island						
1507504	3831868		Isla de Goicoechea						
4335013	3831868		New Island						
7172528	3831868	link	https://en.wikipedia.org/wiki/New_Island						
1507505	3831869		Rocas Agujas						
1507506	3831869		Rocas Needles						
4335015	3831869		Needles Rocks						
1507507	3831874		Isla Middle						
4335029	3831874		Middle Island						
1507508	3831875	es	Cabo Meredith						
4335033	3831875		Cape Meredith						
7493668	3831875	link	https://en.wikipedia.org/wiki/Cape_Meredith						
16653223	3831875		Cabo Belgrano						
1507509	3831876		Punta Mark						
4335035	3831876		Mark Point						
1507510	3831877		Arrecife Lucas						
4335045	3831877		Lucas Reef						
1507511	3831878		Punta Lucas						
4335046	3831878		Lucas Point						
1507512	3831879		Bahía Lucas						
4335047	3831879		Lucas Bay						
15844593	3831881	wkdt	Q16493445						
15969679	3831881		Low Island						
1507513	3831882		Isla Baja						
1507514	3831882		Isla Low						
4335050	3831882		Low Island						
15509555	3831882	wkdt	Q6692891						
1507515	3831883		Morro Loop						
4335054	3831883		Loop Head						
1507516	3831886		Isla Knoll						
4335066	3831886		Knoll Island						
15226466	3831886	wkdt	Q24571855						
1507517	3831887		Islote Knob						
4335067	3831887		Knob Islet						
15251788	3831887	wkdt	Q24571854						
1507518	3831889		Bahía del Rey Jorge						
1507519	3831889		Bahía King George						
4335068	3831889		King George Bay						
16141982	3831889	link	https://en.wikipedia.org/wiki/King_George_Bay						
1507520	3831892		Cayo Jason del Oeste						
1507521	3831892		Isla Rasa						
4335086	3831892		Jason West Cay						
1507522	3831893		Islas Sebaldes						
1507523	3831893		Islas Jason						
1507524	3831893		Islas Salvajes						
1507525	3831893		Sebaldine Islands						
4335087	3831893		Jason Islands						
5710766	3831893	link	https://en.wikipedia.org/wiki/Jason_Islands						
1507526	3831894		Cayo Jason del Este						
4335088	3831894		Jason East Cay						
15876765	3831894	wkdt	Q16579984						
1507527	3831899		Isla Hummock						
4335092	3831899		Hummock Island						
6889705	3831899	link	https://en.wikipedia.org/wiki/Hummock_Island						
1507528	3831900		Caleta House						
4335094	3831900		House Cove						
16142004	3831901	link	https://en.wikipedia.org/wiki/Hotham_Heights						
16212263	3831901		Hotham Heights						
1507529	3831902		Entrada Hoste						
4335095	3831902		Hoste Inlet						
16172738	3831903	link	https://en.wikipedia.org/wiki/Horse_Block						
16212264	3831903		Horse Block						
1507530	3831904		Arrecife Hope						
4335099	3831904		Hope Reef						
1507531	3831905		Punta Hope						
1507532	3831905		Punta Esperanza						
4335100	3831905		Hope Point						
1507533	3831906		Puerto Hope						
4335101	3831906		Hope Harbour						
15900652	3831907	wkdt	Q16579873						
15969682	3831907		Hill Island						
6923392	3831908		Hill Cove						
1507534	3831909		Caleta de la Colina						
1507535	3831909		Caleta Hill						
4335105	3831909		Hill Cove						
6903807	3831909	link	https://en.wikipedia.org/wiki/Hill_Cove						
1507536	3831910		Acantilado High						
4335108	3831910		High Bluff						
1507537	3831911		Monte Harston						
4335109	3831911		Mount Harston						
15588055	3831911	wkdt	Q24571840						
1507538	3831912		Caleta Halfway						
4335116	3831912		Halfway Cove						
15296834	3831913	wkdt	Q24571839						
15969684	3831913		Half Tide Island						
1507539	3831915		Punta Gull						
4335118	3831915		Gull Point						
1507540	3831916		Punta Gull						
4335119	3831916		Gull Point						
1507541	3831917		Puerto Gull						
4335120	3831917		Gull Harbour						
16168404	3831917	link	https://en.wikipedia.org/wiki/Gull_Harbour						
1507542	3831918		Canal de Grey						
1507543	3831918		Canal Grey						
4335121	3831918		Grey Channel						
1507544	3831920		Isla Green						
1507545	3831920		Green Islet						
1507546	3831920		Islote Green						
4335122	3831920		Green Island						
15713436	3831920	wkdt	Q24571832						
15646816	3831921	wkdt	Q16579961						
15969686	3831921		Green Island						
15438622	3831922	wkdt	Q24571830						
15969687	3831922		Green Island						
1507547	3831923		Death Cove						
1507548	3831923		Caleta Grave						
4335126	3831923		Grave Cove						
2987899	3831924	link	https://en.wikipedia.org/wiki/Grand_Jason_Island						
4335128	3831924		Grand Jason						
15521210	3831925	wkdt	Q24571829						
15969689	3831925		Grand Cliff						
1507549	3831926		Isla Governor						
4335129	3831926		Governor Island						
15466534	3831926	wkdt	Q16579890						
1507550	3831927		Canal Governor						
4335130	3831927		Governor Channel						
1507551	3831929		Roca Gibraltar						
4335133	3831929		Gibraltar Rock						
1507552	3831930		Arrecife Gibraltar						
4335134	3831930		Gibraltar Reef						
1507553	3831931		Friend Pass						
4335139	3831931		Friend Passage						
15832417	3831932	wkdt	Q16580143						
15969691	3831932		The Fridays						
1507554	3831934		Puerto French						
1507555	3831934		Puerto France’s						
4335140	3831934		French Harbour						
16156815	3831934	link	https://en.wikipedia.org/wiki/French_Harbour						
1507556	3831935		Isla Fox						
4335143	3831935		Fox Island						
15898040	3831936	wkdt	Q16579886						
15969692	3831936		Fox Island						
1507557	3831937		West Settlement						
4335145	3831937		Fox Bay West Settlement						
1507558	3831938		East Settlement						
1507559	3831938		Bahia Fox						
4335146	3831938		Fox Bay East Settlement						
13755304	3831938	unlc	FKFBE						
1507560	3831939		Bahia Fox						
4335147	3831939		Fox Bay						
11308628	3831939	link	https://en.wikipedia.org/wiki/Fox_Bay						
1507561	3831940		Isla Cuarta						
1507562	3831940		Isla Fourth						
4335148	3831940		Fourth Island						
15903998	3831940	wkdt	Q16579876						
6889180	3831942	link	https://en.wikipedia.org/wiki/Flat_Jason_Island						
6923393	3831942		Flat Jason						
1507563	3831943		Isla Flat						
4335151	3831943		Flat Islet						
15311348	3831943	wkdt	Q24571814						
16949414	3831944		Fish River						
16949415	3831944		Fish						
1507564	3831946		Ensenada Fish						
4335158	3831946		Fish Creek						
1507565	3831947		Ensenada Fish						
4335159	3831947		Fish Creek						
1507566	3831948		Isla San Julián						
4335160	3831948		First Island						
15351716	3831948	wkdt	Q16580000						
15496812	3831950	wkdt	Q24571810						
15969694	3831950		Mount Fegen						
1507567	3831951		Pasaje False						
4335166	3831951		False Passage						
1507568	3831953		Caleta de la Entrada						
4335169	3831953		Entrance Cove						
1507569	3831954		Punta Elephant						
1507570	3831954		Punta Elefante Marino						
4335171	3831954		Elephant Point						
1507571	3831955		Isla Elephant Jason						
1507572	3831955		Pan de Azúcar						
4335172	3831955		Elephant Jason						
6889232	3831955	link	https://en.wikipedia.org/wiki/Elephant_Jason_Island						
1507573	3831956		Caleta Elephant						
4335173	3831956		Elephant Cove						
1507574	3831957		Mount Egmont						
4335176	3831957		Egmont Hill						
1507575	3831958		Ensenada Edye						
4335179	3831958		Edye Creek						
1507576	3831959		Cadena Edgar						
4335180	3831959		Edgar Ridge						
1507577	3831960	es	Puerto Edgar						
4335181	3831960		Port Edgar						
1507578	3831961		Punta East						
4335185	3831961		East Point						
1507579	3831962		Pasaje East						
1507580	3831962		Paso Este						
4335186	3831962		East Passage						
1507581	3831965		East Arm						
1507582	3831965		Brazo Este						
4335192	3831965		Double Creek East Arm						
1507583	3831967		Isla Dyke						
4335195	3831967		Dyke Island						
7515079	3831967	link	https://en.wikipedia.org/wiki/Dyke_Island						
1507584	3831968		Dunnose Head						
2987900	3831968	link	https://en.wikipedia.org/wiki/Dunnose_Head						
4335197	3831968		Dunnose Head Settlement						
1507585	3831969		Morro Dunnose						
1507586	3831969		Dunoze Point						
4335198	3831969		Dunnose Head						
1507587	3831970		Isla Dunbar						
4335199	3831970		Dunbar Island						
6889276	3831970	link	https://en.wikipedia.org/wiki/Dunbar_Island						
1507588	3831971		Río Doyle						
4335202	3831971		Doyle River						
16949416	3831971		Doyle						
15802358	3831974	wkdt	Q15860911						
15969698	3831974		Double Island						
1507589	3831975		Ensenada Double						
1507590	3831975		Arroyo Doble						
4335204	3831975		Double Creek						
1507591	3831976		Punta Dick						
4335208	3831976		Dick Point						
1507592	3831977		Death’s Morro						
4335209	3831977		Deaths Head						
1507593	3831978		Isla Cross						
4335214	3831978		Cross Island						
1507594	3831979		Abra Crooked						
4335215	3831979		Crooked Inlet						
1507595	3831982		Colliers						
4335221	3831982		The Colliers						
1507596	3831983		Isla Coffin						
4335222	3831983		Coffin Island						
15414181	3831983	wkdt	Q15860291						
1507597	3831984		Islotes Clump						
4335225	3831984		Clump Islands						
1507598	3831985		Islote Clump						
4335226	3831985		Clump Island						
15880013	3831985	wkdt	Q15860052						
15879519	3831989	wkdt	Q15859835						
15969699	3831989		Cliff Island						
1507599	3831990		Isla Circum						
4335228	3831990		Circum Island						
1507600	3831991		Puerto Christmas						
4335229	3831991		Christmas Harbour						
1507601	3831992		Puerto San José						
1507602	3831992		Puerto Chatham						
4335231	3831992		Chatham Harbour						
16691803	3831992	link	https://en.wikipedia.org/wiki/Chatham_Harbour,_Weddell_Island						
1507603	3831993		Río Chartres						
4335232	3831993		Chartres River						
6891108	3831993	link	https://en.wikipedia.org/wiki/Chartres_River						
16949417	3831993		Chartres						
1507604	3831995		Chartres Settlement						
4335233	3831995		Chartres						
8687786	3831995	link	https://en.wikipedia.org/wiki/Chartres%2C_Falkland_Islands						
15551998	3831995	wkdt	Q5086934						
1507605	3831997		Channel Islets						
1507606	3831997		Islotes del Canal						
1507607	3831997		Islotes Channel						
4335235	3831997		Channel Islands						
1507608	3831998		Garganta Chaffers						
4335237	3831998		Chaffers Gullet						
1507609	3831999		Roca Castle						
4335244	3831999		Castle Rock						
1507610	3832000		Puerto Carew						
4335247	3832000		Carew Harbour						
1507611	3832001		Arrecife Carcass						
4335250	3832001		Carcass Reef						
1507612	3832002		Isla Carcass						
1507613	3832002		Isla del Rosario						
4335251	3832002		Carcass Island						
7138870	3832002	link	https://en.wikipedia.org/wiki/Carcass_Island						
1507614	3832003		Morro Calm						
4335255	3832003		Calm Head						
7494414	3832003	link	https://en.wikipedia.org/wiki/Calm_Head						
1507615	3832004		Bahía San Francisco de Paula						
1507616	3832004		Bahía Byron						
1507617	3832004		Seno Byron						
4335257	3832004		Byron Sound						
7163545	3832004	link	https://en.wikipedia.org/wiki/Byron_Sound						
15723691	3832005	wkdt	Q24571774						
15969700	3832005		Byron Heights						
16205814	3832005	link	https://en.wikipedia.org/wiki/Byron_Heights						
15429378	3832006	wkdt	Q24571773						
15969701	3832006		Button Islet						
1507618	3832007		Isla Burnt						
4335262	3832007		Burnt Island						
15440452	3832007	wkdt	Q24571772						
1507619	3832008		Puerto Burnt						
4335263	3832008		Burnt Harbour						
1507620	3832009		Río Bull						
4335265	3832009		Bull River						
16949418	3832009		Bull						
1507621	3832010		Punta Brown						
4335269	3832010		Brown Point						
1507622	3832011		Bahía Brown						
4335270	3832011		Brown Harbour						
1507623	3832014		Puerto Brett						
4335272	3832014		Brett Harbour						
1507624	3832015		Punta Peña						
4335274	3832015		Boulder Point						
1507625	3832016		Punta Escarpada						
1507626	3832016		Punta Bold						
4335280	3832016		Bold Point						
1507627	3832017		Punta Escarpada						
4335281	3832017		Bold Point						
1507628	3832020		Roca Negra						
4335290	3832020		Black Rock						
1507629	3832021		Isla Bird						
1507630	3832021		Isla Pájaro						
4335293	3832021		Bird Island						
6889813	3832021	link	https://en.wikipedia.org/wiki/Bird_Island%2C_Falkland_Islands						
1507631	3832022		Islas Bense						
4335296	3832022		Bense Islands						
1507632	3832023		Puerto Bense						
4335297	3832023		Bense Harbour						
1507633	3832024		Isla Beaver						
1507634	3832024		Isla San Rafael						
2987901	3832024	link	https://en.wikipedia.org/wiki/Beaver_Island%2C_Falkland_Islands						
4335299	3832024		Beaver Island						
1507635	3832026		Puerto Beaver						
4335300	3832026		Beaver Harbour						
1507636	3832027		Bahía de la Plate						
4335301	3832027		Beaver Bay						
1507637	3832028		Monte Beaufort						
4335302	3832028		Mount Beaufort						
1507638	3832029		Punta Beacon						
4335304	3832029		Beacon Point						
16163070	3832030	link	https://en.wikipedia.org/wiki/Barclay_Island						
16212265	3832030		Barclay Island						
1507639	3832031		Rada Bald						
4335310	3832031		Bald Road						
1507640	3832032		Isla Bald						
1507641	3832032		Isla de la Baliza						
4335311	3832032		Bald Island						
1507642	3832033		Rada Arch						
4335316	3832033		Arch Road						
1507643	3832034		Islas Arch						
1507644	3832034		Islotes Franceses						
4335317	3832034		Arch Islands						
8689574	3832034	link	https://en.wikipedia.org/wiki/Arch_Islands						
1507645	3832035		Ensenada Antony						
1507646	3832035		Antony Creek						
4335319	3832035		Anthony Creek						
1507647	3832036		Entrada Anchor						
4335320	3832036		Anchor Inlet						
1507648	3832037		Roca Albemarle						
4335321	3832037		Albemarle Rock						
1507649	3832038		Puerto Albermarle						
4335322	3832038		Albemarle Harbour						
1507650	3832039		Puerto Albemarle						
1507651	3832039		Bahía Santa Eufemia						
4335323	3832039		Port Albemarle						
11288681	3832039	link	https://en.wikipedia.org/wiki/Port_Albemarle						
16157635	3949790	link	https://en.wikipedia.org/wiki/Weddell_Settlement						
16216536	3949790		Weddell Settlement						
15637988	3965421	wkdt	Q24571738						
16015532	3965421		Boulder Point Hill						
15577894	3965422	wkdt	Q24571737						
16015533	3965422		Rookery Island						
15326239	3965427	wkdt	Q24571732						
16015555	3965427		Chatham Hill						
15373666	3965434	wkdt	Q24571725						
16015567	3965434		Signboard Hill						
6893547	3965444	link	https://en.wikipedia.org/wiki/Lake_Sulivan						
6926274	3965444		Lake Sulivan						
6895715	3965449	link	https://en.wikipedia.org/wiki/Mount_Emery						
6926275	3965449		Mount Emery						
15613878	3965450	wkdt	Q24571713						
16015583	3965450		Fox Bay Mount						
15522585	3965455	wkdt	Q24571708						
16015589	3965455		Little Mollyhawk						
15635239	3965456	wkdt	Q24571707						
16015590	3965456		The Big Mollyhawk						
15871317	3965544	wkdt	Q24571705						
16015986	3965544		Turkey Island						
15393548	3965553	wkdt	Q24571697						
16015989	3965553		Rocky Ridge Hill						
5902553	3965575	link	https://en.wikipedia.org/wiki/Storm_Mountain%2C_Falkland_Islands						
6177326	3965575		Storm Mount						
15526985	3965576	wkdt	Q24571680						
16015990	3965576		Little Bense						
1883253	6296679	icao	EGYP						
1888391	6296679	iata	MPN						
5763423	6296679	en	RAF Mount Pleasant						
5763537	6296679	en	Mount Pleasent Complex						
5763538	6296679	en	MPA						
5763539	6296679	link	https://en.wikipedia.org/wiki/RAF_Mount_Pleasant						
10724845	6296679	en	Mount Pleasant Airport	1					
15724367	6296679	wkdt	Q2071294						
1887423	6300726	icao	SFAL						
1889887	6300726	iata	PSY						
5763536	6300726	link	https://en.wikipedia.org/wiki/Port_Stanley_Airport						
15678421	6300726	wkdt	Q1432457						
13499534	8985767	en	Pembroke Lighthouse						
