756183	1558749		Sonserol						
756184	1558749		Sonsoru-shotō						
756185	1558749		Saint Andrew Islands						
756186	1558749		Saint Andrew						
756187	1558749		Sonsoru To						
756188	1558749		Songosor-Inseln						
3600103	1558749		Sonsorol Islands						
5810488	1558749	sov	Dongosaro	1					
756442	1558892		Ngeruangel						
756443	1558892		Ngaruangl Island						
756444	1558892		Ngerwangel						
756445	1558892		Ngaruang						
3600105	1558892		Ngaruangl						
756956	1559316		Unkerseri						
756957	1559316		Unkaseri						
756958	1559316		Unkaseri Island						
3600110	1559316		Ngkesill						
5894470	1559316		Ngeruktabel Islands						
15897233	1559316	wkdt	Q35309198						
756960	1559318		Ked-ra-tund						
756961	1559318		Mount Tuns						
756962	1559318		Tsunsu Mountain						
756963	1559318		Tsunsu-San						
3600112	1559318		Mount Tsunsu						
15268265	1559318	wkdt	Q31206163						
1059	1559323		Sansoral						
756974	1559323		Banna To						
756975	1559323		Sanserol						
756976	1559323		Banna						
756977	1559323		Sonesor						
756978	1559323	sov	Dongosaro	1					
756979	1559323		Sonrol						
756980	1559323		Sonserol						
756981	1559323		Sonsorol Islands						
756982	1559323		Sonsorol Island						
756983	1559323		Sonsol						
756984	1559323		Sonseron						
756985	1559323		Sonsoru To						
756986	1559323		Saint André						
756987	1559323		Saint Andrew						
756988	1559323		Soisol						
756989	1559323		Sonsonrrol						
756990	1559323		Sonzerol						
756991	1559323		Puru						
756992	1559323		Sonzeral						
756993	1559323		Songosor						
756994	1559323		Sontserol						
756995	1559323		Sonsoral						
756996	1559323		Souserol						
756997	1559323		San Andres						
756998	1559323		Songosor-Inseln						
3600116	1559323	pau	Sonsorol	1					
16636050	1559323	link	https://en.wikipedia.org/wiki/Sonsorol						
756999	1559324		Sanryo-To						
757000	1559324		Sanryo						
757001	1559324		Sanryo Island						
3600117	1559324		Ngedesakr						
15323020	1559324	wkdt	Q35308845						
757013	1559335		Gabatouru River						
757014	1559335		Ngkebeduul						
3600123	1559335		Nkebeduul						
757015	1559336		Schoman Harbor						
757016	1559336		Rock Islands						
757017	1559336		Schonian Harbor						
757018	1559336		Olobetapel Lagoon						
3600124	1559336		Sebeseb						
5881652	1559338		Jebukol						
5894455	1559340		Ulong Islands						
14914189	1559340	wkdt	Q31206173						
757023	1559344		West Entrance Nishi						
757024	1559344		West Entrance						
757025	1559344		Tehelengerael						
757026	1559344		Nishi						
757027	1559344		Telepedele Ngerael						
3600126	1559344		Telebadel ra Ngerael						
757034	1559347		Kesill Island						
757035	1559347		Ngkesiil Island						
757036	1559347		Geseru-tō						
757037	1559347		Ngkesiil						
757038	1559347		Geseru						
757039	1559347		Ngethil						
757040	1559347		Ng Kesill Island						
757041	1559347		Ngethil Island						
3600129	1559347		Ngkesill						
15673875	1559347	wkdt	Q35309184						
16202848	1559347	link	https://en.wikipedia.org/wiki/Ngkesill						
757042	1559350		Arumuzu						
757043	1559350		Ngarmid						
757044	1559350		Armid						
757045	1559350		Arumizu						
3600130	1559350		Ngermid						
5834511	1559351		Kloulklubed - US post-WW2 built						
5891499	1559352		Mecherchar Islands						
757046	1559353		Ngargersiul						
3600131	1559353		Dngeronger						
5891495	1559356		Rock Islands						
757047	1559357		Nordwest Riff						
757048	1559357		Hokusei-shō						
757049	1559357		Northwest Reef						
757050	1559357		Look-out Islands						
757051	1559357		Garairu						
757052	1559357		Good Look-out Islands						
757053	1559357		Good Islands						
757054	1559357		Lookout Island						
757055	1559357		Good Island						
757056	1559357		Good						
3600132	1559357		Ngerael						
757057	1559358		Ngell-Einfahrt						
757058	1559358		Geru-suidō						
757059	1559358		Ngell Durchfahrt						
757060	1559358		Toachel Ngel						
757061	1559358		Toagel Ngel						
757062	1559358		Ngel-Einfahrt						
757063	1559358		Ngell Channel						
3600133	1559358		Toachel ra Ngel						
757064	1559362		Nggasagang						
757065	1559362		Amarakarakkuru						
757066	1559362		Nghesehang						
757067	1559362		Aramarakarakkuru						
757068	1559362		Gaskan						
757069	1559362		Ngaragebukl						
757070	1559362		Ngasachang						
757071	1559362		Aramarakarakuru						
757072	1559362		Gasakan						
3600134	1559362		Ngchesechang						
15737319	1559367	wkdt	Q31206181						
757094	1559373		Beliliou						
757095	1559373		Peleliu						
3600136	1559373		Peleliu Airport						
5827498	1559373	faac	C23						
757097	1559386		Ngarapalas						
757098	1559386		Garaparasu To						
757099	1559386		Ngarapalas Island						
757100	1559386		Carapellas						
757101	1559386		Caraparasu To						
757102	1559386		Garabarasu-tō						
757103	1559386		Ngerbelas						
3600138	1559386		Ngerebelas						
15749560	1559386	wkdt	Q35308923						
5894448	1559389		Eil Malk						
15469300	1559389	wkdt	Q31206190						
757116	1559397		Ngadert Island						
757117	1559397		Ngadert						
3600143	1559397		Ngedert						
15222188	1559397	wkdt	Q35308831						
757122	1559400		Ngarbaged-rengul						
757123	1559400		Neustadt						
757124	1559400		Arubaketsu						
757125	1559400		Ngarbaged						
757126	1559400		Arabaketsu						
757127	1559400		Ngarbeched						
3600146	1559400		Ngerbeched						
757128	1559402		Ngemay						
757129	1559402		Ngemai						
757130	1559402		Ngamai-Bucht						
757131	1559402		Ngamai-Bueht						
757132	1559402		Namai-wan						
3600147	1559402		Namai Bay						
5891496	1559405		Mecheerchar Islands						
757143	1559407		Warren Hastings						
757144	1559407		Pulo						
757145	1559407		Paolo						
757146	1559407	sov	Melieli	1					
757147	1559407		Warren Hastings Island						
757148	1559407		Bur						
757149	1559407		Palolo						
757150	1559407		Meriel						
757151	1559407		Pulo Mariere						
757152	1559407		Merieres						
757153	1559407		Isle du Courant						
757154	1559407		Paulo Mariere						
757155	1559407		Merir Island						
757156	1559407		Meril						
757157	1559407		Pulo Mariera						
757158	1559407		Pulo Marriere						
757159	1559407		Pulo Maria						
757160	1559407		Pulo Marier						
757161	1559407		Meliel						
757162	1559407		Mariere Islands						
757163	1559407		Current Island						
757164	1559407		Meriru-shō						
757165	1559407		Meriru To						
3600151	1559407	pau	Merir	1					
7165779	1559407	link	https://en.wikipedia.org/wiki/Merir						
757166	1559408		Oruregiru						
3600152	1559408		Desomel						
15471363	1559408	wkdt	Q31206199						
5894495	1559411		Ngeruktabel Islands						
16635453	1559411	link	https://en.wikipedia.org/wiki/Chomedokl						
757171	1559414		Ngartabepeab Lagune						
757172	1559414		Komebail Lagoon						
757173	1559414		Koror Harbor						
3600155	1559414		Ngertachebeab						
5827511	1559414		ORIENTAL WW2						
757174	1559415		Koror Hafen						
3600156	1559415		Koror Harbor						
757175	1559416		Korer Road						
757176	1559416		Gadaraku Hakuchi						
757177	1559416		Gadaraku						
3600157	1559416		Koror Road						
757178	1559417		Korak Island						
757179	1559417		Ngarekedlukl						
757180	1559417		Gorrak Island						
757181	1559417		Arukodorokkuru Island						
757182	1559417		Arukodorokkuru-tō						
3600158	1559417		Korak						
757184	1559419		Goikul						
757185	1559419		Oigul						
757186	1559419		Koygul						
757187	1559419		Koiguru						
3600160	1559419		Oikull						
757191	1559424		Kossol Passage						
757192	1559424		Kassel Roads						
757193	1559424		Kawassak						
757194	1559424		Garaseg						
757195	1559424		Kanal von Kossol						
757196	1559424		Kossol Durchfahrt						
757197	1559424		Kossoi Passage						
757198	1559424		Kosusoru-suido						
3600162	1559424		Toachel Ngkesol						
757199	1559425		Klouleheuhel						
757200	1559425		East Entrance						
757201	1559425		Higashi						
757202	1559425		Kossol Passage						
757203	1559425		Higashi-Suido						
3600163	1559425		Kloul Euchel						
757214	1559430		Songel A Lise Lagoon						
757215	1559430		Iwayama Bay						
757216	1559430		Arumizu Bay						
757217	1559430		Iwayama-wan						
757218	1559430		Arumizu Wan						
3600166	1559430		Ngerikuul						
757220	1559432		Minato Bridge						
757221	1559432		Minatobasi						
3600168	1559432		Minato Bashi						
757222	1559433		Ika						
757223	1559433		Ika Island						
757224	1559433		Ika-To						
3600169	1559433		Ngetkuml						
15412768	1559433	wkdt	Q35309143						
757225	1559434		Bital Rirs						
3600170	1559434		Rirs Bital						
5894468	1559434		Ngeruktabel Islands						
15348828	1559434	wkdt	Q35315756						
757229	1559438		Ngerumetoel						
757230	1559438		Ngatku Mer						
757231	1559438		Hiruge-To						
757232	1559438		Hiruge						
757233	1559438		Hiruge Island						
757234	1559438		Ngathu Mer						
3600173	1559438		Ngerumetochel						
15553236	1559438	wkdt	Q35309078						
757238	1559440		Helen Islet						
757239	1559440	tox	Hotsarihie	1					
757240	1559440		Heren-Shō						
757242	1559440		Hoten Rif						
757243	1559440		Heren To						
3600175	1559440		Helen Island						
5810433	1559444		Tobi Islanders Village						
5813072	1559444		Eang						
5813073	1559444		Sonsorol Islanders Village						
757251	1559446		Koror City						
757252	1559446		Korōru						
757253	1559446		Koror village						
757254	1559446		Goreor						
757255	1559446		Koreor						
757256	1559446		Koror town						
757257	1559446		Goror						
8066042	1559446	link	https://en.wikipedia.org/wiki/Koror						
8066393	1559446	iata	ROR						
9710072	1559446	de	Koror	1					
9710073	1559446	en	Koror	1					
9710074	1559446	fr	Koror	1					
13358992	1559446	ko	코로르 주						
13359002	1559446	ko	코로르	1					
13796073	1559446	unlc	PWROR						
15716856	1559446	wkdt	Q527748						
15613485	1559451	wkdt	Q31206209						
757260	1559452		Garutoeru-Sho						
757261	1559452		Ngertoel						
757262	1559452		Garutoeru Reef						
757263	1559452		Ngertmel Reef						
3600179	1559452		Ngertoell						
757283	1559460		Gogeal Ngaream						
757284	1559460		Garayamu						
757285	1559460		Garayamu-To						
757286	1559460		Garayamu Island						
3600183	1559460		Ngeream						
757293	1559462		Daimechesengel						
757294	1559462		Garudomau-Wan						
757295	1559462		Garasumao						
757296	1559462		Garudoman wan						
757297	1559462		Ngarsmau-Bucht						
757298	1559462		Ngerdmau Bay						
3600184	1559462		Ngardmau Bay						
5881622	1559463		Bkul a Tmederial						
757300	1559469		Ngerhebal						
757301	1559469		Man-of-War Island						
757302	1559469		Ngaregabel Island						
757303	1559469		Ngaragebal						
757304	1559469		Ngarebagal Island						
757305	1559469		Gunkan Island						
757306	1559469		Garakabaru-tō						
757307	1559469		Ngaregabal Island						
757308	1559469		Ngaregabal						
3600186	1559469		Ngerchebal						
15317094	1559469	wkdt	Q35308910						
757309	1559470		Garagon-tō						
757310	1559470		Ngerhong						
757311	1559470		Ngeregong						
757312	1559470		Ngeregong Island						
757313	1559470		Ngerchong						
3600187	1559470		Ngerechong						
5894493	1559471		Ngeruktabel Island						
15532391	1559471	wkdt	Q31206218						
757314	1559473		Garakayo To						
757315	1559473		Garyo-To						
757316	1559473		Gamirisshu						
757317	1559473		Gamirisshu-To						
757318	1559473		Ngemelis Islands						
757319	1559473		Ngemelis Island						
757320	1559473		Ngemelis-Inseln						
757321	1559473		Ngemelis Group						
757322	1559473		Gamirisshu-shotō						
757323	1559473		Olobetapel-Inseln						
3600188	1559473		Ngemlis						
5891460	1559473		Rock Islands - Ngemlis						
757327	1559475		Galumuleaka						
757328	1559475		Ngeremeleg						
757329	1559475		Garumureaka						
3600190	1559475		Ngermelech						
15888490	1559477	wkdt	Q31206228						
1060	1559479		Bana						
757330	1559479		Fanah						
757331	1559479		Banna Island						
757332	1559479	pau	Fanna	1					
757333	1559479		Fana Island						
3600191	1559479	sov	Fana	1					
757334	1559480		Emieangl						
757335	1559480		Kamiyangaur						
757336	1559480		Kamiyangaru						
757337	1559480		Komliangl						
757338	1559480		Gamliangel						
3600192	1559480		Ngchemiangel						
757339	1559482		Eholl						
757340	1559482		Gegol						
757341	1559482		Eeyakoru						
757342	1559482		Chechol						
757343	1559482		Eeyahoru						
757344	1559482		Euakor						
3600193	1559482		Echol						
15710950	1559483	wkdt	Q31206237						
757345	1559486		Cormoran Reef						
757346	1559486		Gabaru Reef						
757347	1559486		Corumoran Sho						
757348	1559486		Gabaru-shō						
757349	1559486		Ngabard						
757350	1559486		Gobaru Sheet						
757351	1559486		Cormoran-Riff						
757352	1559486		Ngalard						
757353	1559486		Korumoran-shō						
3600194	1559486		Ngebard						
757354	1559487	en	Kayangle Islands						
757355	1559487		Queangal						
757356	1559487		Moore Island						
757357	1559487		Kayangle						
757358	1559487		Chiangel						
757359	1559487		Kadjangel						
757360	1559487		Moore Isle						
757361	1559487		Kajangle Inseln						
757362	1559487		Kajanguru Shoto						
757363	1559487		Kajangle Islands						
757364	1559487		Gajangeru To						
757365	1559487		Kadjangle						
757366	1559487		Kajangle						
757367	1559487		Kajanguru-tō						
757368	1559487		Kayangel						
757369	1559487		Kajamble						
757370	1559487		Ngajangel						
757371	1559487		Kreiangel Inseln						
757372	1559487		Ngeiangl						
757373	1559487		Kyangle						
757374	1559487		Kianguel						
757375	1559487		Kayangel Islets						
757376	1559487		Kyangle Isles						
757377	1559487		Nggeiangel						
757378	1559487		Kazanguru To						
3600195	1559487	pau	Ngcheangel						
757379	1559488		Garikiai						
757380	1559488		Karikiai						
757382	1559488		Goleguy						
757383	1559488		Ngarekai						
757384	1559488		Ngarekeai						
757385	1559488		Ngerkeyai						
757386	1559488		Ngergeai						
757387	1559488		Karikari						
757388	1559488		Nagarekeai						
757389	1559488		Galegui						
757390	1559488		Garadai						
3600196	1559488		Ngerkeai						
757391	1559489		Gorak						
757392	1559489		Goraku-tō						
757393	1559489		Goaku To						
757394	1559489		Gorak Island						
757395	1559489		Korack						
757396	1559489		Ngerebelas						
3600197	1559489		Orak						
757397	1559490		Lord North Island						
757398	1559490		Tokobei Island						
757399	1559490		Nevil Island						
757400	1559490		Togobei						
757401	1559490		Kadogubi						
757402	1559490		Tokobe						
757403	1559490		Neville Island						
757404	1559490		Peaked Hill						
757405	1559490		Kodokopuei						
757406	1559490		Tokobei-tō						
757407	1559490		Cadocapuee						
757408	1559490		Peaked Island						
757409	1559490		Kodogubi						
757410	1559490		San Carlos						
757411	1559490		Cadopuei						
757412	1559490		Tobi Island						
757413	1559490		Kodgubi Island						
757414	1559490		Codocopuey						
757415	1559490		Codopuei						
757416	1559490		Hatobei						
757417	1559490		Evening						
757418	1559490	tox	Hatohobei	1					
757419	1559490		Johnstone						
3600198	1559490		Tobi						
5810478	1559490	pau	Tochobei						
7170458	1559490	link	https://en.wikipedia.org/wiki/Tobi_%28island%29						
757420	1559491		Bobasang Harbor						
3600199	1559491		Kobasang Harbor						
757421	1559493		Rebaikesil						
757422	1559493		Congotekatel						
757423	1559493		Beap Inseln						
757424	1559493		Chongetekakl						
757425	1559493		Ororumakku-tō						
757426	1559493		Gongotekatel						
757427	1559493		Ororumakku						
757428	1559493		Ororumakku Island						
3600200	1559493		Ongetkatel						
5894467	1559493		Ngeruktabel Islands						
8071658	1559493	link	https://en.wikipedia.org/wiki/Ongetkatel						
757429	1559495		a Ugelpalu-Riff						
757430	1559495		Augulpelu Riff						
757431	1559495		Augulpelu Reef						
757432	1559495		Angulpelu Reef						
757433	1559495		a Ugalpelu						
757434	1559495		a Ugelpelu						
757435	1559495		Auguruperyū-shō						
3600201	1559495		Uchelbeluu						
757437	1559498		Erengel Reef						
757438	1559498		Arutoerruru Reef						
757439	1559498		Arutoeruru Reef						
757440	1559498		Cherengoll						
757441	1559498		Gerengol Reef						
757442	1559498		Arutoerruru-Sho						
3600203	1559498		Erengoll						
757449	1559500		Rmegethu						
757450	1559500		Arumukudeu-tō						
757451	1559500		Rmegethu Island						
757452	1559500		Rmegetbu						
3600205	1559500		Ngeremekediu						
15473096	1559500	wkdt	Q35308937						
757466	1559507		Togel Mlungui						
757467	1559507		Ngeremlengui’s Channel						
757468	1559507		West Passage						
757469	1559507		Nishi-suidō						
757470	1559507		Toagel Mlungui Passage						
757471	1559507		Aremanalungi Passage						
757472	1559507		Towahel Mlenguy						
757473	1559507		Toachel Mlungui						
757475	1559507		Nismi-Suidō						
757476	1559507		Toagel Mlungui-Einlass						
757477	1559507		West Channel						
757478	1559507		Toagel Mlungui						
757479	1559507		Toagel Mlungui Channel						
3600211	1559507		Toachel Mlengui						
757488	1559510		Garreru-hakuchi						
757489	1559510		Arangel Fahrwassers						
757490	1559510		Garreru Anchorage						
3600213	1559510		Arangel Channel						
1061	1559511		Pedul						
757491	1559511		Ngarekobasang						
757492	1559511		Arrakapasang						
757493	1559511		Arakabesan-tō						
757494	1559511		Naracabersu						
757495	1559511		Arakabesan Island						
757496	1559511		Ngarekobasanga						
757497	1559511		Arakabesan						
757498	1559511		Naracobersa Island						
757499	1559511		Arakbesan Island						
3600214	1559511		Ngerekebesang						
5827505	1559511		EFFICIENT WW2						
7200294	1559511	link	https://en.wikipedia.org/wiki/Ngerekebesang_Island						
757508	1559513		Arekamae						
757509	1559513		Ngarekamais						
757510	1559513		Ngaregamai						
757511	1559513		Ngarchemai						
757512	1559513		Aragamaye						
757513	1559513		Ngerechemai						
757514	1559513		Aragamae						
3600216	1559513		Ngerchemai						
757515	1559514		Wul						
757516	1559514		Wull						
757517	1559514		Anna Island						
757518	1559514		Puru-tō						
757520	1559514		Pulo Ana						
757521	1559514		Anna Islands						
757522	1559514		Puru Anna						
757524	1559514		Pulo Ann						
757525	1559514		Palo Anna Island						
757526	1559514		Puru-Anna-To						
757527	1559514		Pulo Anne						
757529	1559514		Pulo Anna Island						
757530	1559514	sov	Puro	1					
757531	1559514		Pur						
757532	1559514		San Andreas						
757533	1559514		Pul						
757534	1559514		Poulo						
3600217	1559514	pau	Pulo Anna	1					
5813076	1559514		LAPICIDE WW2						
757535	1559515		Ankosu Point						
757536	1559515		Ankosu						
3600218	1559515		Bkul a Ngchus						
5894492	1559515		Ngeruktabel Island						
15636564	1559515	wkdt	Q31916827						
757540	1559518		Malackan						
757541	1559518		Marakau Harbor						
757542	1559518		Malakal Harbor						
757543	1559518		Malagal-Hafen						
757544	1559518		Amallakell Harbour						
757545	1559518		Amalaquel						
757546	1559518		Marakaru						
757547	1559518		Malkal Harbor						
757548	1559518		Palau Harbor						
757549	1559518		Malacal						
757550	1559518		Malakal-Hafen						
3600221	1559518		Malakal						
16710564	1559518	unlc	PWROR						
757551	1559519		Ayas Reef						
757552	1559519		Aiyasu Reef						
757553	1559519		Ayas						
3600222	1559519		Alyasu Reef						
757554	1559520		Urutoi-tō						
757555	1559520		Ingurutoi Island						
757556	1559520		Ngurutoi						
757557	1559520		Altoi Island						
757558	1559520		Nguritoi						
757559	1559520		Ngurutoi Island						
3600223	1559520		Ngerutoi						
15651538	1559520	wkdt	Q35308884						
757560	1559521		Gorakibad-Einfahrt						
757561	1559521		Altngot Passage						
757562	1559521		Gorakblbad-Durchfahrt						
757563	1559521		Altngot-Durchfahrt						
757564	1559521		Gorakbald Passage						
757565	1559521		Altngot Einfahrt						
757566	1559521		Gorokblbad Durchfahrt						
757567	1559521		Ngatagalabad-Einfahrt						
3600224	1559521		Goraklbad Passage						
757596	1559526		Aiokako-suidō						
757597	1559526		a Ivokakou-Einlass						
757598	1559526		Aiokako Passage						
757599	1559526		Aiwokako Passage						
757600	1559526		Aiwokako Durchfahrt						
757601	1559526		A Ivokakou-Pass						
3600228	1559526		Iuekakw						
757602	1559527		Kamori Island						
757603	1559527		Kamori						
757604	1559527		Ilut Pebul						
757605	1559527		Kamori-To						
757606	1559527		Ailukpebul Island						
757607	1559527		a Ilukpebul						
3600229	1559527		Bukrrairong						
15476141	1559527	wkdt	Q35379085						
757608	1559528		Makarakaru-tō						
757609	1559528		Eil Malik						
757610	1559528		Eil Malk Island						
757611	1559528		Ametoti						
757612	1559528		Isla Iarachong						
757613	1559528		Eil Malk						
757614	1559528		Errakong						
757615	1559528		A Ilmalk Island						
757616	1559528		Ailmalk						
757617	1559528		Amototi						
757618	1559528		a Ilimalk						
757619	1559528		Irakong						
757620	1559528		Amototoi						
757621	1559528		Makarakara To						
757622	1559528		Amototi Island						
3600230	1559528		Mecherchar						
5827508	1559528		HANDKERCHIEF WW2						
5891482	1559528		Rock Islands						
757623	1559529		Ngeil						
757624	1559529		Agiil Island						
757626	1559529		Agiiru Island						
757627	1559529		Ngiil Point						
757628	1559529		Ngeil Island						
757629	1559529		Agiiru						
3600231	1559529		Bkul-ngeiil						
3600232	1559529		Bkul Ngiil						
757630	1559530		Katterueru Mountain						
757631	1559530		a Gatiroir						
757632	1559530		Katteruueru-San						
757633	1559530		Mount Katteluel						
757634	1559530		Ngaruak Mountain						
757635	1559530		Mount Luisualmonogui						
757636	1559530		Katterueru-San						
3600233	1559530		Ngeruach						
15217705	1559530	wkdt	Q31206245						
757637	1559531		Galeos						
757638	1559531		Aiyon Mountain						
757639	1559531		Mount Aiyon						
757640	1559531		Mount Ngedeh						
757641	1559531		Agade						
757642	1559531		Mount Agade						
3600234	1559531		Cheleos						
15445329	1559531	wkdt	Q31206253						
757643	1559532		Ngimis						
757644	1559532		Ngedbang						
757645	1559532		Gasupan						
757646	1559532		Adpang						
757647	1559532		Ngetpang						
757648	1559532		Ngatpan						
757649	1559532		Ngatpang		1				
757650	1559532		Ngimes						
757651	1559532		Ngatpang State						
757652	1559532		Emis						
3600235	1559532		State of Ngatpang						
5463349	1559532	link	https://en.wikipedia.org/wiki/Ngatpang						
14914156	1559532	wkdt	Q430385						
757653	1559533		Aburashokoru To						
757654	1559533		Attakadokoru-tō						
757655	1559533		Aulong						
757656	1559533		Apurashokoru-tō						
757657	1559533		Attakadokoru Island						
757658	1559533		Apurashokoru Island						
757659	1559533		Aulong Island						
757660	1559533		a Ulong						
757661	1559533		Apurashekoru Island						
757662	1559533		Orulong						
757663	1559533		Rattakadokoru Island						
3600236	1559533		Ulong						
5894450	1559533		Rock Islands						
5905535	1559533		Oroolong						
16636200	1559533	link	https://en.wikipedia.org/wiki/Ulong_Island						
757664	1559534		Aakip						
757665	1559534		Gatkip						
757666	1559534		Ngetkip						
757667	1559534		Gadkip						
757668	1559534		Itkib						
757669	1559534		Ngetgip						
757670	1559534		Gakkibu						
757671	1559534		Atkiíp						
757672	1559534		Ngtkíp						
757673	1559534		Ngatkip						
757674	1559534		Gakip						
757675	1559534		Adkip						
3600237	1559534		Ngetkib						
757678	1559537		Urdmau						
3600239	1559537		Urdmang						
16184780	1559537	link	https://en.wikipedia.org/wiki/Urdmang						
757683	1559543		A Ulimang						
757684	1559543		Uliman						
757685	1559543		Galap						
7050067	1559543	link	https://en.wikipedia.org/wiki/Ulimang						
757686	1559544		Oropushakari-tō						
757687	1559544		Ulupsael						
757688	1559544		Auluptagel Island						
757689	1559544		Ulupsagel						
757690	1559544		Aurapushekaru						
757691	1559544		Ulapsagel						
757692	1559544		Auluptagel						
757693	1559544		Oluksakel						
757694	1559544		Oropushhakari-To						
757695	1559544		Oropusharakaru To						
757696	1559544		Aurapushekaru Island						
757697	1559544		a Ulapsagel						
757698	1559544		Chulebsechel						
3600242	1559544		Ulebsechel						
5827506	1559544		FORCEFUL WW2						
757705	1559548		Kwannon						
757706	1559548		Ugeliungs Island						
757707	1559548		Kwannon Island						
757708	1559548		Kwannon-To						
3600246	1559548		Ucheliungs						
757709	1559550		Mount Tuns						
3600247	1559550		Tunt						
15894595	1559550	wkdt	Q31206263						
757712	1559552		Kisano						
757713	1559552		Byobu						
757714	1559552		Byobu Island						
757715	1559552		Byobu-To						
3600249	1559552		Toirius						
15577719	1559552	wkdt	Q35352257						
757722	1559555		Adorius						
757723	1559555		Tlutkarnguis						
757724	1559555		Telutkarungutes						
3600252	1559555		Tlutkaraguis						
5894479	1559555		Ngeruktabel Islands						
757725	1559556		Malakal Harbor						
757726	1559556		Teongel Bay						
3600253	1559556		Teongel						
757727	1559557		Namako Island						
757728	1559557		Namako-To						
757729	1559557		Namako						
757730	1559557		Tengetcheyangl						
3600254	1559557		Tengetcheyangel						
15685832	1559557	wkdt	Q35348422						
757731	1559559		Mount Arumii						
3600255	1559559		Telong						
757732	1559560		Scelebsprung Islet						
3600256	1559560		Telkakl						
14880292	1559560	wkdt	Q35348371						
757738	1559564		Metiul Einfahrt						
757739	1559564		Toachel Ngersuul						
3600260	1559564		Toachel Suul						
757740	1559565		Sngelokl Bay						
757741	1559565		Barnum Bay						
3600261	1559565		Sngelokl						
757742	1559566		Sengall						
757743	1559566		Ngulokl						
3600262	1559566		Sngall						
15600235	1559566	wkdt	Q31206282						
757744	1559567		Amiangal Mountains						
757746	1559567		Limestone Ridge						
3600263	1559567		Rois ra Sang						
14912121	1559567	wkdt	Q31206290						
757747	1559568		Rurid Island						
3600264	1559568		Ruriid						
15384106	1559568	wkdt	Q41799088						
757748	1559569		Rois Kobasang						
3600265	1559569		Roiskebesang						
15768130	1559569	wkdt	Q31206300						
757769	1559575		Ngaremediu Point						
757770	1559575		Ngaremediu						
757771	1559575		Kap Ngaremediu						
757772	1559575		Ngaremediu Head						
757773	1559575		Garamediu-hana						
757774	1559575		Pukl Ngaremediu						
757775	1559575		Pkul Ngaramediu						
757776	1559575		Pukl Ngaramediu						
757777	1559575		Ngeremdiu Point						
757778	1559575		Garamedeiu-hana						
757779	1559575		Ngaremedin Point						
757780	1559575		Ngeremdiw Point						
3600271	1559575		Rael Dil						
5894466	1559575		Ngeruktabel Island SouthEast Tip						
5881623	1559576		Bkul a Chelas						
5891478	1559577		Rock Islands						
757784	1559580		Beliliou						
757785	1559580		Peleliu Insel						
757786	1559580		Pelilu						
757787	1559580		Peleliu Islands						
757788	1559580		Peliliou						
757789	1559580		Peleliou						
757790	1559580		Pililer						
757791	1559580		Pililau						
757792	1559580		Pillilew						
757793	1559580		Pililiu						
757794	1559580		Pililju						
757795	1559580		Pililu Insel						
757796	1559580		Pililu						
757797	1559580		Pelelew						
757798	1559580		Periryū-tō						
757799	1559580		Periryu						
757800	1559580		Uler						
2935154	1559580	link	https://en.wikipedia.org/wiki/Peleliu						
3600273	1559580		Peleliu						
5827500	1559580		EARTHENWARE WW2						
757801	1559581		Punlog						
757802	1559581		Peleu						
757803	1559581		Pellew						
757804	1559581		Arrecifos						
757806	1559581		FULLCRY WW2						
757807	1559581		Groupe Pallay						
757808	1559581		Palau group						
757809	1559581		Palaoa						
757810	1559581		Pellow						
757811	1559581		Palos						
757812	1559581		Pelau-Inseln						
757813	1559581		DRAGOMAN WW2						
757814	1559581		Pelli						
757815	1559581		Palaos Islands						
757816	1559581		Pelew Group						
757817	1559581		Paulogue						
757818	1559581		Palaus						
757819	1559581		Paleu						
757820	1559581		Panlog						
757821	1559581		Fannog						
757822	1559581		Pelew Islands						
757823	1559581		Parao Syoto						
757825	1559581		Pannog						
757826	1559581		SCHOOLGIRL WW2						
757827	1559581		Pallow						
757828	1559581		Punlac						
757829	1559581		The Pallou Islands						
757830	1559581		Parao-Jima						
757831	1559581		Peeloo Islands						
757832	1559581		Parao-shotō						
757833	1559581		Pally						
757834	1559581		Palao						
757836	1559581		Pellew Inseln						
757837	1559581		Paloo						
757838	1559581		Walau						
3600274	1559581	en	Palau Islands	1					
5813061	1559581	pau	Belau	1					
5891446	1559581		The Rainbow's End						
13701196	1559581	sv	Palau Öarna	1					
1980737	1559582	fr	Palaos	1					
1980738	1559582	de	Palau	1					
1980739	1559582	en	Palau	1					
1980740	1559582	es	Palaos	1					
1980741	1559582	pl	Palau	1					
1980742	1559582	an	Palau						
1980743	1559582	bg	Палау	1					
1980744	1559582	bs	Palau	1					
1980745	1559582	ca	República de Palau						
1980746	1559582	cs	Palau	1					
1980747	1559582	da	Palau	1					
1980748	1559582	el	Παλάου	1					
1980749	1559582	eo	Palaŭo						
1980750	1559582	et	Belau	1					
1980751	1559582	eu	Palau	1					
1980752	1559582	fi	Palau	1					
1980753	1559582	frp	Palaos						
1980754	1559582	gl	Palau - Belau						
1980755	1559582	he	פלאו	1					
1980756	1559582	hr	Palau	1					
1980757	1559582	hu	Palau	1					
1980758	1559582	id	Palau	1					
1980759	1559582	ilo	Palau						
1980760	1559582	io	Palau						
1980761	1559582	is	Palá	1					
1980762	1559582	it	Palau	1					
1980763	1559582	ja	パラオ	1					
1980764	1559582	ko	팔라우	1					
1980765	1559582	kw	Palau						
1980766	1559582	la	Belavia						
1980767	1559582	lt	Palau	1					
1980768	1559582	lv	Palau	1					
1980769	1559582	ms	Palau	1					
1980770	1559582	nds	Palau						
1980771	1559582	nl	Palau	1					
1980772	1559582	nn	Palau						
1980773	1559582	no	Palau	1					
1980774	1559582	pau	Belau	1	1				
1980775	1559582	oc	Palau						
1980776	1559582	pam	Palau						
1980777	1559582	ps	پالاو						
1980778	1559582	pt	Palau	1					
1980779	1559582	ro	Palau	1					
1980780	1559582	ru	Палау	1					
1980781	1559582	se	Palau	1					
1980782	1559582	hbs	Palau						
1980783	1559582	sk	Palau	1					
1980784	1559582	sl	Palau	1					
1980785	1559582	sq	Palau	1					
1980786	1559582	sr	Палау	1					
1980787	1559582	sv	Palau	1					
1980788	1559582	th	ประเทศปาเลา						
1980789	1559582	th	สาธารณรัฐปาเลา						
1980790	1559582	tl	Palaw						
1980791	1559582	tr	Palau	1					
1980792	1559582	uk	Палау	1					
1980793	1559582	vo	Palauvuäns						
1980794	1559582	zh	帛琉						
2197517	1559582	pau	Beluu er a Belau						
2419321	1559582	am	ፓላው	1					
2419322	1559582	ar	بالاو	1					
2419323	1559582	be	Палау	1					
2419324	1559582	bn	পালাউ	1					
2419325	1559582	bo	པ་ལཽ།	1					
2419326	1559582	cy	Palau	1					
2419327	1559582	eo	Belaŭo	1					
2419328	1559582	fa	پالائو	1					
2419329	1559582	ga	Oileáin Palau	1					
2419330	1559582	hi	पलाऊ	1					
2419331	1559582	hy	Պալաու	1					
2419332	1559582	ka	პალაუ	1					
2419333	1559582	mk	Палау	1					
2419334	1559582	mt	Palau	1					
2419335	1559582	nb	Palau	1					
2419336	1559582	th	ปาเลา	1					
2419337	1559582	zh	帕劳	1					
2427748	1559582	vi	Palau	1					
5423959	1559582	link	https://en.wikipedia.org/wiki/Palau						
7090176	1559582	af	Palau	1					
7090177	1559582	ak	Palau	1					
7090178	1559582	az	Palau	1					
7090179	1559582	bm	Palawu	1					
7090180	1559582	br	Palau	1					
7090181	1559582	ee	Palau nutome	1					
7090182	1559582	ff	Palawu	1					
7090183	1559582	fo	Palau	1					
7090184	1559582	gl	Palau	1					
7090185	1559582	gu	પલાઉ	1					
7090186	1559582	ha	Palau	1					
7090187	1559582	he	פאלאו	1					
7090188	1559582	ki	Palau	1					
7090189	1559582	kl	Palau	1					
7090190	1559582	kn	ಪಲಾವು	1					
7090191	1559582	ku	Palau	1					
7090192	1559582	lg	Palawu	1					
7090193	1559582	ln	Palau	1					
7090194	1559582	lu	Palau	1					
7090195	1559582	mg	Palao	1					
7090196	1559582	ml	പലാവു	1					
7090197	1559582	mr	पलाऊ	1					
7090198	1559582	nd	Palau	1					
7090199	1559582	ne	पलाउ	1					
7090200	1559582	oc	Belau	1					
7090201	1559582	or	ପାଲାଉ	1					
7090202	1559582	rm	Palau	1					
7090203	1559582	rn	Palawu	1					
7090204	1559582	sg	Palau	1					
7090205	1559582	si	පලාවු	1					
7090206	1559582	sn	Palau	1					
7090207	1559582	so	Balaaw	1					
7090208	1559582	sw	Palau	1					
7090209	1559582	ta	பாலோ	1					
7090210	1559582	te	పాలావ్	1					
7090211	1559582	ti	ፓላው	1					
7090212	1559582	to	Palau	1					
7090213	1559582	ur	پلاؤ	1					
7090214	1559582	yo	Paalu	1					
7090215	1559582	zu	i-Palau	1					
12188653	1559582	post	96940						
16925837	1559582	zh-Hant	帛琉	1					
16930614	1559582	as	পালাউ	1					
16930615	1559582	ca	Palau	1					
16930616	1559582	ce	Палау	1					
16930617	1559582	dz	པ་ལའུ	1					
16930618	1559582	fy	Palau	1					
16930619	1559582	gd	Palabh	1					
16930620	1559582	ig	Palau	1					
16930621	1559582	jv	Palau	1					
16930622	1559582	kk	Палау	1					
16930623	1559582	km	ផៅឡូ	1					
16930624	1559582	ks	پَلاو	1					
16930625	1559582	ky	Палау	1					
16930626	1559582	lb	Palau	1					
16930627	1559582	lo	ປາລາວ	1					
16930628	1559582	mn	Палау	1					
16930629	1559582	my	ပလာအို	1					
16930630	1559582	pa	ਪਲਾਉ	1					
16930631	1559582	ps	پلاؤ	1					
16930632	1559582	qu	Palaos	1					
16930633	1559582	sd	پلائو	1					
16930634	1559582	tg	Палау	1					
16930635	1559582	tk	Palau	1					
16930636	1559582	tt	Палау	1					
16930637	1559582	ug	پالائۇ	1					
16930638	1559582	uz	Palau	1					
16930639	1559582	wo	Palaw	1					
757842	1559584		Oruregoru To						
757843	1559584		Oruregiru-To						
757844	1559584		Oruregiru Island						
757845	1559584		Oruregiru						
757846	1559584		Ngedos						
3600275	1559584		Belual A Kelat						
5891467	1559584		Ngemlis Islands						
15725403	1559584	wkdt	Q31913904						
757849	1559586		Oreor						
757850	1559586		Goror						
757851	1559586		Corror						
757852	1559586		Goreor						
757853	1559586		Kororu-tō						
757854	1559586		Corer						
757855	1559586		Korror						
757856	1559586		Korrer						
757857	1559586		Korror Island						
757858	1559586		Koreor Island						
757859	1559586		Corrora						
757860	1559586		Corra						
757861	1559586		Koror Island						
3600277	1559586		Koror						
5827504	1559586		DECOMPOSE WW2						
16635515	1559586	link	https://en.wikipedia.org/wiki/Koror						
757864	1559588		Ngardebotar						
757865	1559588		Odillsau						
757866	1559588		Odiilsau						
757867	1559588		Okoradegusu-To						
757868	1559588		Gordilsau Island						
757869	1559588		Okoradegusu Island						
757870	1559588		Orudeerusao-To						
757871	1559588		Orudeerusao Island						
757872	1559588		Kordilsau						
3600279	1559588		Ordiilsau						
757874	1559590		Orutorukkuru Island						
757875	1559590		Orakuru-To						
757876	1559590		Orakura						
757877	1559590		Orahal						
757878	1559590		Oorakur Island						
757879	1559590		Goraku						
757880	1559590		Orutorukkuru-To						
757881	1559590		Orakuru Island						
757882	1559590		Goragel Island						
757883	1559590		Orakuru						
757884	1559590		Toilkeru						
3600281	1559590		Orachel						
757901	1559593		Bloody Beach						
3600284	1559593		Mesubedumail						
757902	1559595		Besul Cape						
3600285	1559595		Omidkill						
757904	1559597		Gomologel						
757905	1559597		Komoloki Island						
757906	1559597		Komolokl Island						
757907	1559597		Komolokl						
3600287	1559597		Omelochel						
757908	1559598		Gomagang						
757909	1559598		Gomagan Reef						
757910	1559598		Komakan Reef						
757911	1559598		Ngemewangel						
757912	1559598		Gomagang Reef						
3600288	1559598		Omekang						
757927	1559603		Ngaruru Island						
757928	1559603		Olngewaol						
757929	1559603		Kongoru Island						
757930	1559603		Kongauru						
757931	1559603		Kongauru Island						
757932	1559603		Kongauru-To						
3600294	1559603		Olngeuaol						
757933	1559604		Konlei						
757934	1559604		Olei						
757935	1559604		Konrei						
3600295	1559604		Ollei						
5881651	1559604		Golei						
15408527	1559604	wkdt	Q7088287						
757936	1559605		Ckotol						
3600296	1559605		Oketol						
757943	1559608		Oimadorakoshoku Island						
757944	1559608		Oimadorakoshoku						
757945	1559608		Hoimadelehesuh						
757946	1559608		Oimadorakoshoku-To						
3600299	1559608		Oimadelchesuch						
5894487	1559608		Ngeruktabel Islands						
15261365	1559608	wkdt	Q35313872						
757947	1559609		Oirou						
757948	1559609		Oiro Island						
757949	1559609		Oirou Island						
3600300	1559609		Oilouch						
5891476	1559609		Rock Islands						
8088773	1559609	link	https://en.wikipedia.org/wiki/Oilouch						
5891491	1559610		Mecherchar Islands						
15494922	1559610	wkdt	Q35382006						
16635508	1559610	link	https://en.wikipedia.org/wiki/Chouwid						
16635509	1559610		Chouwid						
757951	1559612		Chochimer						
757952	1559612		Choimer						
3600301	1559612		Ochimer						
757953	1559613		Ngorungol Island						
757954	1559613		Ngorungor						
757955	1559613		Ngadpiseg						
3600302	1559613		Ngurungor						
15756641	1559613	wkdt	Q35309226						
757957	1559616		Geriiki River						
757958	1559616		Ngerikil River						
757959	1559616		Ngerikil						
3600304	1559616		Ngrikiil						
757960	1559617		Ngril						
757961	1559617		Chiyou						
757962	1559617		Ngriel						
3600305	1559617		Ngriil						
757963	1559618		Ngkewall						
3600306	1559618		Ngkeuall						
15454250	1559618	wkdt	Q35309212						
757964	1559619		Tenget						
757965	1559619		North Entrance Kita						
757966	1559619		Telepedelel Ngkesol						
757967	1559619		North Entrance						
757968	1559619		Kita						
757969	1559619		Telbadel era Ngkesol						
3600307	1559619		Telebadel ra Ngkesol						
757997	1559630		Sonsorol		1				
757998	1559630		State of Sonsorol						
15789525	1559630	wkdt	Q866699						
16241250	1559630	link	https://en.wikipedia.org/wiki/Sonsorol						
758000	1559632		Goraklbad Reef						
3600312	1559632		Ngetngod						
758009	1559634		Gatsumudokku						
758010	1559634		Ngatemdung						
758011	1559634		Guamudokku-tō						
758012	1559634		Madmosuk Island						
758013	1559634		Ngatmedug						
758014	1559634		Ngatmedug Island						
3600314	1559634		Ngetmeduch						
15562648	1559634	wkdt	Q35309157						
758020	1559641		Ngatbong						
758021	1559641		Galuokkur						
758022	1559641		Garuokkuru						
3600317	1559641		Ngetbong						
758023	1559642		Ngeswall						
758024	1559642		Ngeswall Island						
3600318	1559642		Ngesuall						
14880291	1559642	wkdt	Q35309117						
758033	1559645		Galauekkel						
758034	1559645		Ngarevikl						
758035	1559645		Ngeruwikl						
758036	1559645		Ngeruiki						
3600321	1559645		Ngeruikl						
758037	1559647		Angaur						
3600322	1559647		Angaur Airstrip						
5813116	1559647	faac	ANG						
5901757	1559647	link	https://en.wikipedia.org/wiki/Angaur_Airstrip						
758040	1559650		Ngurur						
758041	1559650		Gurur Island						
758042	1559650		Gororuro To						
758043	1559650		Ngurur Island						
758044	1559650		Gororu-tō						
758045	1559650		Gurer Island						
758046	1559650		Nguror Island						
3600324	1559650		Ngerur						
758047	1559651		Narumutai						
758048	1559651		Narumutai Island						
758049	1559651		Omebael						
3600325	1559651		Ngerumtoi						
15237099	1559651	wkdt	Q35309091						
758050	1559654		Garuruon						
3600326	1559654		Ngeruluobel						
758051	1559655		Gururoan						
758052	1559655		Nguruleang						
758053	1559655		Nguruloang Island						
758054	1559655		Gururoan Island						
3600327	1559655		Ngerulluang						
15209488	1559655	wkdt	Q35309065						
758055	1559656		Ngurukdapel Island						
758056	1559656		Urukthapel						
758057	1559656		Uruktapi						
758058	1559656		Urukdapel						
758059	1559656		Urucdzapel						
758060	1559656		Uruckzapel						
758061	1559656		Uruktapel Island						
758062	1559656		Uruksapel						
758063	1559656		Urukdsapel						
758064	1559656		Urukethaburu						
758065	1559656		Urukzapel						
758066	1559656		Urukthopel						
758067	1559656		Urukthapel Islands						
758068	1559656		Urukthapel Island						
758069	1559656		Urukutaburu-tō						
758070	1559656		Urukutaaburu To						
758071	1559656		Urukutapuru-To						
758072	1559656		Urukutapuru						
758073	1559656		Urckthapel						
3600328	1559656		Ngeruktabel						
5827507	1559656		GRAMMAR WW2						
5894461	1559656		Rock Islands						
758074	1559657		Ngerukuid						
758075	1559657		Ngerukeuid Wildlife Reservation Area						
758076	1559657		Ngerukewid Islands Wildlife Preserve						
3600329	1559657		Ngerukeuid Islands Wildlife Preserve						
5891469	1559657		Seventy Islands Wildlife Preserve						
758078	1559658		Arukuizu						
758079	1559658		Nishidate-To						
758082	1559658		Seventy Islands						
758083	1559658	pau	Ngerukewid						
758084	1559658		Milotk						
758085	1559658		Orukuizu Island						
758086	1559658		Orukuizu To						
758087	1559658		Nishitatsu-tō						
758088	1559658	pau	Ngerukuid						
758089	1559658		70 Islands						
3600330	1559658	pau	Ngerukeuid						
5891471	1559658		Rock Islands						
16635510	1559658	link	https://en.wikipedia.org/wiki/Ngerukewid						
16635511	1559658		Ngerukeuid						
16635512	1559658		Orukuizu						
758090	1559659		Ngarusogong						
758091	1559659		Ngerudeong Point						
758092	1559659		Kap Ngarusogong						
3600331	1559659		Ngerudechong						
15319154	1559659	wkdt	Q31206321						
758093	1559660		Ngerugelbtang Island						
758094	1559660		Ngerugelbtang						
758095	1559660		Ngeruchebtang						
758096	1559660		Ngerugelptan Island						
758097	1559660		Gorokottan-tō						
758098	1559660		Gorokottan Island						
758099	1559660		Gorokottan						
3600332	1559660		Ngeruchubtang						
14880290	1559660	wkdt	Q35309052						
758103	1559662		Garuanguru-suidō						
758104	1559662		Ngerwangel Passage						
758105	1559662		Ngaruangl Passage						
758106	1559662		Ngaruangl Durchfahrt						
758107	1559662		Ngeruangel Passage						
3600334	1559662		Euchelel Ngeruangl						
758108	1559663		Ngeruangl						
758109	1559663		Ngeruangel Reef						
758110	1559663		Good Lookout Inseln						
758111	1559663		Ngaruangel						
758112	1559663		Garuanguru-tō						
758113	1559663		Ngaruangl Atoll						
758114	1559663		Good Lookout Island						
758115	1559663		Ngerwangel Reef						
758116	1559663		Ngaruangl-Riff						
758117	1559663		Ngaruangl Island						
3600335	1559663		Ngaruangl Reef						
758118	1559664		Bkul a Kabes						
3600336	1559664		Kabes						
758120	1559667		Rael Island						
758121	1559667		Itoyori-To						
758122	1559667		Itoyori Island						
758123	1559667		Itoyori						
758124	1559667		Natumesango Island						
758125	1559667		Rael						
758126	1559667		Natumesango						
3600338	1559667		Ngertechiel						
15572211	1559667	wkdt	Q35309040						
758133	1559670		Ngarakesou						
758134	1559670		Ngarakosou						
758135	1559670		Gaiakasan						
758136	1559670		Garakasan						
758137	1559670		Ngargeso						
3600339	1559670		Ngerngesang						
758138	1559671		Ngarmoked Island						
758139	1559671		Remoked						
758140	1559671		Ngermoked						
758141	1559671		Garumokudo-tō						
758142	1559671		Karumokudo To						
3600340	1559671		Ngermoket						
758144	1559673		Ngeremlengui						
758145	1559673		Almonogui						
758146	1559673		Arumonogui						
758147	1559673		Ngaremetengel						
3600342	1559673		Ngermetengel						
5891448	1559674		Chelechui						
758151	1559678		Tagerdu						
758152	1559678		Garameyaosu-To						
758153	1559678		Gosak						
758155	1559678		Garameyaosu						
3600345	1559678		Ngermeaus						
5891487	1559678		Mecherchar Islands						
758168	1559682		Ngargersiul Island						
758169	1559682		Ngargersiul						
758170	1559682		Ngerkersiwl						
758171	1559682		Garakashūru-tō						
758172	1559682		Garakashieru To						
3600347	1559682		Ngerkersiul						
15406393	1559682	wkdt	Q35309026						
758173	1559683		Ngarekeklau						
758174	1559683		Gasarao						
758175	1559683		Kaeakakurao-To						
758176	1559683		Karākakurao-tō						
758177	1559683		Ngarekeklau Island						
3600348	1559683		Ngerkeklau						
15824197	1559683	wkdt	Q35309015						
758178	1559684		Geligal Marsh						
3600349	1559684		Ngerkall						
758179	1559685		Ngariung Island						
758180	1559685		Ngariungs						
758181	1559685		Ngariungs Island						
758182	1559685		Ngariynga Island						
758183	1559685		Arayonzet						
758184	1559685		Ngeryungs						
758185	1559685		Gariungusu-tō						
3600350	1559685		Ngeriungs						
15617689	1559685	wkdt	Q35308951						
758186	1559686		Gihmel River						
3600351	1559686		Ngerimel						
758187	1559689		Rois-Buiel Peak						
758188	1559689		Roishibuiru Mountain						
758189	1559689		Roishibuiru-San						
758190	1559689		Rois Buiel						
3600352	1559689		Ngerikoek						
15894268	1559689	wkdt	Q31206335						
758199	1559694		Minatohang						
3600355	1559694		Meketii						
758200	1559695		Ngeremediu						
758201	1559695		Ngatpang Bay						
758202	1559695		Karamado Bay						
758203	1559695		Ngeremeduu						
3600356	1559695		Ngeremduu						
5891447	1559695		Karamadoo						
758204	1559696		Towaangiil						
758205	1559696		Ngaremediu Peak						
3600357	1559696		Ngeremdiu						
758208	1559699		Arukuson River						
3600359	1559699		Ngereksong						
758211	1559701		Garakirimu-tō						
758212	1559701		Ngarklim Island						
758213	1559701		Ngarklim						
3600360	1559701		Ngereklim						
758214	1559703		Arakabesan						
3600361	1559703		Ngerekebesang						
758215	1559704		Orocur						
758216	1559704		Garukoru Island						
758217	1559704		Ngaregur Island						
758218	1559704		Urocur						
758219	1559704		Garakakurao To						
758220	1559704		Ngaregur						
758221	1559704		Garukoru To						
758222	1559704		Aruguru-tō						
3600362	1559704		Ngerechur						
758230	1559708		Ngarapelik Cape						
758231	1559708		Ngarapelik						
758232	1559708		Ngerebelik Point						
3600364	1559708		Ngerebelik						
15440393	1559708	wkdt	Q31206355						
758235	1559710		Ngerdways						
758236	1559710		Ngarduais						
758237	1559710		Nardueis Island						
758238	1559710		Nardueis						
758239	1559710		Garumetai-tō						
3600366	1559710		Ngerduais						
758245	1559712		Ngardok Lake						
758246	1559712		Ngardok River						
758247	1559712		Garumisukan Swamp						
758248	1559712		Garudokku						
758249	1559712		Garumishukan Swamp						
3600368	1559712		Ngerdok						
758250	1559713		Kartis-To						
758251	1559713		Karuchisu Island						
758252	1559713		Ngardis						
758253	1559713		Dobesang Island						
758254	1559713		Karuchisu-tō						
758255	1559713		Kobasang Island						
758256	1559713		Kartis Island						
3600369	1559713		Ngerdis						
758263	1559716		Ngarderar River						
758264	1559716		Ngarderartaog						
3600371	1559716		Ngerderar						
14924261	1559718	wkdt	Q31206364						
758265	1559719		Ngaregeu						
758266	1559719		Garakayo To						
758267	1559719		Garakayo Island						
758268	1559719		Carp Island						
758269	1559719		Ngergoi						
758270	1559719		Garakayo-tō						
3600372	1559719		Ngercheu						
16173372	1559719	link	https://en.wikipedia.org/wiki/Ngercheu						
758271	1559720		Ngiwal						
758272	1559720		Ogiwal						
3600373	1559720		Ngermechau						
5881663	1559720		Ogiwaru						
758282	1559724		Makelulu Mountain						
758283	1559724		Makeruru Mountain						
758284	1559724		Mount Ngerekelehuus						
758285	1559724		Mount Makelulu						
3600374	1559724		Ngerchelchuus						
5891386	1559724		Top of Palau State						
7504387	1559724	link	https://en.wikipedia.org/wiki/Mount_Ngerchelchuus						
758286	1559725		Ngaragabukl						
758287	1559725		Ngaragebukl						
758288	1559725		Ngaragalbukl Rock						
3600375	1559725		Ngerchebukl						
758289	1559727		Ngargol-Insel						
758290	1559727		Ngargol Island						
758291	1559727		Ngargol						
758292	1559727		Garangoru-tō						
3600376	1559727		Ngerchaol						
5827510	1559727		MULTITUDE WW2						
758293	1559728		Arubodoru						
758294	1559728		Ngarbagedesau						
758295	1559728		Nerubodoru						
3600377	1559728		Ngerbodel						
758299	1559732		Pkulrengerelong						
758300	1559732		Galapao						
758301	1559732		Ngarabau						
758302	1559732		Pkulrengereiong Point						
758303	1559732		Aracalong						
758304	1559732		Ngarbau						
758305	1559732		Delebog						
3600380	1559732		Ngerbau						
758321	1559737		Gamolei						
758322	1559737		Gamolei Island						
3600383	1559737		Ngemolei						
15358441	1559737	wkdt	Q35308872						
758323	1559739		Omekang						
758324	1559739		Ngemewangel						
758325	1559739		Gomagang Ridge						
758326	1559739		Gomagang						
3600384	1559739		Ngermeuangel						
5895929	1559739		Koror Island						
758335	1559742		Ngamalagel						
758336	1559742		Namelakl-Durchfahrt						
758337	1559742		Ngamalagel-Einfahrt						
758338	1559742		Namelakl Passage						
3600387	1559742		Ngemelachel						
758339	1559744		Namai Bay						
758340	1559744		Namai-wan						
758341	1559744		Ngamai-Bucht						
758342	1559744		Ngemay						
758343	1559744		Namai						
3600388	1559744		Ngemai						
758358	1559747		Gaseburu-To						
758359	1559747		Gaseburu						
3600391	1559747		Ngelsibel						
5891489	1559747		Mecherchar Islands						
8075577	1559747	link	https://en.wikipedia.org/wiki/Ngelsibel						
5894471	1559751		Belau Channel						
5894472	1559751		Ngeruktabel Islands						
758366	1559753		Ngesebus						
758367	1559753		Ngesebus Island						
758368	1559753		Ngedebus						
758369	1559753		Guadobusu Island						
758370	1559753		Gwadobusu-tō						
758371	1559753		Guadabusu To						
3600396	1559753		Ngedbus						
5827502	1559753		ACEPEACE WW2						
758372	1559754		Ngatpael Pass						
758373	1559754		Ngarpaet-Durchfahrt						
758374	1559754		Ngatpaet-Einfahrt						
758375	1559754		Ngatpaet Durchfahrt						
758376	1559754		Ngatpast Passage						
758377	1559754		Ngatpaet Passage						
3600397	1559754		Toachel Ngedbaet						
758378	1559755		Ngebureg						
758379	1559755		Ngaburok						
758380	1559755		Gabulko						
758381	1559755		Ororian						
758382	1559755		Galbuko						
758383	1559755		Ololian						
758384	1559755		a Ipelau						
3600398	1559755		Ngeburch						
758397	1559759		Gabodel						
758398	1559759		Gabodel Island						
758399	1559759		Gaboderu Island						
3600402	1559759		Ngebedel						
5894485	1559759		Ngeruktabel Islands						
758401	1559761		Cape Ngebasangel						
758402	1559761		Cape Gabadaguru						
758403	1559761		Gabadaguru Point						
758404	1559761		Ngebedangel						
3600404	1559761		Bkul a Ngebedanget						
5894477	1559761		Ngeruktabel Islands						
758405	1559762		Orolong						
758406	1559762		Gamudok Island						
758407	1559762		Gamudoko Island						
758408	1559762		Gaboderu						
758409	1559762		Gabodel Island						
758410	1559762		Ngobasangel						
758411	1559762		Gamudoko-tō						
758412	1559762		Ngobosangl						
3600405	1559762		Ngebedangel						
5894475	1559762		Ngeruktabel Islands						
758413	1559764		Ngabad Island						
758414	1559764		Ngabad						
758415	1559764		Guapatsu-tō						
3600406	1559764		Ngebad						
758419	1559766	en	Angaur						
758420	1559766		N’Yaur						
758421	1559766		a Ngeaur						
758422	1559766		Ngeour						
758423	1559766		Ngeauar						
758424	1559766		Negour						
758425	1559766		Angelel						
758426	1559766		Angauru-tō						
758427	1559766		Ngaur						
758428	1559766		Niaur						
758429	1559766		Angelul						
758430	1559766		Angyaur						
758431	1559766		Angaur Island						
758432	1559766		Angorur Island						
758433	1559766		Angaur Ngaurd						
758434	1559766		Angour						
1914414	1559766	es	Angaur						
1914415	1559766	de	Angaur						
1914416	1559766	fi	Angaur						
1914417	1559766	it	Angaur						
1914418	1559766	ja	アンガウル州						
1914419	1559766	no	Angaur						
1914420	1559766	pt	Angaur						
1914421	1559766	sv	Angaur						
1914422	1559766	zh	安加爾						
3600407	1559766		Ngeaur						
5813118	1559766		DOMESTIC WW2						
5813119	1559766		TAXPAYER WW2						
5827064	1559766		Monkey Island						
16635210	1559766	link	https://en.wikipedia.org/wiki/Angaur						
758435	1559767		Gaiangsu						
758436	1559767		Gaiangas Island						
758437	1559767		Ngaiabes						
758438	1559767		Gaianges						
758439	1559767		Yar						
3600408	1559767		Ngeanges						
5891479	1559767		Rock Islands						
8095184	1559767	link	https://en.wikipedia.org/wiki/Ngeanges						
758443	1559771		Ngchemiangel						
758444	1559771		Gamliangel Bay						
3600409	1559771		Debel a Ngchemiangel						
758458	1559774		Ngcheangel Municipality						
758459	1559774		Ngcheangel						
758460	1559774		Kayangel		1				
758461	1559774		Kayangel State						
3600412	1559774		State of Kayangel						
7126556	1559774	link	https://en.wikipedia.org/wiki/Kayangel						
14910284	1559774	wkdt	Q871222						
758462	1559775		Kayangle						
758463	1559775		Ngajargel						
758464	1559775		Ngardims						
758465	1559775		Nggeiangel						
758466	1559775		Ngardilong						
758467	1559775		Kreiangel						
758468	1559775		Nghyangel						
758469	1559775		A Bad						
758470	1559775		Ngeiangl						
758471	1559775		Chiangel						
758472	1559775		Kadjangle						
758473	1559775		Ngajangel						
758474	1559775		Kajangeru-tō						
758475	1559775		Gajangeru To						
758476	1559775		Kianguel						
758477	1559775		Ngcheangle						
758478	1559775		Kajangle						
758479	1559775		Malanglang						
758480	1559775		Ngajangel Island						
3600413	1559775	pau	Ngcheangel						
16635753	1559775	link	https://en.wikipedia.org/wiki/Kayangel						
758481	1559776	tox	Hatohobei	1	1				
2935156	1559776	link	https://en.wikipedia.org/wiki/Hatohobei						
3050580	1559776	link	https://ru.wikipedia.org/wiki/%D0%A5%D0%B0%D1%82%D0%BE%D1%85%D0%BE%D0%B1%D0%B5%D0%B8						
5810455	1559776		Tobi						
8489158	1559776	en	Hatohobei	1	1				
14915599	1559776	wkdt	Q3516752						
758516	1559785		Delutaog						
758517	1559785		Saipan						
758518	1559785		Sipon						
758519	1559785		Ngaramash						
758520	1559785		Jimusho						
758521	1559785		Yubinkyoku						
758522	1559785		Saipan Town						
758523	1559785		Saipon						
11287293	1559785	link	https://en.wikipedia.org/wiki/Saipan_Town						
13796071	1559785	unlc	PWANG						
758524	1559788		Ngadarak						
758525	1559788		Ngederrak Reef						
758526	1559788		Ngadarak Reef						
758527	1559788		Gadaraku Reef						
758528	1559788		Ngederak Riff						
758529	1559788		Ngaderak Riff						
758530	1559788		Gadaraku-shō						
3600417	1559788		Ngederrak						
1063	1559790		Ueno						
758534	1559790		Ngrategetei Island						
758535	1559790		Nakano						
758536	1559790		Ueno-To						
758537	1559790		Nakano Island						
758538	1559790		Ueno Island						
758539	1559790		Nakano-To						
758540	1559790		Ngerebetei						
3600419	1559790		Ngerbechetei						
15895876	1559790	wkdt	Q35308896						
758547	1559793		Metew						
3600422	1559793		Mteultoachel						
758548	1559794		Bitang						
758549	1559794		Pittang						
3600423	1559794		Mochelngel						
758550	1559795		Ngeridebaol						
758551	1559795		Ngerithebaur Passage						
758552	1559795		a Gadengel						
3600424	1559795		Ngeridebaul						
758553	1559796		Pipiroi Inlet						
758555	1559796		Ogurutaageru Passage						
758556	1559796		Ogurutageru Durchfahrt						
758557	1559796		Toagel Mid Passage						
758558	1559796		Toagel Mid						
758559	1559796		Arumizu						
758560	1559796		Toagil Mid Passage						
758561	1559796		Taogil Mid Passage						
758562	1559796		Toachel er Ngermid						
758563	1559796		Armitjttoakl						
758564	1559796		Ogurutageru-suidō						
3600425	1559796		Toachel Mid						
758565	1559797		a Meungs						
758566	1559797		Meiungs						
758567	1559797		Meungs						
758568	1559797		Amiyonsu						
3600426	1559797		Meyungs						
8084598	1559797	link	https://en.wikipedia.org/wiki/Meyungs						
758573	1559800		Meshikun Channel						
758574	1559800		Ngerumekaol						
758575	1559800		Boat Channel						
3600429	1559800		Mesikm						
758581	1559804		Artingall						
758582	1559804		Ngadernal						
758583	1559804		Marukiyoku						
758584	1559804		Athernal						
758585	1559804		Melekejok						
758586	1559804		Coaengal						
758587	1559804		Melekyok						
758588	1559804		Athermal						
758589	1559804		Molegoyok						
758590	1559804		Malligoyoke						
758591	1559804		Melekeiok						
758592	1559804		Mgadernal						
758593	1559804		Meligeok						
758594	1559804		Molegojok						
758595	1559804		Melekiok						
2935157	1559804	link	https://en.wikipedia.org/wiki/Melekeok_(town)						
3050581	1559804	link	https://ru.wikipedia.org/wiki/%D0%9C%D0%B5%D0%BB%D0%B5%D0%BA%D0%B5%D0%BE%D0%BA						
13796072	1559804	unlc	PWMKK						
758600	1559807		Amekaud						
758601	1559807		Amekaud River						
758602	1559807		Ngaramasech						
3600432	1559807		Omoachel ra Mekaud						
758603	1559808		Geugel-Makaep Passage						
758604	1559808		Saipan Strait						
3600433	1559808		Mekaeb						
758605	1559809		Kisano						
758606	1559809		Takonoki Island						
758607	1559809		Takonoki-To						
758608	1559809		Kisano Island						
758609	1559809		Takonoki						
3600434	1559809		Meduu						
15613230	1559809	wkdt	Q35300261						
758614	1559812		Amodhorom						
758615	1559812		Mudorom						
758616	1559812		Mudurom						
758617	1559812		Admodhorom						
758618	1559812		Medorom						
3600437	1559812		Medorm						
758619	1559813		Matal Eigad						
758620	1559813		Madafall a Iegad						
3600438	1559813		Medallaiechad						
758621	1559814		Matalai						
758622	1559814		Madarai						
758623	1559814		Maralai						
758624	1559814		Madalai						
758625	1559814		Madaria						
3600439	1559814		Medalaii						
758638	1559817		Mokokaemu						
758639	1559817		Mochochaw						
758640	1559817		Mecherchar Islands						
758641	1559817		Mokokaemu-To						
3600442	1559817		Mchochaeo						
8075913	1559817	link	https://en.wikipedia.org/wiki/Mchochaeo						
758652	1559819		Amalakell						
758653	1559819		Malacal						
758654	1559819		Malaccan						
758656	1559819		Malakal Island						
758657	1559819		Malacan						
758658	1559819		Marakaru-tō						
758659	1559819		Nanalake						
758660	1559819		Marakaru						
758661	1559819		Malagal						
758662	1559819	pau	Ngemelachel						
758663	1559819		Amalaquel						
3600444	1559819		Malakal						
3600445	1559819		Malackan						
5827509	1559819		MENDIKANT WW2						
7540327	1559819	link	https://en.wikipedia.org/wiki/Malakal_Island						
758664	1559820		Ngedbang						
758665	1559820		Madarabaye						
3600446	1559820		Madarabae						
16171378	1559820	link	https://en.wikipedia.org/wiki/Ngereklmadel						
758667	1559822		Arkabesan Anchorage						
758668	1559822		Lebugol Channel						
758669	1559822		Arlabesan Anchorage						
758670	1559822		Arakabesan						
758671	1559822		Lebugol						
3600448	1559822		Llebuchel						
15538149	1559823	wkdt	Q35294559						
758672	1559824		Ngarakis						
758673	1559824		Alkess Island						
758674	1559824		Arukeshi-To						
758675	1559824		Arukeshi Island						
758676	1559824		Arukeshi						
3600449	1559824		Lkes						
15270015	1559824	wkdt	Q35308817						
758677	1559825		Ngidopie Reef						
758678	1559825		Ngidopie Riff						
758679	1559825		Hydrographer Bank						
758680	1559825		Lkes						
3600450	1559825		Lukes						
758681	1559826		Ngeit						
758682	1559826		Ngid Passage						
3600451	1559826		Ngiit						
758692	1559829		Guat						
758693	1559829		Gua-To						
758694	1559829		Gua Island						
758695	1559829		Guat Island						
3600454	1559829		Kuat						
15452172	1559829	wkdt	Q35282973						
758696	1559830		Kuapasungasu						
758697	1559830		Kap Kuapesngas						
758698	1559830		a Ulugeang						
758699	1559830		Kap Planet						
758700	1559830		Kwapasingasu-Kuku						
758701	1559830		Kuapasungasu Kaku						
758702	1559830		Kuapesngas Point						
758703	1559830		Urukthapel Island						
758704	1559830		Kuapesngas						
758705	1559830		Kwapasungasu-kaku						
3600455	1559830		Kuabesngas						
15909299	1559830	wkdt	Q31206370						
758706	1559831		Kuwabusharai						
758707	1559831		Mecherchar Islands						
3600456	1559831		Kuabeserrai						
8100902	1559831	link	https://en.wikipedia.org/wiki/Kuabeserrai						
758709	1559833		Kloul Toi Passage						
758710	1559833		Kloul Toi						
758711	1559833		Karamadaoru-Suido						
758712	1559833		Kuramadaoru Passage						
758713	1559833		Klou Toi Passage						
758714	1559833		Kuramadaoru-suidō						
758715	1559833		Kloultoi						
758717	1559833		Toira Klemadaol						
3600458	1559833		Klou el Toi						
3600459	1559833		Toi Klemadaol						
5894449	1559833		Rock Islands						
758718	1559836		Aklim Point						
758719	1559836		Ngareklim						
758720	1559836		Bkulklim						
758721	1559836		Arikumu Point						
3600460	1559836		Bkul Klim						
15722461	1559836	wkdt	Q31916830						
758722	1559837		Saddle Mount						
758723	1559837		a Klbaiel						
758724	1559837		Saddle Mountain						
758725	1559837		Garubaeru Mountain						
758726	1559837		Garubaeru-San						
758727	1559837		a Kluaiel						
3600461	1559837		Klbael						
15814596	1559837	wkdt	Q31206378						
758728	1559838		Taog-ra-klai						
758729	1559838		Taoch ra Kali						
3600462	1559838		Taoch ra Klai						
758730	1559839		Rois Ketun						
3600463	1559839		Rois Ketund						
15731283	1559839	wkdt	Q31206386						
758731	1559840		Malakal Durchfahrt						
758732	1559840		Toagel Keseboku						
758733	1559840		Amallakell Harbour						
758734	1559840		Malakal Passage						
758735	1559840		Kesoboku Einfahrt						
758736	1559840		Malakal Pass						
758737	1559840		Kasepogau						
758738	1559840		Marakaru-suidō						
758739	1559840		Toagel Kaseboku						
758740	1559840		Kasebogau Passage						
758741	1559840		Kasebogu Passage						
3600464	1559840		Toachel ra Kesebekuu						
758742	1559841		Nishidate Island						
758743	1559841		Nishidate						
758744	1559841		Orukuizu						
3600465	1559841		Kemokem						
5891473	1559841		Seventy Islands						
758745	1559842		Geiugel						
758746	1559842		Klou Legmugel-Kanal						
758747	1559842		Kajangle Durchfahrt						
758748	1559842		Kayangel Passage						
758749	1559842		Kajangle Passage						
758750	1559842		Kazyanguru Guido						
758751	1559842		Kajanguru-suido						
3600466	1559842		Kekerel Euchel						
758752	1559843		Kekerel Toi						
758753	1559843		Kekerel Toi Passage						
3600467	1559843		Kekerei el Toi						
5894474	1559843		Ngeruktabel Islands						
758754	1559844		Kawasan-Einfahrt						
758755	1559844		Kavasak Passage						
758756	1559844		Garaseg						
758757	1559844		Kawasaka-suidō						
758758	1559844		Kawasak						
758759	1559844		Higashi						
758760	1559844		Kawassak						
758761	1559844		Kavesak Einfahrt						
758762	1559844		Kawasaku Suido						
758764	1559844		Kawasaki Suido						
758765	1559844		Kawask						
3600468	1559844		Kawasak Passage						
758768	1559847		Ayebukuru						
758769	1559847		Aebukuru						
758770	1559847		Aiebukl						
758771	1559847		Doro Island						
3600470	1559847		Iyebukel						
758790	1559854		Arappu						
758791	1559854		Arappu Point						
3600474	1559854		Itabchemingl						
5895930	1559854		Koror Island						
15469881	1559854	wkdt	Q34947365						
758798	1559859		Eomogan						
758799	1559859		Eomogan Island						
758800	1559859		Eomogan-tō						
3600477	1559859		Ioulomekang						
758801	1559860		a Mototoi						
758802	1559860		Toakl Pelau						
758803	1559860		Sar Durchfahrt						
758804	1559860		Yoo Passage						
758805	1559860		Toagel Sar						
758806	1559860		Yo-suidō						
758807	1559860		Sar Passage						
758808	1559860		Ongetkatel						
758809	1559860		Toagel-Pelau						
758810	1559860		Yar Passage						
758811	1559860		Toagel Geikadlukes						
3600478	1559860		Toachel Iou						
5891481	1559860		Rock Islands						
758820	1559864		Aimeong						
758821	1559864		Aimion						
758822	1559864		Imeiong						
758823	1559864		A Imeungs						
3600480	1559864		Imeong						
7080146	1559864	link	https://en.wikipedia.org/wiki/Imeong						
15553360	1559864	wkdt	Q2640394						
5891493	1559870		Mecherchar Islands						
758836	1559871		Misaki Island						
758837	1559871		Doro-To						
758838	1559871		Misaki-To						
758839	1559871		Doro Island and Misaki Island						
758840	1559871		Doro Island						
3600484	1559871		Iberor						
15520601	1559871	wkdt	Q35270067						
758841	1559872		Heren-Shō						
758843	1559872		Helen-Riff						
758844	1559872		Herene Sho						
758845	1559872		Carteret						
3600485	1559872		Helen Reef						
5810418	1559872	tox	Hotsarihie Atoll	1					
5810432	1559872		Helens Reef						
758849	1559875		Yiilbelau						
758850	1559875		Gariyo To						
758851	1559875		Garyo-To						
758852	1559875		Arimaksu						
758853	1559875		Garyo Island						
758854	1559875		Garyo						
3600488	1559875		Iilblau						
5891463	1559875		Ngemlis Islands						
758855	1559876		Ngeream						
758856	1559876		Garreru-tō						
758857	1559876		Garayamu						
758858	1559876		Pkulapngei						
758859	1559876		Pkulapnei						
758860	1559876		Garreru Island						
758861	1559876		Garayama Island						
758862	1559876		Ngaream						
758863	1559876		Gatsureru To						
758864	1559876		Garrerui						
3600489	1559876		Garreru						
758865	1559879		Ashakasengu						
758866	1559879		Sehesengel						
3600490	1559879		Euidelchol						
5891488	1559879		Mecherchar Islands						
758868	1559880		Ruisuarumonogui Mountain						
758869	1559880		Ruisaurumonogui-San						
758870	1559880		Ngaruak						
758871	1559880		Rois Mlengui						
758872	1559880		Mount Katteluel						
758874	1559880		Ngarua						
758876	1559880		Mount Luisualmonugui						
758877	1559880		Katterueru San						
758879	1559880		Katteruueru-san						
758881	1559880		Ngamlungui						
758882	1559880		Ruisuarumosogu Mountain						
3600491	1559880		Etiruir						
3600492	1559880		Rois Mlungui						
15363899	1559880	wkdt	Q31206395						
758886	1559882		Kawasak Passage						
3600494	1559882		Ebil						
758887	1559883		Mount Remian						
3600495	1559883		Engas						
14850900	1559883	wkdt	Q31206404						
15708518	1559884	wkdt	Q31206413						
758888	1559885		Gamasiogel Cave						
758889	1559885		Gamesiogle Cave						
758890	1559885		Omesiochel						
3600496	1559885		Emesiochel						
5894473	1559885		Ngeruktabel Island						
1064	1559887		Elbacheb						
758894	1559887		Uplifted Limestone Islands						
758895	1559887		Kokial Islands						
758896	1559887	en	Rock Islands						
758897	1559887		Islus Errekelfiu						
758898	1559887		The Rock Islands						
2935158	1559887	link	https://en.wikipedia.org/wiki/Rock_Islands						
3600497	1559887	pau	Chelbacheb						
758899	1559888		Eitelblong						
758900	1559888		Eitelblong Island						
3600498	1559888		Itelblong						
15706703	1559888	wkdt	Q35272201						
5895931	1559892		Arakabesan-Koror Causeway						
758903	1559894		Arimasuku Island						
758904	1559894		Admasah						
758905	1559894		Arimesuku						
758906	1559894		Airimasuku-tō						
758907	1559894		Garakayo						
758908	1559894		Tmasch						
3600500	1559894		Dmasech						
5891464	1559894		Ngemlis Islands						
758909	1559896		Terebebai						
758910	1559896		Delepebai						
758911	1559896		Terebebai-tō						
758912	1559896		Delepebai Island						
3600501	1559896		Dlebebai						
758924	1559898		Arimaksu						
758925	1559898		Arimasuku Island						
758926	1559898		Airimasuku-To						
3600503	1559898		Desomel						
5891466	1559898		Ngemlis Islands						
758927	1559899		Denges Passage						
758928	1559899		Dengisu-suidō						
758929	1559899		Denges-Einfahrt						
758930	1559899		Denges-Durchfahrt						
758931	1559899		Toakl Denges						
3600504	1559899		Denges						
5904493	1559899		Schonian Pass						
758938	1559903		Gongolungel						
758939	1559903		Gongolungel Pass						
758940	1559903		Gongolungel Strait						
3600508	1559903		Chongelungel						
758944	1559905		Orukon Reef						
758945	1559905		Olgung Reef						
3600510	1559905		Cholkong						
758951	1559907		Kasao Reef						
758952	1559907		Cheyikdilukes						
758953	1559907		Kreis Riff						
758954	1559907		Kasao-shō						
3600511	1559907		Chesau						
758955	1559908		Pukil-a-gasemieg						
758956	1559908		Cape Aitaburai						
758957	1559908		Pkulagasemieg						
758958	1559908		Pkulmeig						
758959	1559908		Aitaburai-saki						
758960	1559908		Pkulameig Point						
758961	1559908		Aitaburai Point						
758962	1559908		Pkulamieg						
758963	1559908		Puklmeig						
3600512	1559908		Bkul a Chesemiich						
15545590	1559908	wkdt	Q34858999						
758964	1559909		Gosegosu						
758965	1559909		Ngothugothu Island						
758966	1559909		Ngothugothu						
758967	1559909		Gesegosu						
758968	1559909		Gashkosu To						
758969	1559909		Goshokuso-tō						
758970	1559909		Gosegasu Island						
758971	1559909		Gashokosu						
758972	1559909		Gashokuso To						
758973	1559909		Goshkosu-To						
3600513	1559909		Chesechosou						
758978	1559911		Moir						
758979	1559911		Gowuied						
758980	1559911		Ngarabelobang						
758981	1559911		Gorwuied						
758983	1559911		Amoi-To						
758984	1559911		Amoi						
758985	1559911		Ngaruang						
758986	1559911		Chemoi						
3600515	1559911		Chemol						
5891492	1559911		Mecherchar Islands						
15576084	1559911	wkdt	Q35381993						
758987	1559912		Heleu						
758988	1559912		Gariyo To						
758989	1559912		Garo Island						
3600516	1559912		Cheleu						
5891462	1559912		Ngemlis Islands						
758990	1559914		Yalap						
758991	1559914		Garurudo						
758992	1559914		Aiokako-suidō						
758993	1559914		Akarappu						
758994	1559914		Gaysan						
758995	1559914		Gabokkudo						
758996	1559914		Akalak						
758997	1559914		Rallap						
758998	1559914		Achelap						
758999	1559914		Ralap						
759000	1559914		Geysan						
3600517	1559914		Chelab						
5881654	1559914		Galap						
5881655	1559914		Elab						
7522866	1559914	link	https://en.wikipedia.org/wiki/Elab						
15516775	1559914	wkdt	Q387726						
759005	1559917		Betaoto Reef						
759006	1559917		Belaoto Reef						
759007	1559917		Betaot Reef						
3600519	1559917		Btaot						
15801110	1559919	wkdt	Q31206422						
759017	1559921		Pkurengell						
759018	1559921		Bokurugeru Point						
759019	1559921		Pkurengel						
759020	1559921		Hakurugeru-saki						
759021	1559921		Bokurugeru-saki						
759022	1559921		Bukurogel						
759023	1559921		Cape Bokurgel						
3600522	1559921		Bkurrengel						
759024	1559922		Apurashokoru						
759025	1559922		Apurashekoru						
3600523	1559922		Bkulsechuul						
5894454	1559922		Ulong Islands East						
759052	1559926		Konlei Head						
759053	1559926		Konrei						
759054	1559926		Konrei Point						
759055	1559926		Matol						
3600527	1559926		Bkulaibelau						
15756760	1559926	wkdt	Q31206431						
15765754	1559930	wkdt	Q31206439						
15742710	1559931	wkdt	Q31206447						
759075	1559935		Peluguaur						
759076	1559935		Buruokowaru-tō						
759077	1559935		Duruokowaru Island						
759078	1559935		Pelugauar Island						
759079	1559935		Buruokowaru Island						
759080	1559935		Pelugauar						
759081	1559935		Pelugaua						
3600532	1559935		Beluuchoar						
759082	1559936		Belwalasmau						
3600533	1559936		Belualasmau						
5832454	1559936		Murphy						
759097	1559940		Beduliases						
759098	1559940		Podoriasu						
759099	1559940		Peduliaes						
759100	1559940		Peduliaes Point						
759101	1559940		Kap Peduliaes						
759102	1559940		Pedouriasu						
759103	1559940		Pudouriasu						
759104	1559940		Paduliaes Point						
3600535	1559940		Beduliaes						
5894465	1559940		Ngerchaol Island West Cape						
759105	1559942		Abeyabu Island						
759106	1559942		Abeyabu-tō						
759107	1559942		Abeyabu						
759108	1559942		Mabyabu To						
759109	1559942		Mabyabu						
3600536	1559942		Beab						
5891480	1559942		Rock Islands						
759110	1559944		Bairakaseru Island						
759111	1559944		Bailehesengel						
3600537	1559944		Bailechesengel						
5891461	1559944		Ngemlis Islands						
15451539	1559944	wkdt	Q31898792						
759112	1559946		Abappaomogan Island						
759113	1559946		Goilug						
759114	1559946		Abappaomogan-tō						
3600538	1559946		Bablomekang						
8074765	1559946	link	https://en.wikipedia.org/wiki/Bablomekang						
759115	1559947		Babeldaob						
759116	1559947		Baubelthouap						
759117	1559947		Babelthoup						
759118	1559947		Babldaob						
759119	1559947		Babelutaobu						
759120	1559947		Bablethoup Island						
759121	1559947		Babelthaob						
759122	1559947		Babelhoup Island						
759123	1559947		Babeltop						
759124	1559947		Panlog						
759125	1559947		Palau Island						
759126	1559947		Panloq						
759127	1559947		Babelthaub						
759128	1559947		Babelthuab						
759129	1559947		Baobeltaob						
759131	1559947		Babeltaob						
759132	1559947		Babelzuap						
759133	1559947		Babelthaup Island						
759134	1559947		Bablehoup Island						
759135	1559947		Panlog Island						
759136	1559947		Parao						
759137	1559947		Badelzuap						
759138	1559947		Arrecifos						
759139	1559947		Parao Tō						
759140	1559947		Baberutaobu Jima						
759141	1559947		Babeldáob						
759142	1559947		Babeltloab						
759143	1559947		Babelthuap Island						
759144	1559947		Babeltuap						
759145	1559947		Baberudaobu To						
759146	1559947		Babeldzuap						
2038294	1559947	es	Babeldaob						
2038295	1559947	en	Babeldaob						
2038296	1559947	pl	Babelthuap						
2038297	1559947	de	Babelthuap						
2038298	1559947	fi	Babeldaob						
2038299	1559947	nl	Babeldaob						
2038300	1559947	no	Babeldaob						
2038301	1559947	sv	Babeldaob						
2935159	1559947	link	https://en.wikipedia.org/wiki/Babeldaob						
3050582	1559947	link	https://ru.wikipedia.org/wiki/%D0%91%D0%B0%D0%B1%D0%B5%D0%BB%D0%B4%D0%B0%D0%BE%D0%B1						
3600539	1559947	en	Babelthuap						
5827503	1559947		CUCKOLD WW2						
759176	1559956		Arukoron						
759177	1559956		Arakalong						
759178	1559956		Narekolojn						
759179	1559956		Arekalong Halbinsel						
759180	1559956		Are Kalong Peninsula						
759181	1559956		Arrekolong						
759182	1559956		Orocolong						
759183	1559956		Nagarool						
759184	1559956		Urrakalong						
759185	1559956		Arekaling Peninsula						
759186	1559956		Arekalong Point						
759187	1559956		Golokl						
759188	1559956		a Ivegebangel						
759189	1559956		Arekarongu Haato						
759190	1559956		Ngaregolong						
759191	1559956		Ngerchelong Peninsula						
3600544	1559956		Arekalong Peninsula						
759192	1559957		Angaur Hafen						
759193	1559957		Angauru-kō						
3600545	1559957		Angaur Harbor						
759196	1559961		Airrai						
3600546	1559961		Airai Elementary School						
759197	1559962		Irrai						
759198	1559962		A Irai						
759199	1559962		Airrai						
759207	1559964		Imeliik						
759208	1559964		Aimeliik		1				
759209	1559964		Ngerebungs						
759210	1559964		Aimelik						
759211	1559964		Aimiliiki						
759212	1559964		Aimiriiki						
759213	1559964		Eimelik						
759214	1559964		Aimeliik Municipality						
3600547	1559964		State of Aimeliik						
5463350	1559964	link	https://en.wikipedia.org/wiki/Aimeliik						
14914867	1559964	wkdt	Q405589						
759215	1559965		Aimiriki						
759216	1559965		Aimiriiki						
759217	1559965		aImelik						
759218	1559965		Aimiliiki						
3600548	1559965		Aimeliik						
972579	1879790		Southwest Palau Ridge						
972720	1879890		Palau Trough						
972721	1879890		Palao Trog						
972722	1879890		Palao Trough						
2726426	1879890	ru	Палао Трог						
8392974	4036778	link	https://en.wikipedia.org/wiki/Ngchesar						
12367488	4036778		Enkassar						
12409896	4036778		Arakaso						
12559261	4036778		Enchesar						
12559262	4036778		Ngesar						
12559263	4036778		Nggesar						
12597059	4036778		Alakasoho						
12708677	4036778		Galaus						
12708678	4036778		Engkasar						
12708679	4036778		Nggessar						
12749008	4036778		Enkasar						
12749057	4036778		Ngurutoi						
8085609	4037550	link	https://en.wikipedia.org/wiki/Belau_National_Museum						
15340412	4037550	wkdt	Q4881995						
3075945	4037645		Airai		1				
7156591	4037645	link	https://en.wikipedia.org/wiki/Airai						
12325202	4037645		Eye Rye						
12325203	4037645		Ngaregumelbai						
12325204	4037645		A Irai						
12325205	4037645		Eirei						
12367476	4037645		Airai Municipality						
12367477	4037645		Arrai						
12460308	4037645		Airrai						
12573783	4037645		Irrai						
12625202	4037645		Ngaragumelbai						
12708661	4037645		Irrai Municipality						
15372034	4037645	wkdt	Q407967						
5826042	4037651		Romauldo - Last JP Defense Positions WW2						
3075944	4037653		Angaur		1				
8234743	4037653	link	https://en.wikipedia.org/wiki/Angaur						
15399632	4037653	wkdt	Q530813						
15722732	4037659	wkdt	Q31206456						
12568607	4037714		Suifuyama						
12677911	4037714		Suifuzan						
15164995	4037714	wkdt	Q31206464						
5881653	4037733		Choll						
7514706	4037733	link	https://en.wikipedia.org/wiki/Choll						
12325207	4037733		Acholl						
12367479	4037733		Agol						
12409885	4037733		Akuro						
12442195	4037733		Roll						
12460312	4037733		A Gol						
12749030	4037733		Akoru						
12765942	4037733		Gol						
15437940	4037733	wkdt	Q5104352						
12335503	4037774		Aragol						
12568608	4037774		Ngalkol						
12606732	4037774		Orocall						
12606733	4037774		Ngerechol						
12760370	4037774		Ngaregol						
5894451	4037780		Rock Islands						
5894452	4037780		Ulong Islands						
12606734	4037780		Englishmen's Beach						
15758210	4037780	wkdt	Q31206472						
5828082	4037791		German Channel						
5891459	4037791		German dredged Channel 1900						
15799045	4037795	wkdt	Q31206481						
12409886	4037823		A Imelogel						
12537559	4037823		Babelthuap Village						
12597050	4037823		Emeleol						
12708668	4037823		Imeleol						
12367480	4037843		Arumongui						
12367481	4037843		Bkulachelid						
12409887	4037843		Pkulagalid Point						
12409888	4037843		Arumongui Point						
12409889	4037843		Almongui Point						
12502904	4037843		Gamorei Point						
12597051	4037843		Pkul Ngerdesiuur						
12708673	4037843		Itebal Mlengui						
12749004	4037843		Pkulagolid						
15447319	4037843	wkdt	Q31206489						
12559315	4037851		J.F. Kennedy School						
5883626	4037853		K-B Bridge						
5883627	4037853		Koro-Babeldaob Bridge						
12409890	4037860		Kekerel Toi						
12409891	4037860		Kekerei El Toi						
12749005	4037860		Kekerel Toi Passage						
15306758	4037860	wkdt	Q34861812						
3075946	4037892		Koror		1				
6885524	4037892	link	https://en.wikipedia.org/wiki/Koror						
12325208	4037892		Koror City						
12537560	4037892		Kororu						
12537561	4037892		Koror Village						
12559257	4037892		Koror Town						
12597053	4037892		Oreor						
12597055	4037892		Koreor						
12597057	4037892		Goreor						
12622501	4037892		Goror						
12668214	4037892		Corore						
12668278	4037892		Korror						
12708674	4037892		Oreor Municipality						
14912585	4037892	wkdt	Q189426						
3075947	4037930		Melekeok		1				
8234744	4037930	link	https://en.wikipedia.org/wiki/Melekeok						
12325209	4037930		Melekeok Municipality						
12367408	4037930		Meligeok						
12367482	4037930		Karukiyoku						
12409892	4037930		Ngetelngal						
12409893	4037930		Ngatelingal						
12442199	4037930		Ngatelngal						
12502905	4037930		Melekiok Municipality						
12668146	4037930		Artingal						
12765880	4037930		Athernal						
14908277	4037930	wkdt	Q12898552						
12559260	4037961		Ngaraard School						
3075948	4037962		Ngaraard		1				
7127405	4037962	link	https://en.wikipedia.org/wiki/Ngaraard						
12325210	4037962		Ngarard						
12367483	4037962		Angarard						
12367484	4037962		Aibukit						
12367485	4037962		Ngirrarth						
12367486	4037962		Galalud						
12409894	4037962		Gararudo						
12475869	4037962		Yalap						
12559258	4037962		Ngeraard						
12559259	4037962		Ngirraruh						
12597058	4037962		Augerarth						
12749007	4037962		Ngerard						
14914991	4037962	wkdt	Q1154127						
3075943	4037976		Ngchesar		1				
7515164	4037976	link	https://en.wikipedia.org/wiki/Ngchesar						
8392973	4037976		Oldiais						
12325211	4037976		Kaisyaru						
12367487	4037976		Ngatelngal						
12409895	4037976		Ngchesar Municipality						
12442198	4037976		Karukiyoku						
12469492	4037976		Enkassar						
12708675	4037976		Ngghesar						
12708676	4037976		Nghesar						
15283425	4037976	wkdt	Q1070180						
12512168	4037978		Gamliangel Bay						
12597156	4037978		Ngchemiangel Bay						
12433125	4037993		Gabel						
12502906	4037993		Ngabiul						
12559264	4037993		Ngabei						
12597060	4037993		Ngabygul						
12749009	4037993		Ngabeul						
12367489	4038014		Ngiwal						
12433120	4038014		Ogiwal						
12559265	4038014		Ngerecheluk						
12597062	4038014		Karaeru						
12597063	4038014		Ngaregeluj						
12668218	4038014		Ngermechau						
12708680	4038014		Ngaragoluuk						
12708681	4038014		Ogiwaru						
12512169	4038029		Ngaramasag						
12559272	4038029		Ngarmasag Bay						
12559273	4038029		Ngaramasag Bay						
3075950	4038037		Ngarchelong		1				
3075951	4038037		Ngerchelong						
7141710	4038037	link	https://en.wikipedia.org/wiki/Ngarchelong						
12409897	4038037		Ngaregolong						
12409971	4038037		Arekalong						
12469491	4038037		Aracalong						
12597061	4038037		Ngerechelong						
12627841	4038037		Urrakalong						
12668216	4038037		Ngerelong						
12668309	4038037		Arukoron						
15338933	4038037	wkdt	Q1070185						
3075953	4038043		Ngardmau		1				
6885570	4038043	link	https://en.wikipedia.org/wiki/Ngardmau						
12409899	4038043		Kaslan						
12475922	4038043		Aretmau						
12502907	4038043		Arsmau						
12559206	4038043		Garasimao						
12559266	4038043		Arzmau						
12559267	4038043		Galasmao						
12559268	4038043		Kasmau						
12559269	4038043		Radman						
12597064	4038043		Arazmau						
12597065	4038043		Gardmau						
12625192	4038043		Karasumao						
12668219	4038043		Ngatpuieg						
12668220	4038043		Arathmow						
12708669	4038043		Ngerutoi						
12708682	4038043		Radmau						
12749006	4038043		Kaslau						
14914316	4038043	wkdt	Q1144496						
12367490	4038053		Ngatbang						
12537562	4038053		Mechebechubl						
12559270	4038053		New Ngatbang						
12559271	4038053		Mehebehubl						
12749011	4038053		Ngerklamad						
12708684	4038061		Ngeremlengui School						
12749014	4038064		Nguriungs						
15222634	4038064	wkdt	Q35308965						
3075949	4038068		Ngaremlengui	1	1				
7135059	4038068	link	https://en.wikipedia.org/wiki/Ngaremlengui						
12367491	4038068		Aramanewie						
12367492	4038068		Aremolunguy						
12367493	4038068		Armlimul						
12469486	4038068		Arumongui						
12559274	4038068		Armlimui						
12597066	4038068		Ngeremlungui						
12597155	4038068		Almongui						
12668221	4038068		Ngeremlengui Municipality						
12708683	4038068		Aramalorgoo						
12749012	4038068		Ngaramlungui						
12749013	4038068		Aramanewie District						
14911808	4038068	wkdt	Q975076						
15683306	4038078	wkdt	Q31206499						
12325212	4038080		Ngarakesou						
12388995	4038080		Garakasan						
12512170	4038080		Ngargeso						
12708686	4038080		Gaiakasan						
12749017	4038080		Ngarakosou						
12367494	4038084		Kesauaol						
12409900	4038084		Ngerkeseoul						
12559275	4038084		Ngarekesauaol						
12597067	4038084		Atekasabra						
12597068	4038084		Aiekasaol						
12597069	4038084		Ngerkesewaol						
12597070	4038084		Kesaiaol						
12597071	4038084		Ngarakassoul						
12668222	4038084		Atekasaoru						
12668223	4038084		Atekasabru						
12749015	4038084		Arakasoaol						
12749016	4038084		Aiekasol						
12708685	4038085		Ngarkebuiut						
15553809	4038085	wkdt	Q35308990						
5891490	4038097		Mecherchar Islands						
15663582	4038097	wkdt	Q35308977						
12325213	4038107		Garashiyoo						
12325214	4038107		Garasho						
12367495	4038107		Ngorsul						
12409901	4038107		Ngarsul						
12749018	4038107		Karasho						
5894456	4038108		Ulong Islands						
12335500	4038109		Ngorsum						
12420359	4038109		Garusuun						
12462445	4038109		Ngarsung						
12471662	4038109		Garasuun						
12668224	4038134		Ulong Channel						
15235919	4038137	wkdt	Q31206508						
15664897	4038138	wkdt	Q31206517						
12460319	4038140		Ngorsum						
12512171	4038140		Ngarsung						
12537563	4038140		Garasuun						
12559276	4038140		Ngurusar						
12597072	4038140		Garusuru						
12597073	4038140		Ngursar						
12749019	4038140		Garusal						
12749020	4038140		Garusaru						
5894469	4038141		Ngeruktabel Islands						
15847257	4038141	wkdt	Q35309104						
15532476	4038142	wkdt	Q35309130						
12325107	4038145		Ngatbong						
12409902	4038145		Ngurotol						
12502908	4038145		Urdmang						
12597158	4038145		Ngurutoi						
5891477	4038152		Rock Islands						
15223160	4038160	wkdt	Q31206526						
8422187	4038170	link	https://en.wikipedia.org/wiki/Mengellang						
12537564	4038170		Kayungur						
12597074	4038170		Ngeiungel						
12597075	4038170		Ononguru						
15251946	4038170	wkdt	Q3001462						
5881656	4038174		Keklau						
7064745	4038174	link	https://en.wikipedia.org/wiki/Ngkeklau						
12325215	4038174		Ngerkeklau						
12325216	4038174		Kaklau						
12409314	4038174		Kekurao						
12409903	4038174		Kakurao						
12537565	4038174		Ngkekau						
12558798	4038174		Kaslau						
12559278	4038174		Angkaluau						
12597076	4038174		Ngekeklau						
12749022	4038174		Geklau						
5891468	4038177		Ngemlis Islands						
12559277	4038177		Belaulangis Island						
3075942	4038179		Ngiwal		1				
6885527	4038179	link	https://en.wikipedia.org/wiki/Ngiwal						
12502909	4038179		Ogiwal						
12668259	4038179		Ogiwaru						
12749021	4038179		Oriwaru						
15354728	4038179	wkdt	Q1154101						
5891472	4038180		Seventy Islands						
15282482	4038180	wkdt	Q35309170						
1886975	4038189	icao	PTRO						
5763203	4038189	link	https://en.wikipedia.org/wiki/Roman_Tmetuchl_International_Airport						
5804867	4038189	iata	ROR						
5810234	4038189		Palau International Airport						
5810235	4038189		Roman Tmetuchl International Airport	1					
5810236	4038189		Babelthuap/Koror Airport						
5810237	4038189		Airai Airport						
5883631	4038189	faac	ROR						
5883632	4038189		Koror Airport						
5905786	4038189		Babeldaob Airport						
12512166	4038189		Belau International Airport						
12708662	4038189		Babeldaob-Koror Airport						
12749003	4038189		Babelthuap-Koror Airport						
12325217	4038196		Geriiki River						
12409904	4038196		Taoch Ngrikill						
12559279	4038196		Ngerikil River						
12760366	4038200		Ngarabogui						
15098968	4038211	wkdt	Q35313885						
16159067	4038221	link	https://en.wikipedia.org/wiki/Palau_High_School						
15753287	4038229	wkdt	Q31206536						
5894457	4038231		Ulong Islands						
12568599	4038235		Dgebard						
12606727	4038245		Micronesian Occupational College						
12668226	4038253		Malakal Hill						
15751999	4038253	wkdt	Q31206544						
5883633	4038258		Seventh-Day Adventist High School						
12409905	4038258		Belau Mission Academy						
3075952	4038261		Peleliu		1				
8234745	4038261	link	https://en.wikipedia.org/wiki/Peleliu						
12325206	4038261		Pkulapelu						
12367478	4038261		Acbolabolu						
12409884	4038261		Attalabul						
12559256	4038261		Argeutel						
12668207	4038261		Pkulopelu						
12668208	4038261		Pkula Belu						
12708672	4038261		Beliliou						
14910245	4038261	wkdt	Q497981						
15527904	4038273	wkdt	Q31206553						
15433524	4038275	wkdt	Q35314309						
14934310	4038276	wkdt	Q31206562						
12451227	4038281		Rois Ngchemiangel						
12460317	4038281		Radar Hill						
15295912	4038281	wkdt	Q31206572						
8409963	4038282	link	https://en.wikipedia.org/wiki/Angaur						
8409964	4038282		Ngeaur						
15381881	4038296	wkdt	Q31206581						
15727782	4038300	wkdt	Q31206590						
5894453	4038301		Ulong Islands NortWest						
12409906	4038313		Namako To						
12597077	4038313		Namako Island						
15240275	4038321	wkdt	Q31206600						
12559280	4038323		Togobai						
15789231	4038323	wkdt	Q31206608						
12325218	4038325		Turku-Berg						
12597078	4038325		Tukur						
15649796	4038325	wkdt	Q31206617						
5891465	4038328		Ngemlis Islands						
15487322	4038328	wkdt	Q35364029						
15449699	4038404	wkdt	Q35308803						
5905582	4038405		Ngardok Lake Nature Reserve						
15680706	4038421	wkdt	Q35308859						
5894482	4038423		Ngeruktabel Islands						
16636007	4038423	link	https://en.wikipedia.org/wiki/Ongael_Island						
5705905	6941974	link	https://en.wikipedia.org/wiki/Jellyfish_Lake						
5891502	6941974	pau	Ongeim'l Tketau						
5891503	6941974		Golden Jellyfish Marine Lake						
5891505	6941974		Mecherchar Islands						
5891506	6941974		Eil Malk Island						
11595488	6941974	de	Ongeiml Tketau						
11595489	6941974	es	Lago de las Medusas						
11595490	6941974	fr	Lac aux Méduses						
11595491	6941974	ca	Llac Medusa						
11595492	6941974	cv	Медузăсен кӳлли						
11595493	6941974	eo	Lago de Meduzoj						
11595494	6941974	id	Danau Ubur-ubur						
11595495	6941974	ja	ジェリーフィッシュレイク						
11595496	6941974	lt	Medūzų ežeras						
11595497	6941974	uk	Озеро Медуз						
11595498	6941974	ru	Озеро Медуз						
11595499	6941974	zh	水母湖						
5810419	7670576	tox	Hotsarihie Lagoon	1					
5810420	7670578	tox	Pierauroru in Hatohobei State Constitution	1					
5810421	7670578		Transit Reef in Tobi State Constitution						
5905783	7670689		Tobi - Uplifted Limestone Island						
5810461	7670711		EEZ Surveillance RADAR						
5813060	7670730	tox	Hatohobei	1					
8342957	7670730	link	https://en.wikipedia.org/wiki/Hatohobei						
15627186	7670730	wkdt	Q2456642						
5905782	7670753		Sonsorol - Uplifted Limestone Islands						
5813058	7670816	pau	Sonsorol	1					
5813059	7670816	sov	Dongosaro	1					
7522438	7670816	link	https://en.wikipedia.org/wiki/Dongosaru						
5827513	7670828		GULLCRY WW2						
5827512	7670829		ARTERIAL WW2						
5813062	7670830	es	Indias Orientales Espanolas						
5813063	7670830	en	Spanish East Indies						
5813064	7670831	ger	Deutsch-Neuguinea						
5813065	7670831	en	German New Guinea						
5813069	7670832		South Sea Mandate						
5813070	7670832		South Seas Island Mandate						
5813071	7670832		South Pacific Mandate						
5813066	7670833		TTPI Trust Territory of the Pacific Islands						
5813067	7670833		US United Nations Trust Territory						
5905995	7670833		TTPI Palau District						
5813078	7670860		LORAN-A Chain Peleliu-Morotai						
5813077	7670861	sov	Puro Village	1					
5813110	7670951		Ngeruangel						
5813111	7670951		Ngeruangl						
5813112	7670951		Ngaruangl						
5813113	7670955		Ngaruangel Reef - South Point						
5827429	7671031		US Army built Airfield WW2	1	1				
5905781	7671033		Angaur - Uplifted Limestone Island						
5813120	7671034		US Operation STALEMATE II  WW2						
7195123	7671034	link	https://en.wikipedia.org/wiki/Battle_of_Angaur						
5813122	7671040		LORAN-C Chain Angaur-Morotai						
5813123	7671040		LORAN-C Chain Angaur-Ulithi						
13498278	7671041	pau	Elechol ra Uchul a Kerekar	1		1	1		
13498426	7671042	en	US Assault Beach Blue WW2				1		
13498425	7671043	en	US Assault Beaches Green				1		
15223826	7671089	wkdt	Q31206624						
5827499	7671095		US National Register of Historic Places						
5827501	7671095		US Operation STALEMATE II WW2						
7180141	7671095	link	https://en.wikipedia.org/wiki/Battle_of_Peleliu						
5827494	7671096		Lukes						
7533747	7671223	link	https://en.wikipedia.org/wiki/Kloulklubed						
15738075	7701302	wkdt	Q31206632						
5881615	7701312		JP Thousand Man Cave WW2						
5881618	7701335		LORAN-A Chain Palau-Morotai WW2						
15400045	7701370	wkdt	Q31206641						
15229832	7701372	wkdt	Q31206650						
15205503	7701373	wkdt	Q31206659						
7043243	7701398	link	https://en.wikipedia.org/wiki/Ngebuked						
5881664	7701416		Compact Road						
5881665	7701417		Compact Road						
5883625	7701506		Airai Water Paradise Hotel & Spa						
5904494	7701529		Toachel Mid						
5883628	7701539		CAT - US Civic Action Team						
5883629	7701539		CAT - USN Seabees						
5883630	7701539		CAT - USA Construction Battalion						
7077031	7701549	link	https://en.wikipedia.org/wiki/Ngetkib						
15535946	7701549	wkdt	Q7022290						
5891451	7732278		Radio High Adventure T8BZ	1	1				
5891452	7732278		Radio Australia Short Wave Relay Station						
5891453	7732278		Radio Australia T8WH						
5891454	7732279		PALAU Pacific Area Long-term Atmospheric observation for Understanding of climate change						
5891455	7732279		CEOP Coordinated Energy and water cycle Observations Project						
15552171	7732282	wkdt	Q35276769						
15521400	7732283	wkdt	Q35270141						
5891456	7732286		JP Bauxite Loading Pier						
8409965	7732297	link	https://en.wikipedia.org/wiki/Ngardmau						
15477362	7732315	wkdt	Q31206667						
5891458	7732316	pau	Chelbacheb Islands	1					
16635513	7732317	link	https://en.wikipedia.org/wiki/Ngercheu						
16635514	7732317		Carp Island						
5891474	7732318		Seventy Islands						
5891475	7732319		Rock Islands						
5891483	7732328		Rock Islands						
5891484	7732329		Mercherchar Island						
5891485	7732329		Mercherchar Islands						
5891486	7732329		Rock Islands						
6889059	7732329	link	https://en.wikipedia.org/wiki/Eil_Malk						
5894458	7732378		Rock Islands						
5894459	7732379		Ulong Islands						
5894462	7732381		Rock Islands						
5894463	7732382		Ngeruktabel Islands						
5894464	7732382		Rock Islands						
5894478	7732396		Ngebedangel Island						
15627155	7732396	wkdt	Q31206675						
5894484	7732400		Ngeruktabel Islands						
5894488	7732402		Ngeruktabel Islands						
5894490	7732405		Ngeruktabel Island						
5905544	7732415		Little Tokyo						
15217517	7732415	wkdt	Q35699869						
5894524	7732458		Radio Station T8AA-AM						
5895939	7732509		Lighthouse Channel						
5899519	7732520		Long Island						
5905561	7732605		T-Docks						
5904483	7732613		Palau Public Aquarium - Koror						
5904484	7732614		RBYC Royal Belau Yacht Club						
5904485	7732614		Yachties Center						
5904487	7732617		-1914 German Colony						
5904488	7732617		-1945 Japanese Mandate						
5904489	7732617		-1994 US Mandate						
5904490	7732617		-2006 Republic of Palau						
5905393	7732695		Birir a re Ngarairrai						
5905396	7732695		Palau National Register of Historic Places						
5905397	7732695		US National Register of Historic Places						
5905399	7732695		Historic Traditional Meeting House						
5905401	7732697		All Ships and Aircrafts on Lagoon Bottom						
5905536	7732713		Barrier Reef Wrecked English East India Packet Antelope						
5905537	7732713		Antelope Captain Henry Wilson						
5905538	7732713		Ulong Islands						
5905539	7732717		Ulong Islands						
15904051	7732740	wkdt	Q55668993						
16153924	7732740	link	https://en.wikipedia.org/wiki/Etpison_Museum						
5905549	7732747		Airai and Koror Island Drinking Water Supply						
5905559	7732766		Euang el Chades						
5905562	7732769		Ngardmau Bauxite Export Pier pre-WW2						
5905563	7732772		Hawaiian Belau Rock Quarry						
5905656	7732920		Easternmost Point of Palau State						
5905657	7732921		Westernmost Point of Palau State						
5905669	7732922		Southernmost Point of Palau State						
5905671	7732926		Slumped Atoll 20 x 10 x 3 km						
5905690	7732952		Airport Extension Coral Fill						
13503056	8063361	ru	Нгерулмуд						
13503057	8063361	en	Ngerulmud						
13858590	8063361	link	https://en.wikipedia.org/wiki/Ngerulmud						
13895959	8063361	ko	응게룰무드						
15380879	8063361	wkdt	Q515229						
