1549980	4034891		Tuamua						
4316264	4034891		Toamua						
15466070	4034891	wkdt	Q32034161						
1549981	4034894	sm	Malo Sa’oloto Tuto’atasi o Samoa						
1549983	4034894		Western Samoa						
1549984	4034894		Samoa i Sisifo						
1562946	4034894	am	ሳሞአ	1					
1562947	4034894	ar	ساموا	1					
1562948	4034894	bg	Самоа	1					
1562949	4034894	cs	Samoa	1					
1562950	4034894	cy	Samoa	1					
1562951	4034894	da	Samoa	1					
1562952	4034894	de	Samoa	1					
1562953	4034894	el	Σαμόα	1					
1562954	4034894	en	Samoa	1					
1562955	4034894	eo	Samoo	1					
1562956	4034894	es	Samoa	1					
1562957	4034894	et	Samoa	1					
1562958	4034894	fa	ساموا						
1562959	4034894	fi	Samoa	1					
1562960	4034894	fo	Samoa	1					
1562961	4034894	fr	Samoa	1					
1562962	4034894	ga	Samó	1					
1562963	4034894	he	סמואה	1					
1562964	4034894	hr	Samoa	1					
1562965	4034894	hu	Szamoa	1					
1562966	4034894	hy	Սամոա	1					
1562967	4034894	id	Samoa	1					
1562968	4034894	is	Samóa	1					
1562969	4034894	it	Samoa	1					
1562970	4034894	ja	西サモア						
1562971	4034894	ka	სამოა	1					
1562972	4034894	km	សាម័រ	1					
1562973	4034894	ko	사모아	1					
1562974	4034894	lt	Samoa	1					
1562975	4034894	lv	Samoa	1					
1562976	4034894	mk	Самоа	1					
1562977	4034894	ms	Samoa	1					
1562978	4034894	mt	Samoa	1					
1562979	4034894	nb	Samoa	1					
1562980	4034894	nl	Samoa	1					
1562981	4034894	nn	Samoa						
1562982	4034894	pl	Samoa	1					
1562983	4034894	pt	Samoa	1					
1562984	4034894	ro	Samoa	1					
1562985	4034894	ru	Самоа	1					
1562986	4034894	sk	Samoa	1					
1562987	4034894	sl	Samoa	1					
1562988	4034894	sr	Самоа	1					
1562989	4034894	sv	Samoa	1					
1562990	4034894	ta	சமோவா	1					
1562991	4034894	th	ซามัว	1					
1562992	4034894	tr	Samoa	1					
1562993	4034894	uk	Самоа	1					
1562994	4034894	vi	Xa-moa						
1562995	4034894	zh	萨摩亚	1					
1980513	4034894	an	Samoa						
1980514	4034894	bs	Samoa	1					
1980515	4034894	ca	Samoa	1					
1980516	4034894	eu	Samoa	1					
1980517	4034894	fa	ساموآ	1					
1980518	4034894	gl	Samoa	1					
1980519	4034894	io	Samoa						
1980520	4034894	ja	サモア	1					
1980521	4034894	kw	Samoa						
1980522	4034894	la	Samoa						
1980523	4034894	mi	Hamoa						
1980524	4034894	nds	Samoa						
1980525	4034894	no	Samoa	1					
1980526	4034894	oc	Samoa						
1980527	4034894	ps	ساموا						
1980528	4034894	sa	समोआ						
1980529	4034894	se	Samoa	1					
1980530	4034894	hbs	Samoa						
1980531	4034894	sm	Samoa						
1980532	4034894	sq	Samoa	1					
1980533	4034894	th	ประเทศซามัว						
1980534	4034894	tl	Samoa						
1980535	4034894	tr	Bağımsız Samoa Devleti						
1980536	4034894	ty	Hāmoa						
1980537	4034894	ug	ساموئا	1					
1980538	4034894	vo	Samovuäns						
2421803	4034894	af	Samoa	1					
2421804	4034894	be	Самоа	1					
2421805	4034894	bn	সামোয়া	1					
2421806	4034894	bo	ནུ་བ་ས་མོ་འ།	1					
2421807	4034894	hi	समोआ	1					
2421808	4034894	hu	Samoa	1					
2421809	4034894	ia	Samoa	1					
2421810	4034894	lv	Rietumsamoa	1					
2421811	4034894	to	Haʻamoa	1					
2421812	4034894	ur	ساموآ	1					
2421813	4034894	vi	Xa-moa (Samoa)	1					
2920280	4034894	link	https://en.wikipedia.org/wiki/Samoa						
3056859	4034894	link	https://ru.wikipedia.org/wiki/%D0%A1%D0%B0%D0%BC%D0%BE%D0%B0						
4316265	4034894	en	Independent State of Samoa						
7091951	4034894	ak	Samoa	1					
7091952	4034894	az	Samoa	1					
7091953	4034894	bm	Samowa	1					
7091954	4034894	br	Samoa	1					
7091955	4034894	ee	Samoa nutome	1					
7091956	4034894	ff	Samowaa	1					
7091957	4034894	gu	સમોઆ	1					
7091958	4034894	ha	Samoa	1					
7091959	4034894	ki	Samoa	1					
7091960	4034894	kl	Samoa	1					
7091961	4034894	kn	ಸಮೋವಾ	1					
7091962	4034894	ku	Samoa	1					
7091963	4034894	lg	Samowa	1					
7091964	4034894	ln	Samoa	1					
7091965	4034894	lu	Samoa	1					
7091966	4034894	mg	Samoa	1					
7091967	4034894	ml	സമോവ	1					
7091968	4034894	mr	सामोआ	1					
7091969	4034894	nd	Samowa	1					
7091970	4034894	ne	सामोआ	1					
7091971	4034894	or	ସାମୋଆ	1					
7091972	4034894	rm	Samoa	1					
7091973	4034894	rn	Samowa	1					
7091974	4034894	sg	Samoäa	1					
7091975	4034894	si	සැමෝවා	1					
7091976	4034894	sn	Samoa	1					
7091977	4034894	so	Samoowa	1					
7091978	4034894	sw	Samoa	1					
7091979	4034894	te	సమోవా	1					
7091980	4034894	ti	ሳሞአ	1					
7091981	4034894	yo	Samọ	1					
7091982	4034894	zu	i-Samoa	1					
16925896	4034894	zh-Hant	薩摩亞	1					
16932087	4034894	as	চামোৱা	1					
16932088	4034894	ce	Самоа	1					
16932089	4034894	dz	ས་མོ་ཨ	1					
16932090	4034894	fy	Samoa	1					
16932091	4034894	gd	Samotha	1					
16932092	4034894	ig	Samoa	1					
16932093	4034894	jv	Samoa	1					
16932094	4034894	kk	Самоа	1					
16932095	4034894	ks	سیمووا	1					
16932096	4034894	ky	Самоа	1					
16932097	4034894	lb	Samoa	1					
16932098	4034894	lo	ຊາມົວ	1					
16932099	4034894	mn	Самоа	1					
16932100	4034894	my	ဆမိုးအား	1					
16932101	4034894	pa	ਸਾਮੋਆ	1					
16932102	4034894	ps	ساماوا	1					
16932103	4034894	qu	Samoa	1					
16932104	4034894	sd	ساموا	1					
16932105	4034894	tg	Самоа	1					
16932106	4034894	tk	Samoa	1					
16932107	4034894	tt	Самоа	1					
16932108	4034894	uz	Samoa	1					
16932109	4034894	wo	Samowa	1					
16932110	4034894	yi	סאַמאאַ	1					
2989080	4034896	link	https://en.wikipedia.org/wiki/Vavau%2C_Samoa						
4316266	4034896		Vavau						
15494098	4034897	wkdt	Q32039195						
15960064	4034897		Vaovai						
2808475	4034899		Vaivase River						
4316267	4034899		Vaivase Stream						
16949273	4034899		Vaivase						
1549985	4034903		Vaiasa						
2989081	4034903	link	https://en.wikipedia.org/wiki/Vaiusu						
4316268	4034903		Vaiusu						
2808476	4034905		Vaitupua						
4316269	4034905		Vaotupua						
1549986	4034906		Vaitoa						
4316270	4034906		Mount Vaitoa						
15524543	4034906	wkdt	Q31672318						
1549987	4034907		Vattele Bay						
4316271	4034907		Vaitele Bay						
1549988	4034908		Vaitele Plantation						
4316272	4034908		Vaitele						
16202710	4034908	link	https://en.wikipedia.org/wiki/Vaitele						
16949274	4034909		Vaisigano River						
16949275	4034909		Vaisigano						
5701432	4034910	link	https://en.wikipedia.org/wiki/Vaisigano						
7996241	4034910		Vaisigano						
9393303	4034910	el	Βαϊσιγκάνο						
9393304	4034910	ko	바이시가노 구						
9393305	4034910	la	Itu Asau						
9393306	4034910	mrj	Ваисигано						
9393307	4034910	ru	Ваисигано						
11761529	4034910	fr	Vaisigano						
2989082	4034912	link	https://en.wikipedia.org/wiki/Vaisala_%28Samoa%29						
4316273	4034912		Vaisala						
16076642	4034913	link	https://en.wikipedia.org/wiki/Vaipua						
16080375	4034913		Vaipu’a						
15619276	4034914	wkdt	Q32038828						
15960065	4034914		Vaipouli						
2808477	4034915		Vaiolo						
4316274	4034915		Mount Vaiolo						
15401209	4034915	wkdt	Q31400633						
1549989	4034916		Vainamo						
1549990	4034916		Mulivai Tane						
4316275	4034916		Vainamo Bay						
7072251	4034917	link	https://en.wikipedia.org/wiki/Vaimoso						
7119024	4034917		Vaimoso						
2808478	4034920		Vailutai						
4316276	4034920		Vailu‘utai						
15565048	4034921	wkdt	Q32038798						
15960066	4034921		Vailoa						
2989083	4034924	link	https://en.wikipedia.org/wiki/Vailima%2C_Samoa						
4316277	4034924		Vailima						
1549992	4034927		Vailele Mountain						
1549993	4034927		Vailele Berg						
4316278	4034927		Mount Vailele						
1549996	4034929		Vaiyee Point						
2808479	4034929		Vaijee Point						
4316279	4034929		Vaie‘e Point						
15259837	4034929	wkdt	Q32038765						
1549997	4034930		Vaiyee’ Itai						
1549998	4034930		Vaie’e						
2989084	4034930	link	https://en.wikipedia.org/wiki/Vaiee						
4316280	4034930		Vaijee’itai						
1549999	4034933		Losuiga						
4316281	4034933		Point Vaigaga						
15598728	4034933	wkdt	Q31997280						
15454411	4034934	wkdt	Q32038769						
15960067	4034934		Vaigaga						
1550000	4034938		Vailoa						
6904684	4034938	link	https://en.wikipedia.org/wiki/Vailoa						
15301084	4034938	wkdt	Q7908783						
11301571	4034939	link	https://en.wikipedia.org/wiki/Vaiala						
11392532	4034939		Vaiala						
15229317	4034939	wkdt	Q32038750						
2808480	4034940		Vaiala						
4316282	4034940		Mount Vaiala						
15677488	4034940	wkdt	Q31400636						
1550001	4034942		Apia						
1550002	4034942		Vaea Mountain						
1550003	4034942		Mount Apia						
2808481	4034942		Vaea Vorberg						
4316283	4034942		Mount Vaea						
5759345	4034942	link	https://en.wikipedia.org/wiki/Mount_Vaea						
5700364	4034943	link	https://en.wikipedia.org/wiki/Va%27a-o-Fonoti						
7996242	4034943		Va‘a-o-Fonoti						
11761528	4034943	fr	Va'a-o-Fonoti						
1550004	4034944		Vaaifetu						
2808482	4034944		Mount Vaaifetu						
2808483	4034944		Leading Peak						
4316284	4034944		Mauga Tele						
15381759	4034944	wkdt	Q31672335						
1550006	4034947		Eld’s Point						
2808484	4034947		Mohican Point						
2808485	4034947		Salimu Point						
2808486	4034947		Sharp Point						
2808487	4034947		Utuloa						
4316285	4034947		Utuloa Point						
15206733	4034947	wkdt	Q32038024						
15839874	4034949	wkdt	Q32038011						
15960068	4034949		Utulaelae						
1550007	4034950		Utuie Island						
4316286	4034950		Utuie						
15301553	4034950	wkdt	Q32038003						
1550009	4034955		Tafua						
2808488	4034955		Tafua Upolu						
4316287	4034955		Mount Tafua Upolu						
1550010	4034956		Upolu Island						
1550011	4034956		Ojolava						
1550012	4034956		Opoloo						
1931148	4034956	en	Upolu						
1931149	4034956	de	Upolu						
1931150	4034956	es	Upolu						
1931151	4034956	ca	Upolu						
1931152	4034956	fi	Upolu						
1931153	4034956	he	אופולו						
1931154	4034956	nl	Upolu						
1931155	4034956	sr	Уполу						
1931156	4034956	sv	Upolu						
2006393	4034956	fr	Upolu						
2989085	4034956	link	https://en.wikipedia.org/wiki/Upolu						
4316288	4034956		Upolu						
8724238	4034956	be	Востраў Уполу						
8724239	4034956	ja	ウポル島						
8724240	4034956	ko	우폴루 섬						
8724241	4034956	mrj	Уполу						
8724242	4034956	uk	Уполу						
8724243	4034956	nan	Upolu Tó						
8724244	4034956	ru	Уполу						
8724245	4034956	zh	乌波卢岛						
11362830	4034956	ka	უპოლუ						
11362831	4034956	ur	اوپولو						
15653386	4034956	wkdt	Q274569						
11310842	4034957	link	https://en.wikipedia.org/wiki/Ulutogia						
11392533	4034957		Ulutogia						
2989086	4034962	link	https://en.wikipedia.org/wiki/Uafato						
4316289	4034962		Uafato						
4316290	4034962		Atoe						
2808489	4034965		Tulaele Farm						
4316291	4034965		Tulaele						
2808490	4034966		Tuiolemu						
4316292	4034966		Cape Tuiolemū						
15333162	4034966	wkdt	Q31889893						
1550014	4034967		Tutu Tafu						
1550015	4034967		Tutu Tafoe						
4316293	4034967		Tufutafoe						
7080155	4034967	link	https://en.wikipedia.org/wiki/Tufutafoe						
15376969	4034968	wkdt	Q32036264						
15960069	4034968		Tufulele						
1550016	4034970		Cape Tuasiui						
4316294	4034970		Cape Tuasivi						
1550017	4034971		Tuasavi						
4316295	4034971		Tuasivi						
7043440	4034971	link	https://en.wikipedia.org/wiki/Tuasivi						
15419091	4034971	wkdt	Q7850667						
13633600	4034972	link	https://en.wikipedia.org/wiki/Tuana%27i						
13638713	4034972		Tuana‘i						
1550018	4034974		Tuamasaga Saute						
1550019	4034974		Itu I Toga						
1550020	4034974		Tuamasanga Saute						
4316296	4034974		Tuamasaga South						
1550021	4034975		Tuamasagna Matu						
1550022	4034975		Tuamasaga Matu						
4316297	4034975		Tuamasaga North						
5701419	4034977	link	https://en.wikipedia.org/wiki/Tuamasaga						
7996243	4034977		Tuamasaga						
9393331	4034977	el	Τουαμασάγκα						
9393332	4034977	ko	투아마사가 구						
9393333	4034977	mrj	Туамасага						
9393334	4034977	ru	Туамасага						
9393335	4034977	zh	图阿马萨加						
11560362	4034977	ka	ტუამასაგა						
11560363	4034977	ur	تواماساگا						
11761519	4034977	fr	Tuamasaga						
1550023	4034980		Toiavea						
4316298	4034980		Mount To’iave’a						
2808491	4034984		Tiapepe						
4316299	4034984		Cape Tiāpepe						
1550024	4034986		Teelagi						
4316300	4034986		Mount Teelagi						
15508387	4034986	wkdt	Q31672385						
1550025	4034989		Tatania						
4316301	4034989		Tatania Bay						
1550028	4034991		Naneivi						
1550029	4034991		Tapuiri Point						
2808492	4034991		Sandy Point						
4316302	4034991		Tapuivi Point						
15663012	4034991	wkdt	Q32027477						
15456290	4034992	wkdt	Q32027469						
15960070	4034992		Tapueleele						
1550030	4034993		Tapaga Point						
1550031	4034993		Tapanga Point						
4316303	4034993		Cape Tapaga						
1550032	4034995		Tanumamanono						
4316304	4034995		Tanugamanono						
7072261	4034995	link	https://en.wikipedia.org/wiki/Tanugamanono						
2989087	4034998	link	https://en.wikipedia.org/wiki/Taga%2C_Samoa						
4316305	4034998		Taga						
2989088	4034999	link	https://en.wikipedia.org/wiki/Tafua						
4316306	4034999		Tafua						
2989089	4035000	link	https://en.wikipedia.org/wiki/Tafitoala						
4316307	4035000		Tafitoala						
15320937	4035001	wkdt	Q32026624						
15960071	4035001		Tafatafa Point						
15282507	4035002	wkdt	Q31672419						
15960072	4035002		Mount Tafatafao						
15327203	4035003	wkdt	Q32026620						
15960073	4035003		Tafatafa						
1550033	4035006		Fa Tafaga						
4316308	4035006		Foa Tafaga						
14943286	4035007	wkdt	Q32026602						
15960074	4035007		Taelefaga						
16076645	4035007	link	https://en.wikipedia.org/wiki/Ta%27elefaga						
15470006	4035010	wkdt	Q31997275						
15960075	4035010		Point Suga						
2989090	4035013	link	https://en.wikipedia.org/wiki/Solosolo						
4316309	4035013		Solosolo						
2808493	4035015		Solaua Plantation						
4316310	4035015		Solaua						
1550037	4035016		Songi						
4316311	4035016		Sogi						
16076646	4035018	link	https://en.wikipedia.org/wiki/Siutu						
16080376	4035018		Siutu						
15505462	4035019	wkdt	Q32021011						
15960076	4035019		Siusega						
2989091	4035021	link	https://en.wikipedia.org/wiki/Siuniu						
4316312	4035021		Si’uniu						
5423878	4035023	en	Siumu Village						
5436779	4035023		Si’umu						
13633589	4035023	link	https://en.wikipedia.org/wiki/Siumu						
1550038	4035026		Siope						
4316313	4035026		Mount Siope						
15672603	4035026	wkdt	Q31672435						
1550040	4035028		Mount Mauga Silisili						
2808494	4035028		Mauga Silisili						
4316314	4035028		Mount Silisili						
5759845	4035028	link	https://en.wikipedia.org/wiki/Silisili						
7049079	4035029	link	https://en.wikipedia.org/wiki/Sili						
7119025	4035029		Sili						
1550041	4035030		Sigaele						
4316315	4035030		Mount Siga’ele						
1550043	4035034		Tafua Savaii Hill						
2808495	4035034		Tafua Savai‘i						
4316316	4035034		Mount Tafua Savai’i						
1550044	4035036		Sawaii						
1550045	4035036		Oteewhy						
1550046	4035036		Chatham Island						
1550047	4035036		Pola						
1550048	4035036		Savaii Island						
1550049	4035036		Shavie						
4316317	4035036		Savai’i						
5704183	4035036	link	https://en.wikipedia.org/wiki/Savai%27i						
7071957	4035037	link	https://en.wikipedia.org/wiki/Savaia						
7119026	4035037		Savaia						
15292258	4035037	wkdt	Q7427797						
1550050	4035039		Samauga Point						
4316318	4035039		Saumaga Point						
15349393	4035039	wkdt	Q32016120						
1550051	4035041		Sauango Bay						
2808496	4035041		Ali						
4316319	4035041		Sauago Bay						
1550052	4035042		Asauana						
1550053	4035042		Sauano						
1550054	4035042		Sauango						
2808497	4035042		Samauga						
4316320	4035042		Sauago						
2808498	4035043		Satupa’itea Road						
4316321	4035043		Satufia Road						
15473506	4035044	wkdt	Q32016100						
15960077	4035044		Satupa‘itea Point						
13292991	4035045	sm	Satupa‘itea						
13292992	4035045	sm	Satupaitea						
13633588	4035045	link	https://en.wikipedia.org/wiki/Satupa%27itea						
5701403	4035046	link	https://en.wikipedia.org/wiki/Satupa%27itea						
7996244	4035046		Satupa‘itea						
11761527	4035046	fr	Satupa'itea						
7073139	4035049	link	https://en.wikipedia.org/wiki/Satuiatua						
7119027	4035049		Satuiatua						
15274191	4035050	wkdt	Q32016082						
15960078	4035050		Satui						
7070634	4035051	link	https://en.wikipedia.org/wiki/Satufia						
7119028	4035051		Satufia						
6899192	4035052	link	https://en.wikipedia.org/wiki/Sato%27alepai						
6923177	4035052		Sato’alepai						
15632154	4035053	wkdt	Q32016074						
15960079	4035053		Satitoa						
2989092	4035056	link	https://en.wikipedia.org/wiki/Sataua						
4316322	4035056		Sataua						
15775982	4035056	wkdt	Q7425958						
6901044	4035059	link	https://en.wikipedia.org/wiki/Satapuala						
6923178	4035059		Satapuala						
1550055	4035060		Saautaua						
2989093	4035060	link	https://en.wikipedia.org/wiki/Sataoa						
4316323	4035060		Sataoa						
15513150	4035061	wkdt	Q32016053						
15960080	4035061		Satalo						
8686082	4035062	link	https://en.wikipedia.org/wiki/Sasina%2C_Samoa						
8802880	4035062		Sasina						
15738026	4035063	wkdt	Q32015960						
15960081	4035063		Sapunaoa						
16076648	4035064	link	https://en.wikipedia.org/wiki/Sapulu						
16080377	4035064		Sapulu						
7056718	4035066	link	https://en.wikipedia.org/wiki/Sapapali%27i						
7119029	4035066		Sapapali’i						
15429490	4035070	wkdt	Q32015175						
15960082	4035070		Samusu Point						
1550057	4035072		Baumann Islands						
1550058	4035072		Bauman Islands						
1550059	4035072		Navigators Islands						
1550060	4035072		Samoan Islands						
1550061	4035072		Navigator Islands						
1550062	4035072		Samoa						
1550063	4035072		Îles des Navigateurs						
2296512	4035072	fr	Iles de Samoa						
4316324	4035072		Samoa Islands						
15655560	4035073	wkdt	Q32015122						
15960083	4035073		Samea						
16076649	4035074	link	https://en.wikipedia.org/wiki/Samauga						
7077178	4035075	link	https://en.wikipedia.org/wiki/Samatau						
7119030	4035075		Samatau						
1550064	4035076		Samata						
4316325	4035076		Samataitai						
16076651	4035076	link	https://en.wikipedia.org/wiki/Samata-i-Tai						
4316326	4035078		Samamea						
4316327	4035078		Spitzerberg						
7070796	4035078	link	https://en.wikipedia.org/wiki/Samamea						
15589357	4035078	wkdt	Q1837779						
16076650	4035079	link	https://en.wikipedia.org/wiki/Samalae%27ulu						
16080378	4035079		Samalaeulu						
1550065	4035081		Saluafata Harbor						
4316328	4035081		Saluafata Harbour						
16076653	4035085	link	https://en.wikipedia.org/wiki/Salimu						
16080379	4035085		Salimu						
15458569	4035089	wkdt	Q32014888						
15960084	4035089		Salesatele						
1550066	4035090		Saletele						
4316329	4035090		Salesatele						
15651934	4035090	wkdt	Q32014891						
15512119	4035091	wkdt	Q32014880						
15960085	4035091		Salepou‘a‘e						
1550067	4035092		Salelolonga						
2989094	4035092	link	https://en.wikipedia.org/wiki/Salelologa						
4316330	4035092		Salelologa						
13821681	4035092	unlc	WSSAL						
15611720	4035093	wkdt	Q32014873						
15960086	4035093		Salelesi						
2808499	4035094		Salelavalu						
4316331	4035094		Salelavalu-uta						
16076654	4035094	link	https://en.wikipedia.org/wiki/Salelavalu_Uta						
13633587	4035095	link	https://en.wikipedia.org/wiki/Saleimoa						
13638714	4035095		Sale’imoa						
15207019	4035096	wkdt	Q32014870						
15960087	4035096		Saleilua						
16076680	4035097	link	https://en.wikipedia.org/wiki/Saleia						
16080380	4035097		Salei’a						
13633586	4035099	link	https://en.wikipedia.org/wiki/Saleaula						
1550068	4035100		Savaii						
4316332	4035100		Saleaula						
13821682	4035100	unlc	WSSAV						
7175586	4035101	link	https://en.wikipedia.org/wiki/Saleaula						
7323652	4035101		Saleaula						
7075702	4035103	link	https://en.wikipedia.org/wiki/Saleapaga						
7119031	4035103		Saleapaga						
1550070	4035105		Saleaumua						
1550071	4035105		Saleamua						
4316333	4035105		Sale’a’aumua						
2989095	4035108	link	https://en.wikipedia.org/wiki/Salamumu						
4316334	4035108		Salamumu						
15653582	4035108	wkdt	Q7403613						
1550072	4035109		Salcalua Bay						
1550073	4035109		Salealua						
1550074	4035109		Salealua Bay						
4316335	4035109		Sala’ilua Bay						
1550075	4035110		Salealua						
4316336	4035110		Sala’ilua						
13633585	4035110	link	https://en.wikipedia.org/wiki/Salailua						
7074626	4035111	link	https://en.wikipedia.org/wiki/Saipipi						
7119032	4035111		Saipipi						
15331711	4035112	wkdt	Q32014596						
15960088	4035112		Saina						
7040847	4035113	link	https://en.wikipedia.org/wiki/Sagone						
7119033	4035113		Sagone						
16076679	4035116	link	https://en.wikipedia.org/wiki/Safune						
16080381	4035116		Safune						
1550077	4035117		Safotulafei						
1550078	4035117		Safatulafei						
4316337	4035117		Safotulafai						
6908220	4035117	link	https://en.wikipedia.org/wiki/Safotulafai						
6877410	4035118	link	https://en.wikipedia.org/wiki/Safotu						
6923179	4035118		Safotu						
15394249	4035118	wkdt	Q2165046						
1550079	4035119		Safata Bay						
1550080	4035119		Safata Harbor						
4316338	4035119		Safata Harbour						
7070635	4035120	link	https://en.wikipedia.org/wiki/Safa%27atoa						
7119034	4035120		Safa’atoa						
2808500	4035121		Safa						
4316339	4035121		Safa’i						
7069793	4035121	link	https://en.wikipedia.org/wiki/Safa%27i						
2808501	4035122		Cape Tasisia						
4316340	4035122		Cape Saeiva’a						
1550082	4035123		Sasaai						
4316341	4035123		Sa’asa’ai						
7072772	4035123	link	https://en.wikipedia.org/wiki/Sa%27asa%27ai						
16949276	4035124		Sa’anapu River						
16949277	4035124		Saanapu						
15610646	4035127	wkdt	Q32010389						
15960089	4035127		Round Point						
7076399	4035130	link	https://en.wikipedia.org/wiki/Puleia						
7119035	4035130		Puleia						
2808502	4035131		Pula						
4316342	4035131		Mount Puna						
15549416	4035131	wkdt	Q31672462						
2808503	4035132		Pui Pau						
4316343	4035132		Puipa’a						
7081814	4035135	link	https://en.wikipedia.org/wiki/Pu%27apu%27a						
7119036	4035135		Pu’apu’a						
1550083	4035136		Tonga Point						
2808504	4035136		Cape Pua-a						
4316344	4035136		Cape Puava						
7068806	4035137	link	https://en.wikipedia.org/wiki/Poutasi						
7119037	4035137		Poutasi						
15598623	4035137	wkdt	Q2775929						
4316345	4035139		Piu						
4316346	4035139		Gaogao						
6896095	4035141	link	https://en.wikipedia.org/wiki/Patamea						
6923180	4035141		Patamea						
15656412	4035142	wkdt	Q31984979						
15960090	4035142		Pata						
16076677	4035142	link	https://en.wikipedia.org/wiki/Pata,_Samoa						
15260016	4035143	wkdt	Q31672476						
15960091	4035143		Mount Parasit						
12190040	4035150		Papa Uta						
12195792	4035150		Papa						
16076676	4035150	link	https://en.wikipedia.org/wiki/Papa,_Samoa						
1550090	4035151		Zu Palauli						
4316347	4035151		Palauli West						
1550091	4035152		Palauli Anchorage						
4316348	4035152		Palauli Bay						
13633577	4035153	link	https://en.wikipedia.org/wiki/Palauli						
13638715	4035153		Palauli						
1550092	4035154		Palauli East						
5701122	4035154	link	https://en.wikipedia.org/wiki/Palauli						
7996245	4035154		Palauli						
9393325	4035154	el	Παλάουλι						
9393326	4035154	ko	팔라울리 구						
9393327	4035154	mrj	Палаули						
9393328	4035154	ru	Палаули						
11607787	4035154	ka	პალაული						
11607788	4035154	ur	پالاولی						
11761526	4035154	fr	Palauli						
15264124	4035155	wkdt	Q31982407						
15960092	4035155		Paia						
1550093	4035156		Cape Paepaealeia						
1550094	4035156		South East Cape						
1550095	4035156		Cape Paeapaealeia						
4316349	4035156		Cape Paepaeole’ia						
1550096	4035157		Autu Point						
4316350	4035157		Ooutu						
15690860	4035157	wkdt	Q32505363						
2808505	4035158		Olomanu						
4316351	4035158		Mount Olomanu						
15481408	4035158	wkdt	Q31672490						
1550097	4035160		Cape Oloinono						
2808506	4035160		Cape Olionono						
4316352	4035160		Cape Olonono						
1550098	4035162		Olemaga						
2808507	4035162		Mount Olemaga						
2808508	4035162		Mt. Olomauga						
4316353	4035162		Mount Olomauga						
2808509	4035164		Cape Nuutoi						
4316354	4035164		Cape Niuatoi						
1550102	4035165		Vini						
2808510	4035165		Nu’utele						
4316355	4035165		Nu’utele Island						
7511240	4035165	link	https://en.wikipedia.org/wiki/Nu%27utele						
1550104	4035166		Niusuatia						
15595519	4035166	wkdt	Q31970892						
1550105	4035167		Satalo						
2808511	4035167		Nuusafee						
4316356	4035167		Nu’usafe’e Island						
6890073	4035167	link	https://en.wikipedia.org/wiki/Nu%27usafe%27e_Island						
1550106	4035168		Nuuluai Island						
2808512	4035168		Nu’ulua						
4316357	4035168		Nu’ulua Island						
7509189	4035168	link	https://en.wikipedia.org/wiki/Nu%27ulua						
13289863	4035168	en	Nuulua Island						
1550108	4035169		Nulopa Islet						
1550109	4035169		Nu’ulopa Islet						
2808513	4035169		Nu’ulopa						
4316358	4035169		Nulopa Island						
7551023	4035169	link	https://en.wikipedia.org/wiki/Nu%27ulopa						
15505735	4035169	wkdt	Q31973466						
1550110	4035171		Muualuga Point						
4316359	4035171		Nuualaga						
15330531	4035171	wkdt	Q31973534						
16191478	4035172	link	https://en.wikipedia.org/wiki/Nu%27u%2C_Samoa						
16211940	4035172		Nuu						
13633578	4035174	link	https://en.wikipedia.org/wiki/Nofoali%27i						
13638716	4035174		Nofoali‘i						
15527496	4035174	wkdt	Q31971483						
2989096	4035176	link	https://en.wikipedia.org/wiki/Neiafu_%28Samoa%29						
4316360	4035176		Neiafu						
2808514	4035180		Namua						
4316361	4035180		Namu’a Island						
6889683	4035180	link	https://en.wikipedia.org/wiki/Namua						
1550113	4035184		Muliatele						
4316362	4035184		Mutiatele						
15634813	4035184	wkdt	Q31963924						
7080967	4035185	link	https://en.wikipedia.org/wiki/Musumusu						
7119039	4035185		Musumusu						
15698832	4035185	wkdt	Q15260418						
1550114	4035186		Mulivai River						
2808515	4035186		Mulivau River						
4316363	4035186		Mulivai Stream						
1550115	4035187		Malivai						
4316364	4035187		Mulivai						
15604384	4035187	wkdt	Q31960909						
13289898	4035190	en	Mulinuu Point						
1550116	4035191		Falealupo						
1550117	4035191		Cape Falealupo						
4316365	4035191		Cape Mulinu’ū						
7052937	4035192	link	https://en.wikipedia.org/wiki/Mulinu%27u						
7119040	4035192		Mulinu’u						
2808516	4035193		Mulimauga						
4316366	4035193		Mount Mulimauga						
15250971	4035193	wkdt	Q31672516						
1550118	4035195		Mulifanua Harbor						
4316367	4035195		Mulifanua Harbour						
2989097	4035196	link	https://en.wikipedia.org/wiki/Mulifanua						
4316368	4035196		Mulifanua						
13633579	4035197	link	https://en.wikipedia.org/wiki/Motootua						
13638717	4035197		Moto‘otua						
1550119	4035200		Mootaa						
4316369	4035200		Moata‘a						
13633580	4035200	link	https://en.wikipedia.org/wiki/Moata%27a						
2808517	4035202		Misamala						
4316370	4035202		Mount Misimala						
15425556	4035202	wkdt	Q31400638						
1550120	4035203		Mount Maungaloa						
2808518	4035203		Maungaloa						
4316371	4035203		Mount Maugaloa						
15416407	4035203	wkdt	Q31672533						
1550122	4035204		Mauga						
4316372	4035204		Cape Mauga						
2808519	4035206		Matavanu						
4316373	4035206		Mount Matavanu						
5713789	4035206	link	https://en.wikipedia.org/wiki/Mount_Matavanu						
2808520	4035208		Matavai						
4316374	4035208		Muliolo Stream						
15502653	4035209	wkdt	Q31951719						
15960093	4035209		Matavai						
15748042	4035211	wkdt	Q31951707						
15960094	4035211		Matautu Point						
1550124	4035212		Mataatu Harbor						
4316375	4035212		Matautu Bay						
15380624	4035213	wkdt	Q31951693						
15960095	4035213		Matautu						
15507861	4035214	wkdt	Q31951688						
15960096	4035214		Matautu						
15536277	4035216	wkdt	Q35726263						
15960097	4035216		Matāutu						
16076671	4035216	link	https://en.wikipedia.org/wiki/Matautu						
7070860	4035217	link	https://en.wikipedia.org/wiki/Matatufu						
7119041	4035217		Matatufu						
15255041	4035217	wkdt	Q6786156						
2808521	4035222		Cape Matafotufotu						
4316376	4035222		Point Matafotufotu						
15574786	4035222	wkdt	Q32514355						
2808522	4035224		Matafangatele						
4316377	4035224		Matafagatele						
2808523	4035225		Mata’aga						
4316378	4035225		Mount Mata’aga						
1550127	4035228		Manona						
2808524	4035228		Manono						
2989098	4035228	link	https://en.wikipedia.org/wiki/Manono_Island						
4316379	4035228		Manono Island						
15586298	4035229	wkdt	Q31949144						
15960098	4035229		Maninoa						
7065402	4035231	link	https://en.wikipedia.org/wiki/Manase						
7119042	4035231		Manase						
15625465	4035231	wkdt	Q6746989						
2808525	4035232		Manao Mia						
4316380	4035232		Mount Mana’omia						
2989099	4035234	link	https://en.wikipedia.org/wiki/Malua						
4316381	4035234		Malua						
15258744	4035234	wkdt	Q6744944						
7075391	4035236	link	https://en.wikipedia.org/wiki/Malie						
7119043	4035236		Malie						
2808526	4035237		Malauli						
4316382	4035237		Maalauli						
15503178	4035238	wkdt	Q31672575						
15960099	4035238		Malaulano See						
1550129	4035244		Mangia						
4316383	4035244		Magia						
1550130	4035245		Mafane						
4316384	4035245		Mount Mafane						
2808527	4035247		Maauga						
4316385	4035247		Mauga						
1550131	4035248		Masima						
4316386	4035248		Maasina						
15655627	4035248	wkdt	Q31946073						
16076670	4035248	link	https://en.wikipedia.org/wiki/Maasina,_Samoa						
7043208	4035249	link	https://en.wikipedia.org/wiki/Lufilufi						
7119044	4035249		Lufilufi						
13633582	4035250	link	https://en.wikipedia.org/wiki/Luatuanu%27u						
13638718	4035250		Luatuanu‘u						
1550132	4035251		Lotofanga						
4316387	4035251		Lotofaga						
6901657	4035251	link	https://en.wikipedia.org/wiki/Lotofaga						
8157672	4035251		Lotofago						
15429997	4035251	wkdt	Q6684810						
1550133	4035252		Lotofanga						
4316388	4035252		Lotofagā						
15435406	4035252	wkdt	Q31943898						
16076663	4035252	link	https://en.wikipedia.org/wiki/Lotofaga						
15206101	4035254	wkdt	Q31943452						
15960100	4035254		Lona						
16076662	4035254	link	https://en.wikipedia.org/wiki/Lona,_Samoa						
15310297	4035255	wkdt	Q31942801						
15960101	4035255		Levī						
15296882	4035256	wkdt	Q31942797						
15960102	4035256		Levi						
2808528	4035259		Leuo Point						
4316389	4035259		Leuo						
15443148	4035259	wkdt	Q31942784						
1550135	4035260		Leulumoenga						
2989100	4035260	link	https://en.wikipedia.org/wiki/Leulumoega						
4316390	4035260		Leulumoega						
15358882	4035261	wkdt	Q31942775						
15960103	4035261		Letui						
1550136	4035262		Letongo River						
2808529	4035262		Letogo River						
4316391	4035262		Letogo Stream						
1550137	4035263		Letongo						
2989101	4035263	link	https://en.wikipedia.org/wiki/Letogo						
4316392	4035263		Letogo						
15372884	4035263	wkdt	Q6533464						
2808530	4035264		Letaupe						
4316393	4035264		Leatupe						
15614404	4035265	wkdt	Q31942395						
15960104	4035265		Le Solo						
1550138	4035266		Le Pue						
4316394	4035266		Mount Le Pu’e						
2808531	4035267		Le Pu						
4316395	4035267		O le Pupu						
7067049	4035268	link	https://en.wikipedia.org/wiki/Lepea						
7119045	4035268		Lepea						
14934986	4035268	wkdt	Q6527333						
6901457	4035270	link	https://en.wikipedia.org/wiki/Lepa%2C_Samoa						
6923181	4035270		Lepā						
6900852	4035273	link	https://en.wikipedia.org/wiki/Lelepa						
6923182	4035273		Lelepa						
1550140	4035274		Lefanga Bay						
4316396	4035274		Lefaga Bay						
7079088	4035275	link	https://en.wikipedia.org/wiki/Lefaga						
7119046	4035275		Lefaga						
1550142	4035280		Leagiaga						
4316397	4035280		Leagiagi						
15261479	4035280	wkdt	Q31942404						
15590895	4035282	wkdt	Q31672619						
15960105	4035282		Mount Lauti						
2808532	4035283		Lauli‘i River						
4316398	4035283		Lauli’i Stream						
11315020	4035284	link	https://en.wikipedia.org/wiki/Lauli%27i						
11392534	4035284		Lauli’i						
1550143	4035287		Lata Uta						
4316399	4035287		Lataiuta						
15365551	4035287	wkdt	Q31672634						
1550144	4035290		Lanotoo						
2808533	4035290		Lanutoo						
4316400	4035290		Lake Lanoto’o						
1550145	4035291		Mount Lano Atata						
4316401	4035291		Mount Lanutata						
15496050	4035291	wkdt	Q31672652						
2808534	4035292		Lanutata						
4316402	4035292		Lake Lanoataata						
2808535	4035293		Mount Lanomoa						
4316403	4035293		Mount Lanotai						
15322274	4035293	wkdt	Q31672668						
1550146	4035294		Lauo						
4316404	4035294		Lano						
15264725	4035294	wkdt	Q31942253						
16076681	4035294	link	https://en.wikipedia.org/wiki/Lano,_Samoa						
15532644	4035296	wkdt	Q31941647						
15960106	4035296		Lalovi						
1550147	4035299		Lalamauga						
4316405	4035299		Lalomauga						
2989102	4035300	link	https://en.wikipedia.org/wiki/Lalomanu						
4316406	4035300		Lalomanu						
15418607	4035300	wkdt	Q6480561						
2989103	4035301	link	https://en.wikipedia.org/wiki/Lalomalava						
4316407	4035301		Lalomalava						
13821679	4035301	unlc	WSLAV						
2808536	4035302		Laloanea						
4316408	4035302		Lake Lanoanea						
2989104	4035304	link	https://en.wikipedia.org/wiki/Tino_i_Iva_village						
4316409	4035304		Iva						
1550148	4035305		Atua Itu Anoamaa						
4316410	4035305		Itu Anoamaa						
15511951	4035309	wkdt	Q31916848						
15960107	4035309		Gautavai						
1550149	4035310		Gaitavai						
4316411	4035310		Gataivai						
7078624	4035310	link	https://en.wikipedia.org/wiki/Gataivai						
2808537	4035311		Gasegase River						
4316412	4035311		Gasegase Stream						
16949278	4035311		Gasegase						
1550150	4035313		Gagaifomaga						
5701356	4035313	link	https://en.wikipedia.org/wiki/Gaga%27ifomauga						
7996246	4035313		Gagaifomauga						
11761525	4035313	fr	Gaga'ifomauga						
5701342	4035314	link	https://en.wikipedia.org/wiki/Gaga%27emauga						
7996247	4035314		Gaga‘emauga						
11761524	4035314	fr	Gaga'emauga						
15488476	4035315	wkdt	Q31916582						
15960108	4035315		Gagaemalae Point						
15883216	4035317	wkdt	Q31915212						
15960109	4035317		Fatuanava Island						
15675643	4035318	wkdt	Q31916517						
15960110	4035318		Fusi						
15302347	4035319	wkdt	Q31916515						
15960111	4035319		Fusi						
1550151	4035320		Faluasu River						
4316413	4035320		Fuluasou River						
16949279	4035320		Fuluasou						
2808538	4035323		Fuailalo						
4316414	4035323		Fuailolo‘o						
13633576	4035323	link	https://en.wikipedia.org/wiki/Fuailoloo						
7080432	4035324	link	https://en.wikipedia.org/wiki/Fogatuli						
7119047	4035324		Fogatuli						
4316415	4035325		Fogasavai’i						
7075476	4035325	link	https://en.wikipedia.org/wiki/Fogasavai%27i						
1550154	4035326		Foa Luga						
2989105	4035326	link	https://en.wikipedia.org/wiki/Foailuga						
4316416	4035326		Foailuga						
1550155	4035327		Foalelo						
1550156	4035327		Foa Lalo						
4316417	4035327		Foailalo						
7078261	4035327	link	https://en.wikipedia.org/wiki/Foailalo						
1550157	4035328		Foa						
4316418	4035328		Fo‘a Bay						
2808539	4035330		Mauga Fiamoe						
4316419	4035330		Mount Fiamoe						
15752247	4035330	wkdt	Q31454883						
15492673	4035331	wkdt	Q31915228						
15960112	4035331		Fausaga						
4316420	4035332		Fatuvalu						
1550162	4035334		Falumaga Point						
2808540	4035334		Fatumana Point						
4316421	4035334		Fatumanā						
15425191	4035334	wkdt	Q31915216						
1550163	4035335		Fasitouta						
4316422	4035335		Fasito‘outa						
13633574	4035335	link	https://en.wikipedia.org/wiki/Fasito%27o_Uta						
15415545	4035335	wkdt	Q31915201						
13633573	4035336	link	https://en.wikipedia.org/wiki/Fasito%27o_Tai						
13638719	4035336		Fasito‘otai						
1550164	4035338		Fao Mountain						
2808541	4035338		Fao Peak						
2808542	4035338		Malata Berb						
4316423	4035338		Mount Fao						
15426265	4035338	wkdt	Q31672684						
1550166	4035339		Tapu Tapu						
2808543	4035339		Fanuatapu						
2989106	4035339	link	https://en.wikipedia.org/wiki/Fanuatapu						
4316424	4035339		Fanuatapu Island						
15513691	4035339	wkdt	Q1107394						
15539609	4035340	wkdt	Q31915156						
15960113	4035340		Falevao						
15660123	4035341	wkdt	Q31915154						
15960114	4035341		Falevai						
2808544	4035342		Faleulu						
4316425	4035342		Fetaulaiga						
1550167	4035344		Faleula Point						
1550168	4035344		Falula						
4316426	4035344		Cape Faleula						
1550169	4035345		Falula						
4316427	4035345		Faleula						
15832575	4035345	wkdt	Q31915151						
11305917	4035346	link	https://en.wikipedia.org/wiki/Faleu						
11392535	4035346		Faleu						
15599652	4035346	wkdt	Q2430001						
1550170	4035347		Faleapunga						
1550171	4035347		Faleapuna						
4316428	4035347		Falepuna						
7074775	4035347	link	https://en.wikipedia.org/wiki/Faleapuna						
7323653	4035350		Faleolo						
2989107	4035352	link	https://en.wikipedia.org/wiki/Falelima						
4316429	4035352		Falelima						
16949280	4035355		Falefa River						
16949281	4035355		Falefa						
1550172	4035356		Falifa Harbour						
1550173	4035356		Falefa Harbor						
2808545	4035356		Falefa Harbour						
4316430	4035356		Falefa Bay						
1550174	4035358		Falifa						
2989108	4035358	link	https://en.wikipedia.org/wiki/Falefa						
4316431	4035358		Falefa						
4316432	4035358		Naneivi						
4316433	4035358		Sagapolu						
4316434	4035358		Sanonu						
2808546	4035360		Faleata River						
4316435	4035360		Faleata Stream						
16949282	4035364		Faleaseela River						
16949283	4035364		Falease‘ela						
13633572	4035365	link	https://en.wikipedia.org/wiki/Falese%27ela						
13638720	4035365		Faleaseela						
1550175	4035366		Falealupo						
1550176	4035366		Felialupo Road						
1550177	4035366		Falialupo Road						
4316436	4035366		Falealupo Road						
1550178	4035367		Vaotupua						
2989109	4035367	link	https://en.wikipedia.org/wiki/Falealupo						
4316437	4035367		Faleālupo						
7361685	4035368		Falealupo						
1550180	4035369		Falealeali Harbour						
2808547	4035369		Falealili Harbour						
4316438	4035369		Falealili Harbor						
7076400	4035371	link	https://en.wikipedia.org/wiki/Fai%27a%27ai						
7119048	4035371		Fai’a’ai						
6877661	4035372	link	https://en.wikipedia.org/wiki/Fagamalo						
6923183	4035372		Fagamalo						
15214601	4035372	wkdt	Q5429372						
1550181	4035373		Fangaloa Bay						
4316439	4035373		Fagaloa Bay						
8680106	4035373	link	https://en.wikipedia.org/wiki/Fagaloa_Bay						
1550182	4035375		Fangalii River						
2808548	4035375		Fagali’i River						
4316440	4035375		Fagalii Stream						
1550183	4035376		Fangalii Bay						
4316441	4035376		Fagali‘i Bay						
1550184	4035377		Fangalii						
4316442	4035377		Fagali‘i						
7078248	4035381	link	https://en.wikipedia.org/wiki/Fagafau						
7119049	4035381		Fagafau						
5700616	4035383	link	https://en.wikipedia.org/wiki/Fa%27asaleleaga						
7996248	4035383		Fa‘asaleleaga						
11761523	4035383	fr	Fa'asaleleaga						
15285499	4035385	wkdt	Q31915024						
15960115	4035385		Ewa Point						
15531356	4035386	wkdt	Q31915002						
15960116	4035386		Eva						
15354291	4035389	wkdt	Q31912978						
15960117	4035389		East Point						
16949284	4035390		Clilate River						
16949285	4035390		Clilate						
7063366	4035397	link	https://en.wikipedia.org/wiki/Avao						
7119050	4035397		Avao						
15611237	4035397	wkdt	Q4827725						
1550186	4035398		Avalua Island						
4316443	4035398		Avalua						
15657075	4035398	wkdt	Q31873188						
13633571	4035399	link	https://en.wikipedia.org/wiki/A%27ufaga						
13638721	4035399		A‘ufaga						
15472445	4035399	wkdt	Q31873656						
1550187	4035400		Amvalea						
2989110	4035400	link	https://en.wikipedia.org/wiki/Auala						
4316444	4035400		Auala						
15604987	4035400	wkdt	Q742641						
15343921	4035401	wkdt	Q32362554						
15960118	4035401		Atufiu						
5701120	4035402	link	https://en.wikipedia.org/wiki/Atua_%28district%29						
7996249	4035402		Atua						
9394627	4035402	el	Άτουα						
9394628	4035402	ko	아투아 구						
9394629	4035402	mrj	Атуа						
9394630	4035402	ru	Атуа						
9394631	4035402	zh	阿图阿						
11761522	4035402	fr	Atua						
1550188	4035404		Asuisui						
4316445	4035404		Cape Asuisui						
1550189	4035405		Asi Island						
4316446	4035405		Asi						
14849565	4035405	wkdt	Q31872740						
2808549	4035406		Asau Bay						
4316447	4035406		Asau Harbour						
15418471	4035407	wkdt	Q31872439						
15960119	4035407		Asaga						
2808550	4035408		Ariadne Point						
4316448	4035408		Ariadue Point						
15456520	4035408	wkdt	Q31872032						
7506785	4035409	link	https://en.wikipedia.org/wiki/Apolima_Strait						
7566408	4035409		Apolima Strait						
1550191	4035411		Apolima Island						
2989111	4035411	link	https://en.wikipedia.org/wiki/Apolima						
4316449	4035411		Apolima						
1550192	4035412		Apia Bay						
1550193	4035412		Apia Harbor						
4316450	4035412		Apia Harbour						
13723176	4035412	unlc	ASAPI						
1649369	4035413	de	Apia						
1649399	4035413	en	Apia						
1649434	4035413	fr	Apia						
1649475	4035413	it	Apia						
1649547	4035413	da	Apia						
1649721	4035413	el	΄Aπια						
1649761	4035413	es	Apia						
1649796	4035413	fi	Apia						
1649834	4035413	pt	Apia						
1649866	4035413	sv	Apia						
3043777	4035413	ru	Апиа						
5424018	4035413	link	https://en.wikipedia.org/wiki/Apia						
7484298	4035413	iata	APW						
8228450	4035413	el	Απία						
8228451	4035413	sah	Апиа						
8228452	4035413	ka	აპია						
8228453	4035413	ht	Apiya						
8228454	4035413	pa	ਆਪੀਆ						
8228455	4035413	ja	アピア						
8228456	4035413	os	Апиæ						
8228457	4035413	bo	ཨ་པི་ཡ།						
8228458	4035413	is	Apía						
8228459	4035413	ur	آپیا						
8228460	4035413	uk	Апіа						
8228461	4035413	mrj	Апиа						
8228462	4035413	bg	Апия						
8228463	4035413	mr	आपिया						
8228464	4035413	th	อาปีอา						
8228465	4035413	ar	أبيا						
8228466	4035413	am	አፒያ						
8228467	4035413	mk	Апија						
8228468	4035413	ml	അപിയ						
8228469	4035413	sr	Апија						
8228470	4035413	fa	آپیا						
8228471	4035413	lt	Apija						
8228472	4035413	lv	Apija						
8228473	4035413	he	אפיה						
8228474	4035413	be	Апія						
8228475	4035413	eo	Apio						
8228476	4035413	ko	아피아						
8228477	4035413	zh	阿皮亚						
11333265	4035413	ce	Апиа						
11333266	4035413	kk	Апиа						
11333267	4035413	ky	Апиа						
11333268	4035413	ta	ஆப்பியா						
11333269	4035413	yue	阿皮亞						
13821677	4035413	unlc	WSAPW						
2989112	4035414	link	https://en.wikipedia.org/wiki/Aopo						
4316451	4035414		A’opo						
4316452	4035416		Amaile						
4316453	4035416		Faleulu						
4316454	4035416		Siufaga						
4316455	4035416		Usoali’i						
15737043	4035416	wkdt	Q31870635						
1550194	4035418		Lepu						
4316456	4035418		Alelupe Bay						
1550195	4035419		Alelai						
4316457	4035419		Alelai Point						
15221076	4035419	wkdt	Q31869949						
2808551	4035420		Richardson Road						
3242831	4035420		Aleipata Road						
2808552	4035422		Casino Islet						
2808553	4035422		Albatross Islet						
4316458	4035422		Albatross Island						
15466325	4035422	wkdt	Q31869822						
1550197	4035423		Alataua Isisifo						
4316459	4035423		Alataua						
2808554	4035424		Alaloa						
4316460	4035424		Ma’agao						
1550198	4035425		Aigoiletai						
5701153	4035425	link	https://en.wikipedia.org/wiki/Aiga-i-le-Tai						
7996250	4035425		Aiga-i-le-Tai						
9393289	4035425	el	Αϊγκα-ι-λε-Τάι						
9393290	4035425	ko	아이가이레타이 구						
9393291	4035425	mrj	Аига-и-ле-Таи						
9393292	4035425	ru	Аига-и-ле-Таи						
9393293	4035425	zh	艾加伊勒泰						
11761521	4035425	fr	Aiga-i-le-Tai						
2808555	4035428		Afutina						
4316461	4035428		Mount Afutina						
14904871	4035429	wkdt	Q31672719						
15960120	4035429		Mount Afolau						
7072085	4035430	link	https://en.wikipedia.org/wiki/Afiamalu						
7119051	4035430		Afiamalu						
1550199	4035431		Mount Mauga Afi						
2808556	4035431		Mauga Afi						
4316462	4035431		Mount Afi						
5903174	4035431	link	https://en.wikipedia.org/wiki/Mauga_Afi						
1550200	4035432		Afega						
2989113	4035432	link	https://en.wikipedia.org/wiki/Afega						
4316463	4035432		Afenga						
5701482	4035434	link	https://en.wikipedia.org/wiki/A%27ana						
11761520	4035434	fr	A'ana						
1886612	6299960	icao	NSAP						
1886613	6299961	icao	NSFA						
1889323	6299961	iata	APW						
7975635	6299961	link	https://en.wikipedia.org/wiki/Faleolo_International_Airport						
15247473	6299961	wkdt	Q197933						
15786699	7044076	wkdt	Q31672736						
16050475	7044076		Mount Fealofani						
2882707	7045200		Mt Poutavai						
5326021	7045200		Mount Poutavai						
15412073	7045200	wkdt	Q31672753						
2882708	7045202		Bluff Point						
2882709	7045202		Samamea Point						
2882710	7045202		Hell Point						
5326022	7045202		East Point						
15715166	7045202	wkdt	Q31912975						
2882711	7045203		Cape Papaloa						
5326023	7045203		Cape Tagisia						
2883221	7046388		Mt Fito						
5327019	7046388		Mount Fito						
15453569	7046388	wkdt	Q31672770						
2883238	7046410		Mt To’ona						
5327036	7046410		Mount To’ona						
2883239	7046420		Mt Mauga Sa						
5327037	7046420		Mount Mauga Sa						
15764693	7046420	wkdt	Q31672805						
15321503	7046423	wkdt	Q31951711						
16050486	7046423		Matautu Point						
2906637	7090894		Mt Latalua						
5364013	7090894		Mount Latalua						
15790681	7090894	wkdt	Q31400642						
15252949	7090895	wkdt	Q31400643						
16050613	7090895		Mount Fagaga						
2906638	7090904		Mt Savai’i						
5364014	7090904		Mount Savai’i						
2906639	7090905		Mt Seunga						
5364015	7090905		Mount Seuga						
15458218	7090905	wkdt	Q31672821						
2906640	7090906		Mt Fogalepulu						
5364016	7090906		Mount Fogalepulu						
15314769	7090906	wkdt	Q31672839						
2906641	7090907		Mt Mauga-o-Alii						
5364017	7090907		Mount Mauga-o-Alii						
15761335	7090907	wkdt	Q31672856						
15515432	7090910	wkdt	Q31956317						
16050614	7090910		Moaniu Point						
14903906	7090911	wkdt	Q31946851						
16050615	7090911		Mafuatuolesolo Point						
15521084	7090914	wkdt	Q31889929						
16050616	7090914		Cape Utuele						
15436832	7090915	wkdt	Q32379009						
16050617	7090915		Cape Vaitulu						
15416287	7090916	wkdt	Q31889902						
16050618	7090916		Cape Tulaele						
15253089	7090918	wkdt	Q31889524						
16050619	7090918		Cape Lapelape						
15682638	7106233	wkdt	Q31963749						
16050693	7106233		Musugale Point						
7520810	7106234	link	https://en.wikipedia.org/wiki/Manono_Uta						
15765766	7106237	wkdt	Q31872752						
16050694	7106237		Asia Point						
16076682	7106241	link	https://en.wikipedia.org/wiki/Gagaifo_o_le_Vao						
16089001	7106241		Gagaifoolevao						
15456281	7106243	wkdt	Q31951658						
16050695	7106243		Matareva Beach						
15538223	7106244	wkdt	Q32014823						
16050696	7106244		Salamumu Beach						
15758250	7106245	wkdt	Q32038034						
16050697	7106245		Utusega Point						
2915119	7106256		Lata						
5375422	7106256		Lata Plantation						
16076673	7106257	link	https://en.wikipedia.org/wiki/Matautu						
16089002	7106257		Matāutu						
15232293	7106261	wkdt	Q32014556						
16050698	7106261		Sagafoe Point						
15351768	7106268	wkdt	Q31400644						
16050699	7106268		Mount Olomanu						
16076675	7106270	link	https://en.wikipedia.org/wiki/Paepaeala						
16089003	7106270		Paepae‘alā						
2915120	7106272		Sanafili						
5375423	7106272		Sagafili						
13633590	7106285	link	https://en.wikipedia.org/wiki/Tafaigata						
13641551	7106285		Tafa’igata						
7076204	7106297	link	https://en.wikipedia.org/wiki/Alafua						
7235435	7106297		Alafua						
15284916	7106297	wkdt	Q4705560						
7078689	7106298	link	https://en.wikipedia.org/wiki/Lotopa						
7235436	7106298		Lotopa						
15673345	7106298	wkdt	Q15242955						
7078738	7106300	link	https://en.wikipedia.org/wiki/Pesega						
7235437	7106300		Pesega						
15310838	7106300	wkdt	Q7171358						
7081461	7106305	link	https://en.wikipedia.org/wiki/Lalovaea						
7235438	7106305		Lalovaea						
15583334	7106305	wkdt	Q6480585						
15683361	7106309	wkdt	Q32027598						
16050700	7106309		Taumeasina Island						
13633583	7106313	link	https://en.wikipedia.org/wiki/Lietauka						
13633584	7106313		Lietava						
13641552	7106313		Letava						
15265493	7106321	wkdt	Q31986853						
16050701	7106321		Pe‘ape‘a Cave						
7068970	7106323	link	https://en.wikipedia.org/wiki/Lepuia%27i						
7235439	7106323		Lepuia’i						
7045997	7106325	link	https://en.wikipedia.org/wiki/Apai						
7235440	7106325		Apai						
14910807	7106325	wkdt	Q3567233						
7067175	7106329	link	https://en.wikipedia.org/wiki/Salua						
7235441	7106329		Salua						
15496390	7106329	wkdt	Q7406265						
13633595	7106333	link	https://en.wikipedia.org/wiki/Vaito%27omuli						
13641553	7106333		Vaito‘omuli						
16076674	7106335	link	https://en.wikipedia.org/wiki/Moasula						
16089004	7106335		Mosula						
16076678	7106336	link	https://en.wikipedia.org/wiki/Pitonu%27u						
16089005	7106336		Pitonuu						
7078210	7106337	link	https://en.wikipedia.org/wiki/Vaega						
7235442	7106337		Vaega						
14968941	7106337	wkdt	Q7908404						
16076643	7106342	link	https://en.wikipedia.org/wiki/Vaiala						
16089006	7106342		Vaiala						
16076647	7106344	link	https://en.wikipedia.org/wiki/Siuniu						
16089007	7106344		Siuniu						
13337798	7106353	iata	MXS						
13343910	7106353		Maota						
15701163	7106354	wkdt	Q31672873						
16050702	7106354		Mount Oloulu						
15412020	7106355	wkdt	Q31400646						
16050703	7106355		Mount Leatupue						
15646151	7106356	wkdt	Q31672891						
16050704	7106356		Mount Ulivaa						
14949966	7106357	wkdt	Q31400647						
16050705	7106357		Mount Ologae						
7368148	7106358		Salelologa Wharf						
16076655	7106363	link	https://en.wikipedia.org/wiki/Salelavalu_Tai						
16089008	7106363		Salelavalu-tai						
16076644	7106364	link	https://en.wikipedia.org/wiki/Vaiafai						
16089009	7106364		Vai’afai						
13633575	7106367	link	https://en.wikipedia.org/wiki/Fatausi						
13641554	7106367		Fatausi						
7077233	7106368	link	https://en.wikipedia.org/wiki/Fogapoa						
7235443	7106368		Fogapoā						
15243561	7106369	wkdt	Q31400648						
16050706	7106369		Pue Hill						
15654473	7106370	wkdt	Q31400649						
16050707	7106370		Mount Pue						
15468332	7106371	wkdt	Q31672917						
16050708	7106371		Mount Nei						
2915121	7106375		Lata Point						
5375424	7106375		Lataitai						
2915122	7106378		Tanoaalei‘a						
5375425	7106378		Tanoaalea						
15488061	7106379	wkdt	Q31672934						
16050709	7106379		Mount Fatuafie						
15715908	7106380	wkdt	Q31672951						
16050710	7106380		Mount Olotane						
14946465	7106381	wkdt	Q31672971						
16050711	7106381		Mount Tiafue						
16076652	7106382	link	https://en.wikipedia.org/wiki/Samata-i-Uta						
16089010	7106382		Samataiuta						
15288229	7106384	wkdt	Q31889804						
16050712	7106384		Cape Siuvao						
15436524	7106386	wkdt	Q31400651						
16050713	7106386		Mount Fatu o Sina						
15809522	7106388	wkdt	Q31673006						
16050714	7106388		Mount Talu						
15689413	7106389	wkdt	Q31400653						
16050715	7106389		Mount Olotai						
15622786	7106391	wkdt	Q31400654						
16050716	7106391		Muli Mountain						
15420322	7106394	wkdt	Q31999890						
16050717	7106394		Puke Point						
15554074	7106395	wkdt	Q32038019						
16050718	7106395		Utuloa Point						
15339786	7106399	wkdt	Q31400655						
16050719	7106399		Tuasivi Ridge						
15253654	7106400	wkdt	Q31454886						
16050720	7106400		Mount Mu						
15260549	7106401	wkdt	Q31454887						
16050721	7106401		Mount Mata o le Afi						
15534034	7106402	wkdt	Q31673023						
16050722	7106402		Mount Elietoga						
7054034	7106405	link	https://en.wikipedia.org/wiki/Faletagaloa						
7235444	7106405		Faletagaloa						
15371389	7106405	wkdt	Q5431863						
6897546	7106406	link	https://en.wikipedia.org/wiki/Lefagaoali%27i						
6928366	7106406		Lefagaoali’i						
15527379	7106407	wkdt	Q31912718						
16050723	7106407		Dwarf Cave						
2915123	7106412		Tolua’iava						
5375426	7106412		Tolou‘iava						
15203022	7106416	wkdt	Q31400657						
16050724	7106416		Mount Fualua						
6896172	7106422	link	https://en.wikipedia.org/wiki/Mauga						
6928367	7106422		Mauga						
15418850	7106422	wkdt	Q6792347						
15688306	7106428	wkdt	Q31942749						
16050725	7106428		Lesolo Point						
15691292	7106429	wkdt	Q31942410						
16050726	7106429		Leato Point						
15777872	7106431	wkdt	Q32038028						
16050727	7106431		Utumalama Point						
15663166	7106437	wkdt	Q31400660						
16050728	7106437		Mount Lifa						
15222323	7106449	wkdt	Q31942691						
16050729	7106449		Leniu Point						
15438762	7106452	wkdt	Q31673090						
16050730	7106452		Mount Mariota						
15327153	7106455	wkdt	Q32038008						
16050731	7106455		Utuimo Point						
7482674	7106456	iata	AAU						
7588636	7106456		Asau						
8417571	7106456	link	https://en.wikipedia.org/wiki/Asau,_Samoa						
13821676	7106456	unlc	WSAAU						
15626817	7106458	wkdt	Q31673106						
16050732	7106458		Mount Punaiseesee						
15688603	7106460	wkdt	Q31400662						
16050733	7106460		Mount Olouta						
15675059	7106461	wkdt	Q31673122						
16050734	7106461		Mount Maugafolau						
6899245	7106463	link	https://en.wikipedia.org/wiki/Vailele						
6928368	7106463		Vailele						
15439085	7106463	wkdt	Q7908776						
15594829	7106464	wkdt	Q31400663						
16050735	7106464		Mount Pa-Amelia						
15527816	7106465	wkdt	Q31890725						
16050736	7106465		Cave of Vaatausili						
15430120	7106467	wkdt	Q31873217						
16050737	7106467		Aveavai						
15273513	7109411	wkdt	Q32007289						
16050751	7109411		Return to Paradise Beach						
15469207	7109437	wkdt	Q31951663						
16050752	7109437		Matasiva Point						
7588637	7109445		Apia Park						
13289897	7109448	en	Matautu Point						
15375060	7109448	wkdt	Q31995957						
13633570	7109449	link	https://en.wikipedia.org/wiki/Apolima_Tai						
13641555	7109449		Apolimatuai						
15616972	7109468	wkdt	Q31673137						
16050753	7109468		Mount Lelua						
15580641	7109471	wkdt	Q31673153						
16050754	7109471		Mount Ailao						
15298792	7109472	wkdt	Q31673169						
16050755	7109472		Mount Leele						
15669281	7109486	wkdt	Q31673186						
16050756	7109486		Mount Mua						
2915959	7109493		Tulagavae o Moso						
5376723	7109493		Mosos Footprint						
6880950	7109494	link	https://en.wikipedia.org/wiki/Safune						
6928391	7109494		Safune						
15259635	7109494	wkdt	Q7398846						
8681912	7667632	link	https://en.wikipedia.org/wiki/Le%27auva%27a						
15235039	7667632	wkdt	Q11753417						
15358130	7667651	wkdt	Q5429371						
5883760	7667884	iata	FGI						
5888078	7667884	icao	NSFI						
7509254	7667884	link	https://en.wikipedia.org/wiki/Fagali%27i_Airport						
11016153	7667884	en	Fagali'i Airport						
11016154	7667884	fr	Aéroport de Fagali'i						
11016155	7667884	zh	法加利機場						
13821678	7667884	unlc	WSFGI						
15348243	7667884	wkdt	Q5429369						
5883747	7667898	iata	MXS						
5888079	7667898	icao	NSMA						
6895358	7667898	link	https://en.wikipedia.org/wiki/Maota_Airport						
13821680	7667898	unlc	WSMXS						
15787629	7667898	wkdt	Q1030546						
5883759	7667905	iata	AAU						
5888077	7667905	icao	NSAU						
6895459	7667905	link	https://en.wikipedia.org/wiki/Asau_Airport						
14850282	7667905	wkdt	Q2903150						
16709289	7667905	unlc	WSAAU						
11016156	10629989	en	Vaimauga East						
7492745	11610575	link	https://en.wikipedia.org/wiki/Apia_Park						
13287729	11610576		Tamasese Mea'ole National Hospital						
13289864	11612094	en	Apia Front Lighthouse						
