1454134	3573514		Chacachacare Island						
1454135	3573514		Island of Chacachacare						
6889274	3573514	link	https://en.wikipedia.org/wiki/Chacachacare						
7771638	3573514		Chacachacare						
16948543	3573516		Zagaya River						
16948544	3573516		Zagaya						
16948545	3573518		Yarra River						
16948546	3573518		Yarra						
1454136	3573519		Yarra Undemarcated Forest Reserve						
1454137	3573519		Yarra Forest Reserve						
7771639	3573519		Yarra Reserve						
1454138	3573521		Woodlands Village						
7771640	3573521		Woodlands						
13801134	3573523	unlc	TTWDK						
1454139	3573525		Corsair Bay						
7771641	3573525		Winn’s Bay						
15718625	3573527	wkdt	Q31592441						
15958921	3573527		Windsor						
1454140	3573528		Manzanilla Windbelt Reserve						
1454141	3573528		Manzanilla Windbelt Forest Reserve						
7771642	3573528		Windbelt Reserve						
1454142	3573529		Williamsville Station						
7771643	3573529		Williamsville						
16948547	3573531		Wild Dog River						
16948548	3573531		Wild Dog						
16948549	3573532		Wild Cow River						
16948550	3573532		Wild Cow						
16948551	3573534		White River						
16948552	3573534		White						
1454143	3573535		White Islets						
1454144	3573535		White Island						
4307583	3573535		White Islands						
15244670	3573536	wkdt	Q31592457						
15958922	3573536		White Cliff						
1454148	3573545		Warners Village						
7771644	3573545		Warners						
14931156	3573546	wkdt	Q35316799						
1454149	3573547		Vistabella Village						
7771645	3573547		Vistabella						
7771646	3573547		Vista Bella						
13801133	3573547	unlc	TTVBL						
1454151	3573550		Victoria Village						
7771647	3573550		Victoria						
1454152	3573551		Vessiny River						
7771648	3573551		Vessigny River						
16948553	3573551		Vessigny						
1454153	3573554		Cano Venturo River						
7771649	3573554		Caño Venturo						
16948554	3573555		Vance River						
16948555	3573555		Vance						
2986039	3573557	link	https://en.wikipedia.org/wiki/Valsayn						
7771650	3573557		Valsayn						
13801131	3573557	unlc	TTTOB						
16948556	3573558		Valencia River						
16948557	3573558		Valencia						
1454154	3573559		Valencia Ward						
1454155	3573559		Valencia						
7771651	3573559		Ward of Valencia						
1454156	3573560		Valencia Village						
7771652	3573560		Valencia						
13635181	3573560	link	https://en.wikipedia.org/wiki/Valencia,_Trinidad_and_Tobago						
1454157	3573562		Spring River						
7771653	3573562		Uquire River						
16948558	3573562		Uquire						
8618375	3573565		Upper Carapichaima						
8618376	3573565		Upper Carapichima						
1454158	3573568		Union Village						
7771654	3573568		Union						
1454159	3573570		Parasol Rock						
7771655	3573570	en	Umbrella Rock						
13859802	3573570	it	Rocce Ombrellone						
13859804	3573570		Quitasol Rock						
1454160	3573572		Tyrrell’s Bay						
1454161	3573572		Tyrrel Bay						
4307584	3573572		Tyrrel’s Bay						
16948559	3573573		Turure River						
16948560	3573573		Turure						
16948561	3573574		Turure River						
16948562	3573574		Turure						
1454162	3573575		Turure Ward						
1454163	3573575		Turure						
7771656	3573575		Ward of Turure						
1454164	3573576		Tunapuna Village						
2986040	3573576	link	https://en.wikipedia.org/wiki/Tunapuna						
11760598	3573576	fr	Tunapuna						
13394105	3573576		Tunapuna						
13801132	3573576	unlc	TTTUN						
16948563	3573577		Tumpuna River						
16948564	3573577		Tumpuna						
1454165	3573578		Tumpuna Forest Reserve						
7771657	3573578		Tumpuna Reserve						
16948565	3573579		Tumbason River						
16948566	3573579		Tumbason						
16948567	3573581		Tucuragua River						
16948568	3573581		Tucuragua						
15425877	3573582	wkdt	Q35409255						
15958923	3573582		Tucker Valley						
1454166	3573588		Trinity Hills of Columbus						
4307585	3573588		Trinity Hills						
5903792	3573588	link	https://en.wikipedia.org/wiki/Trinity_Hills						
1454167	3573589		Trinity						
1454168	3573589		Trinity Ward						
4307586	3573589		Ward of Trinity						
16948569	3573590		Trinidad River						
16948570	3573590		Trinidad						
1454169	3573591		Trinidad and Tobago Colony						
1454170	3573591		United Colony of Trinidad and Tobago						
1454171	3573591		Colony of Trinidad and Tobago						
1454172	3573591		Trinidad						
1564741	3573591	af	Trinidad en Tobago	1					
1564742	3573591	am	ትሪናዳድ እና ቶቤጎ	1					
1564743	3573591	ar	ترينيداد وتوباغو	1					
1564744	3573591	bg	Тринидад и Тобаго	1					
1564745	3573591	ca	Trinitat i Tobago	1					
1564746	3573591	cs	Trinidad a Tobago	1					
1564747	3573591	cy	Trinidad a Thobago						
1564748	3573591	da	Trinidad og Tobago	1					
1564749	3573591	de	Trinidad und Tobago	1					
1564750	3573591	el	Τρινιδάδ και Τομπάγκο						
1564751	3573591	en	Trinidad & Tobago						
1564752	3573591	eo	Trinidado kaj Tobago	1					
1564754	3573591	et	Trinidad ja Tobago	1					
1564755	3573591	eu	Trinidad eta Tobago	1					
1564756	3573591	fa	ترینیداد و توباگو	1					
1564757	3573591	fi	Trinidad ja Tobago	1					
1564758	3573591	fo	Trinidad & Tobago	1					
1564759	3573591	fr	Trinité-et-Tobago	1					
1564760	3573591	ga	Oileán na Tríonóide agus Tobága	1					
1564761	3573591	he	טרינידאד וטובגו						
1564762	3573591	hi	ट्रिनिडाड और टोबैगो						
1564763	3573591	hr	Trinidad i Tobago	1					
1564764	3573591	hu	Trinidad és Tobago	1					
1564765	3573591	hy	Տրինիդադ և Տոբագո	1					
1564766	3573591	id	Trinidad dan Tobago	1					
1564767	3573591	is	Trínidad og Tóbagó	1					
1564768	3573591	it	Trinidad e Tobago	1					
1564769	3573591	ja	トリニダード・トバゴ	1					
1564770	3573591	ka	ტრინიდადი და ტობაგო	1					
1564771	3573591	km	ទ្រីនីដាត និង​តូបាហ្គោ	1					
1564772	3573591	ko	트리니다드 토바고	1					
1564773	3573591	lo	ທຣິນິແດດ ແລະ ໂທແບໂກ	1					
1564774	3573591	lt	Trinidadas ir Tobagas	1					
1564775	3573591	lv	Trinidāda un Tobāgo	1					
1564776	3573591	mk	Тринидад и Тобаго	1					
1564777	3573591	ms	Trinidad dan Tobago	1					
1564778	3573591	mt	Trinidad u Tobago	1					
1564779	3573591	nb	Trinidad og Tobago	1					
1564780	3573591	nl	Trinidad en Tobago	1					
1564781	3573591	nn	Trinidad og Tobago						
1564782	3573591	pl	Trinidad i Tobago						
1564783	3573591	pt	Trinidad e Tobago	1					
1564784	3573591	ro	Trinidad și Tobago	1					
1564785	3573591	ru	Тринидад и Тобаго	1					
1564786	3573591	sk	Trinidad a Tobago	1					
1564787	3573591	sl	Trinidad in Tobago	1					
1564788	3573591	sq	Trinidad e Tobago	1					
1564789	3573591	sr	Тринидад и Тобаго	1					
1564790	3573591	sv	Trinidad och Tobago	1					
1564791	3573591	sw	Trinidad na Tobago	1					
1564792	3573591	ta	டிரினிடாட் & டொபாகோ	1					
1564793	3573591	th	ตรินิแดดและโตเบโก	1					
1564794	3573591	tr	Trinidad ve Tobago	1					
1564795	3573591	uk	Тринідад і Тобаго	1					
1564796	3573591	vi	Tri-ni-đát và Tô-ba-gô						
1564797	3573591	zh	特立尼达和多巴哥	1					
1619183	3573591	es	Trinidad y Tobago	1					
1619184	3573591	an	Trinidad y Tobago						
1619185	3573591	be	Трынідад і Табага	1					
1619186	3573591	bs	Trinidad i Tobago	1					
1619187	3573591	cy	Trinidad a Tobago	1					
1619188	3573591	gl	Trindade e Tobago - Trinidad and Tobago						
1619189	3573591	he	טרינידד וטובגו	1					
1619190	3573591	io	Trinidad e Tobago						
1619191	3573591	kw	Trynses ha Tobago						
1619192	3573591	lv	Trinidada un Tobago						
1619193	3573591	nds	Trinidad un Tobago						
1619194	3573591	no	Trinidad og Tobago	1					
1619195	3573591	oc	Trinitat e Tobago						
1619196	3573591	pl	Trynidad i Tobago	1					
1619197	3573591	ro	Trinidad-Tobago						
1619198	3573591	hbs	Trinidad i Tobago						
1619199	3573591	sq	Trinidad dhe Tobago						
1619200	3573591	th	ประเทศตรินิแดดและโตเบโก						
1619201	3573591	tl	Trinidad at Tobago						
1619202	3573591	zh	千里達及托巴哥						
1632960	3573591	el	Τρινιντάντ και Τομπάγκο	1					
1632961	3573591	ug	ترىنىداد ۋە توباگو						
1632962	3573591	vi	Trinidad và Tobago	1					
1894410	3573591	az	Trinidad və Tobaqo	1					
1894411	3573591	ilo	Trinidad ken Tobago						
1894412	3573591	la	Trinitas et Tabacum						
1894413	3573591	ps	ټرېنېداد او ټوباګو						
1894414	3573591	uk	Тринідад і Тобаґо						
1894415	3573591	vo	Trinidadeän e Tobageäns						
1979701	3573591	frp	Trinitât-et-Tobagô						
2422624	3573591	bn	ত্রিনিনাদ ও টোব্যাগো	1					
2422625	3573591	fa	ترینیداد و تباکو	1					
2422626	3573591	fr	Trinidad et Tobago						
2422627	3573591	gl	Trinidad e Tobago	1					
2422628	3573591	hi	त्रिनिदाद और टोबैगो	1					
2422629	3573591	ia	Trinidad e Tobago	1					
2422630	3573591	is	Trínídad og Tóbagó	1					
2422631	3573591	ja	トリニダード・トバゴ共和国	1					
2422632	3573591	lv	Trinidāda un Tobago	1					
2422633	3573591	pt	Trindade e Tobago	1					
2422634	3573591	se	Trinidad ja Tobago	1					
2422635	3573591	uk	Трінідад і Тобаго	1					
2422636	3573591	ur	ترینیداد اور ٹوباگو	1					
2920041	3573591	link	https://en.wikipedia.org/wiki/Trinidad_and_Tobago						
3056500	3573591	link	https://ru.wikipedia.org/wiki/%D0%A2%D1%80%D0%B8%D0%BD%D0%B8%D0%B4%D0%B0%D0%B4_%D0%B8_%D0%A2%D0%BE%D0%B1%D0%B0%D0%B3%D0%BE						
4307587	3573591		Republic of Trinidad and Tobago						
5463112	3573591	el	Τρινινταντ και Τομπαγκο						
7091388	3573591	ak	Trinidad ne Tobago	1					
7091389	3573591	az	Trinidan və Tobaqo	1					
7091390	3573591	bm	Trinite-ni-Tobago	1					
7091391	3573591	br	Trinidad ha Tobago	1					
7091392	3573591	ee	Trinidad kple Tobago nutome	1					
7091393	3573591	ff	Tirnidaad e Tobaago	1					
7091394	3573591	gu	ટ્રિનીદાદ અને ટોબેગો	1					
7091395	3573591	ha	Tirinidad Da Tobago	1					
7091396	3573591	ki	Trinidad na Tobago	1					
7091397	3573591	kl	Trinidad aamma Tobago	1					
7091398	3573591	kn	ಟ್ರಿನಿಡಾಡ್ ಮತ್ತು ಟೊಬಾಗೊ	1					
7091399	3573591	ku	Trînîdad û Tobago	1					
7091400	3573591	lg	Turindaadi ne Tobago	1					
7091401	3573591	ln	Tinidadɛ mpé Tobago	1					
7091402	3573591	lu	Tinidade ne Tobago	1					
7091403	3573591	mg	Trinidad sy Tobagô	1					
7091404	3573591	ml	ട്രിനിഡാഡും ടുബാഗോയും	1					
7091405	3573591	mr	त्रिनिदाद आणि टोबॅगो	1					
7091406	3573591	nd	Trinidad le Tobago	1					
7091407	3573591	ne	त्रिनिडाड एण्ड टोबागो	1					
7091408	3573591	or	ତ୍ରିନିଦାଦ୍ ଏବଂ ଟୋବାଗୋ	1					
7091409	3573591	rm	Trinidad e Tobago	1					
7091410	3573591	rn	Tirinidadi na Tobago	1					
7091411	3573591	sg	Trinitùee na Tobagö	1					
7091412	3573591	si	ට්‍රිනිඩෑඩ් සහ ටොබැගෝ	1					
7091413	3573591	sn	Trinidad and Tobago	1					
7091414	3573591	so	Tirinidaad & Tobago	1					
7091415	3573591	te	ట్రినిడాడ్ మరియు టొబాగో	1					
7091416	3573591	ti	ትሪኒዳድን ቶባጎን	1					
7091417	3573591	to	Tilinitati mo Topako	1					
7091418	3573591	yo	Tirinida ati Tobaga	1					
7091419	3573591	zu	i-Trinidad ne-Tobago	1					
8046200	3573591		Trinidad and Tobago						
13801128	3573591	unlc	TTTAB						
16925878	3573591	zh-Hant	千里達及托巴哥	1					
16931664	3573591	as	ট্ৰিনিডাড আৰু টোবাগো	1					
16931665	3573591	ce	Тринидад а, Тобаго а	1					
16931666	3573591	dz	ཊི་ནི་ཌཱཌ་ ཨེནཌ་ ཊོ་བྷེ་གྷོ	1					
16931667	3573591	fy	Trinidad en Tobago	1					
16931668	3573591	gd	Trianaid agus Tobago	1					
16931669	3573591	ig	Trinidad na Tobago	1					
16931670	3573591	jv	Trinidad lan Tobago	1					
16931671	3573591	kk	Тринидад және Тобаго	1					
16931672	3573591	ks	ٹرنِنداد تہٕ ٹوبیگو	1					
16931673	3573591	ky	Тринидад жана Тобаго	1					
16931674	3573591	lb	Trinidad an Tobago	1					
16931675	3573591	mn	Тринидад ба Тобаго	1					
16931676	3573591	my	ထရီနီဒတ်နှင့် တိုဘက်ဂို	1					
16931677	3573591	pa	ਟ੍ਰਿਨੀਡਾਡ ਅਤੇ ਟੋਬਾਗੋ	1					
16931678	3573591	ps	ټرينيډاډ او ټوباګو	1					
16931679	3573591	qu	Trinidad y Tobago	1					
16931680	3573591	sd	ٽريني ڊيڊ ۽ ٽوباگو ٻيٽ	1					
16931681	3573591	tg	Тринидад ва Тобаго	1					
16931682	3573591	tk	Trinidad we Tobago	1					
16931683	3573591	tt	Тринидад һәм Тобаго	1					
16931684	3573591	ug	تىرىنىداد ۋە توباگو	1					
16931685	3573591	uz	Trinidad va Tobago	1					
16931686	3573591	wo	Tirinite ak Tobago	1					
16931687	3573591	yi	טרינידאַד און טאבאַגא	1					
16933104	3573591	en	Trinidad and Tobago	1					
1454174	3573592		La Trinite						
4307588	3573592		Trinidad						
5705771	3573592	link	https://en.wikipedia.org/wiki/Trinidad						
8513241	3573592	iata	POS						
8513242	3573592	en	Trinidad	1	1				
8513243	3573592	en	Trinidad Island						
9446115	3573592	es	Isla Trinidad						
9446116	3573592	fr	Trinité						
9446117	3573592	ar	ترينيداد						
9446118	3573592	be	Востраў Трынідад						
9446119	3573592	bg	Тринидад						
9446120	3573592	br	Enez Trinidad						
9446121	3573592	ca	Illa de Trinitat						
9446122	3573592	el	Τρινιντάντ						
9446123	3573592	eo	Trinidado						
9446124	3573592	fa	ترینیداد						
9446125	3573592	gd	Trianaid						
9446126	3573592	gl	Illa Trinidad						
9446127	3573592	he	טרינידד						
9446128	3573592	hi	त्रिनिदाद						
9446129	3573592	ja	トリニダード島						
9446130	3573592	ka	ტრინიდადი						
9446131	3573592	ko	트리니다드 섬						
9446132	3573592	ku	Trînîdad						
9446133	3573592	la	Insula Trinitatis						
9446134	3573592	lb	Trinidad an Tobago						
9446135	3573592	lt	Trinidadas						
9446136	3573592	lv	Trinidāda						
9446137	3573592	mr	त्रिनिदाद						
9446138	3573592	my	ထရီနီဒတ်ကျွန်း						
9446139	3573592	os	Тринидад						
9446140	3573592	sa	ट्रिनिडाड						
9446141	3573592	sr	Тринидад						
9446142	3573592	ta	டிரினிடாட்						
9446143	3573592	uk	Тринідад						
9446144	3573592	yo	Trínídád						
9446145	3573592	yue	千里達島						
9446146	3573592	pl	Trynidad						
9446147	3573592	ru	Тринидад						
9446148	3573592	zh	特立尼达岛						
11341870	3573592	pi	ट्रिनिडाड						
11341871	3573592	ur	ٹرینیڈاڈ						
1454175	3573593		Ance Tringuant						
7771658	3573593		Anse Tringuant						
1454176	3573595		Totuma Ravine						
7771659	3573595		Totuma River						
16948571	3573595		Totuma						
1454177	3573599		River Tompire						
7771660	3573599		Tompire River						
16948572	3573599		Tompire						
7771661	3573601		Todd’s Road						
7771662	3573601		Todds Road						
1454178	3573603		Toco Ward						
1454179	3573603		Toco						
7771663	3573603		Ward of Toco						
2986041	3573604	link	https://en.wikipedia.org/wiki/Toco						
7771664	3573604		Toco						
15582591	3573604	wkdt	Q16901745						
1454180	3573606		Tobago		1				
2986042	3573606	link	https://en.wikipedia.org/wiki/Tobago						
11760553	3573606	fr	Tobago						
1454181	3573607	en	Tobago Island						
1639618	3573607	de	Tobago						
1639619	3573607	es	Tobago						
1639620	3573607	en	Tobago						
1639621	3573607	pl	Tobago						
1639622	3573607	ar	توباغو						
1639623	3573607	et	Tobago						
1639624	3573607	fi	Tobago						
1639625	3573607	fr	Tobago						
1639626	3573607	gl	Tobago						
1639627	3573607	id	Tobago						
1639628	3573607	ja	トバゴ島						
1639629	3573607	nl	Tobago						
1639630	3573607	pt	Tobago						
1639631	3573607	sv	Tobago						
1993320	3573607	lt	Tobago						
1993321	3573607	lv	Tobāgo						
3056501	3573607	link	https://ru.wikipedia.org/wiki/%D0%A2%D0%BE%D0%B1%D0%B0%D0%B3%D0%BE						
4307589	3573607		Tobago						
8545243	3573607	iata	TAB						
8545244	3573607	link	https://en.wikipedia.org/wiki/Tobago						
8545245	3573607	wuu	多巴哥岛						
8545246	3573607	yue	托巴哥島						
8545247	3573607	ru	Тобаго						
8545248	3573607	ko	토바고 섬						
15269610	3573607	wkdt	Q185111						
16948573	3573608		Tintin River						
16948574	3573608		Tintin						
16948575	3573610		Timital River						
16948576	3573610		Timital						
7771665	3573611		Shark River						
7771666	3573611		Tiburon River						
1454182	3573618		Point Pembladora						
7771667	3573618		Point Tembladora						
13801130	3573618	unlc	TTTEM						
1454183	3573619		Saint Peter’s Bay						
7771668	3573619		Anse Tembladora						
16948577	3573621		Teak Hill River						
16948578	3573621		Teak Hill						
16948579	3573623		Tavia River						
16948580	3573623		Tavia						
1454184	3573624		Tarpon						
7771669	3573624		Tarpon Island						
1454185	3573625		Vistabella River						
4307590	3573625		Tarouba River						
16948581	3573625		Tarouba						
1454186	3573626		River Tarouba						
4307591	3573626		Tarouba River						
16948582	3573626		Tarouba						
1454187	3573629		Pampeltonnes Bay						
4307592	3573629		Tardieu Bay						
1454188	3573631		Tapana Ravine						
7771670	3573631		Tapana River						
16948583	3573631		Tapana						
8618377	3573632		L’Etang						
8618378	3573632		Tambou l’Etang River						
8618379	3573633		Tamana Hill						
8618380	3573633		Tamanaquita Hill						
1454189	3573635		Tamana						
1454190	3573635		Tamana Ward						
7771671	3573635		Ward of Tamana						
1454191	3573636		Tamana Hill						
7771672	3573636		Mount Tamana						
15544658	3573636	wkdt	Q31391306						
16948584	3573637		Talparo River						
16948585	3573637		Talparo						
7078600	3573638	link	https://en.wikipedia.org/wiki/Talparo						
7771673	3573638		Talparo						
15678964	3573638	wkdt	Q7680316						
8618381	3573639		Tyrico Bay						
8618382	3573639		Tairico Bay						
16948586	3573640		Tacarigua River						
16948587	3573640		Tacarigua						
1454192	3573642		Tacarigua						
1454193	3573642		Tacarigua Ward						
7771674	3573642		Ward of Tacarigua						
13801127	3573642	unlc	TTTAA						
15749510	3573644	wkdt	Q31592473						
15958924	3573644		Mount Tabor						
1454194	3573645		Mairad Village						
7771675	3573645		Tableland						
1454195	3573646		Point Tablas						
4307593	3573646		Punta Tablas						
16948588	3573647		Tabateau River						
16948589	3573647		Tabateau						
1454196	3573648		Islet à Bateau						
7771676	3573648		Tabateau Point						
16948590	3573649		Tabaquite River						
16948591	3573649		Tabaquite						
1454197	3573650		Tabaquite Village						
2986044	3573650	link	https://en.wikipedia.org/wiki/Tabaquite						
7771677	3573650		Tabaquite						
15658480	3573650	wkdt	Q7672913						
8618383	3573656		Stone River						
8618384	3573656		Stone Thirty Nine River						
16948592	3573657		Stone River						
16948593	3573657		Stone						
11261023	3573658		Stonehaven Bay						
11265547	3573658		Stone Haven Bay						
16948594	3573659		Stetin River						
16948595	3573659		Stetin						
16948596	3573660		Steele River						
16948597	3573660		Steele						
1454198	3573662		Stanislaus Bay						
7771678	3573662		Stanislas Bay						
1454199	3573664		Spring Village						
7771679	3573664		Spring						
1454200	3573665		Speyside Village						
2986045	3573665	link	https://en.wikipedia.org/wiki/Speyside%2C_Trinidad_and_Tobago						
4307594	3573665		Speyside						
8080824	3573668	link	https://en.wikipedia.org/wiki/South_Oropouche						
8108707	3573668		South Oropouche						
13801125	3573668	unlc	TTSOO						
1454201	3573669		Southern Watershed Forest Reserve						
7771680	3573669		Southern Watershed Reserve						
16138873	3573670	link	https://en.wikipedia.org/wiki/Southern_Range						
16211640	3573670		Southern Range						
8075539	3573671	link	https://en.wikipedia.org/wiki/Soldado_Rock						
8108708	3573671		Soldado Rock						
2061	3573672		Soldado						
1454202	3573672		Marine Oilfield						
4307595	3573672		Soldado Marine Oilfield						
1454203	3573673		Smith Islet						
1454204	3573673		Smiths Island						
4307596	3573673		Smith Island						
1454205	3573675		Sixth Company Village						
7771681	3573675		Sixth Company						
1454206	3573676		Sisters						
1454207	3573676		The Sisters						
4307597	3573676		Sisters Rocks						
16948598	3573677		Siras River						
16948599	3573677		Siras						
1454208	3573678		Siparia Forest Reserve						
7771682	3573678		Siparia Reserve						
1454209	3573680		Siparia						
1454210	3573680		Siparia Ward						
8791490	3573680	link	https://en.wikipedia.org/wiki/Siparia						
1454211	3573681		Siparia Village						
2986046	3573681	link	https://en.wikipedia.org/wiki/Siparia						
13394106	3573681		Siparia						
13801126	3573681	unlc	TTSPR						
1454212	3573685		Silver Stream						
7771683	3573685		Silver Stream River						
7771684	3573685		Silverstream River						
16948600	3573691		Sherry River						
16948601	3573691		Sherry						
7424136	3573692		Sheerbirds Point						
7424137	3573692		Golden Grove Point						
1454213	3573694		Boca de Serpientes						
1454214	3573694		Drachen Schlund						
1454215	3573694		Boca del Soldado						
1454216	3573694		The Serpent’s Mouth						
1454217	3573694		Bocas de Serpientes						
1454218	3573694		Boca de la Sierpe						
1454219	3573694		Boca del Sierpe						
4307598	3573694		Serpents Mouth						
1454220	3573697		Rio Seco River						
7771685	3573697		Rio Seco						
16948602	3573700		Scotts River						
16948603	3573700		Scotts						
1454221	3573703		Port Louis						
2986047	3573703	link	https://en.wikipedia.org/wiki/Scarborough,_Tobago						
4307599	3573703		Scarborough						
13801122	3573703	unlc	TTSCA						
13801123	3573703	unlc	TTSCR						
15763168	3573703	wkdt	Q966660						
1454222	3573705		Savanetta River						
7771686	3573705		Savonetta River						
16948604	3573705		Savonetta						
1454223	3573706		Savaneta Point						
7771687	3573706		Savonetta Point						
16471624	3573706	en	Savoneta Point				1		
16948605	3573708		Savaneta River						
16948606	3573708		Savaneta						
1454224	3573709		Savana Grande						
1454225	3573709		Savana Grande Ward						
7771688	3573709		Ward of Savana Grande						
1454226	3573710		Saut d’Eau Islet						
1454227	3573710		Maravaca						
1454228	3573710		Maravaca Island						
7771689	3573710		Saut d’Eau Island						
16948607	3573714		Santa Cruz River						
16948608	3573714		Santa Cruz						
2986048	3573715	link	https://en.wikipedia.org/wiki/Santa_Cruz%2C_Trinidad_and_Tobago						
7771690	3573715		Santa Cruz						
16948609	3573717		Sans Souci River						
16948610	3573717		Sans Souci						
1454229	3573722		San Rafael Ward						
1454230	3573722		San Rafael						
7771691	3573722		Ward of San Rafael						
1454231	3573723		San Rafael Village						
7771692	3573723		San Rafael						
1454232	3573725		Tunapuna River						
4307600	3573725		San Miguel River						
16948611	3573725		San Miguel						
1454233	3573726		Aricagua River						
7771693	3573726		San Juan River						
16948612	3573726		San Juan						
2986049	3573727	link	https://en.wikipedia.org/wiki/San_Juan%2C_Trinidad_and_Tobago						
3058171	3573727	link	https://ru.wikipedia.org/wiki/%D0%A1%D0%B0%D0%BD-%D0%A5%D1%83%D0%B0%D0%BD_%28%D0%A2%D1%80%D0%B8%D0%BD%D0%B8%D0%B4%D0%B0%D0%B4_%D0%B8_%D0%A2%D0%BE%D0%B1%D0%B0%D0%B3%D0%BE%29						
7771694	3573727		San Juan						
15546881	3573727	wkdt	Q1976992						
1454234	3573729		San Jose Estate						
7771695	3573729		San José						
1454235	3573730		Muro River						
7771696	3573730		Sangre Grande River						
16948613	3573730		Sangre Grande						
1454236	3573732		Sangre Grande Station						
1454237	3573732		Sangre Grand						
1454238	3573732		Sangre Grande Town						
5424424	3573732	link	https://en.wikipedia.org/wiki/Sangre_Grande						
13801121	3573732	unlc	TTSAG						
1454239	3573734		Sangre Grande Chiquita River						
1454240	3573734		Sangre Chiquite River						
7771697	3573734		Sangre Chiquita River						
16948614	3573734		Sangre Chiquita						
1454241	3573735		Sagre Chiquita						
7771698	3573735		Sangre Chiquita						
1454242	3573737		Francique Village						
1454243	3573737		Erin						
7771699	3573737		San Francique						
5424423	3573738	link	https://en.wikipedia.org/wiki/San_Fernando,_Trinidad_and_Tobago						
11760593	3573738	fr	San Fernando						
13394107	3573738		San Fernando						
13801124	3573738	unlc	TTSFE						
15466137	3573738	wkdt	Q1023712						
2185855	3573739		San Fernando	1	1				
2986050	3573739	link	https://en.wikipedia.org/wiki/San_Fernando%2C_Trinidad_and_Tobago						
7352733	3573739	en	City of San Fernando						
11760550	3573739	fr	San Fernando						
13698655	3573739	en	San Fernando		1				
16948615	3573740		Sandy River						
16948616	3573740		Sandy						
16948617	3573741		Sandy River						
16948618	3573741		Sandy						
16948619	3573742		Sandy River						
16948620	3573742		Sandy						
1454244	3573745		Sanders Bay						
4307601	3573745		Sanda Bay						
1454245	3573747		Salibia River						
7771700	3573747		Salybia River						
16948621	3573747		Salybia						
1454246	3573748		Salibea River						
1454247	3573748		Salibia Ravine						
7771701	3573748		Salybia River						
16948622	3573748		Salybia						
1454248	3573750		Salibia Village						
1454249	3573750		Salibea						
7771702	3573750		Salybia						
16948623	3573751		Salt Water River						
16948624	3573751		Salt Water						
16948625	3573752		Salt River						
16948626	3573752		Salt						
1454250	3573753		Salibia Bay						
7771703	3573753		Saline Bay						
1454251	3573754		Salibia Point						
7771704	3573754		Fronton de Saline						
15535798	3573754	wkdt	Q34889416						
1454252	3573756		Mount Salé						
7771705	3573756		Morne Salé						
1454253	3573757		Saint Thomas Village						
7771706	3573757		Saint Thomas						
1454255	3573762		Mount Saint Michel						
1454256	3573762		Saint Michel						
4307602	3573762		Morne Saint Michel						
1454257	3573765		Saint Mary’s Village						
1454258	3573765		Oropuche						
7771707	3573765		Saint Mary’s						
13801100	3573765	unlc	TTFPT						
1454259	3573768		Saint Margaret Village						
7771708	3573768		Saint Margaret						
1454260	3573771		Saint Julien Village						
7771709	3573771		Saint Julien						
16948627	3573772		Saint Joseph River						
16948628	3573772		Saint Joseph						
15760161	3573773	wkdt	Q7401542						
15958925	3573773		Saint Joseph						
1454261	3573775		Saint Joseph Village						
7771710	3573775		Saint Joseph						
1454262	3573776		Rio Negro Canal						
7771711	3573776		Saint Johns Canal						
1454263	3573777		Saint John Village						
7771712	3573777		Saint John						
8073280	3573779	link	https://en.wikipedia.org/wiki/Saint_James%2C_Trinidad_and_Tobago						
8108709	3573779		Saint James						
11261019	3573779		St. James		1				
16948629	3573780		Saint Hill River						
16948630	3573780		Saint Hill						
1454264	3573782		Melville Islands						
1454265	3573782		Saint Giles’s Islands						
1454266	3573782		Giles Island						
1454267	3573782		Saint Giles Island						
1454268	3573782		Melville Island						
1454269	3573782		Saint Giles Islets						
1454270	3573782		Melville Islets						
1454271	3573782		Giles Islands						
2986051	3573782	link	https://en.wikipedia.org/wiki/Saint_Giles_Island						
4307603	3573782		Saint Giles Islands						
1454275	3573785		Saint Mary’s Point						
7771713	3573785		Sainte Marie Point						
1454276	3573786		Saint Madeleine Bay						
7771714	3573786		Sainte Madeleine Bay						
1454277	3573787		Sainte Madeleine Village						
1454278	3573787		Saint Madeleine Village						
1454279	3573787		Saint Madeleine						
7771715	3573787		Sainte Madeleine						
1454280	3573789		Saint Croix						
1454281	3573789		Sainte Croix Village						
7771716	3573789		Sainte Croix						
1454282	3573790		Saint Cité Bay						
7771717	3573790		Sainte Cité Bay						
13801114	3573794	unlc	TTPSC						
13826849	3573794		Saint Clair						
2986052	3573796	link	https://en.wikipedia.org/wiki/Saint_Augustine%2C_Trinidad_and_Tobago						
7771718	3573796		Saint Augustine						
16948631	3573797		Saint Ann’s River						
16948632	3573797		Saint Ann’s						
1454285	3573800		Saint Ann’s						
1454286	3573800		Saint Ann’s Ward						
7771719	3573800		Ward of Saint Ann’s						
16948633	3573806		Sadhoowa River						
16948634	3573806		Sadhoowa						
1454288	3573816		Runnymede						
4307604	3573816		Runnemede						
16948635	3573818		Roxborough River						
16948636	3573818		Roxborough						
1454289	3573819		Roxborough Village						
4307605	3573819		Roxborough						
13635183	3573819	link	https://en.wikipedia.org/wiki/Roxborough,_Trinidad_and_Tobago						
16948637	3573821		Roussillac River						
16948638	3573821		Roussillac						
1454290	3573822		Roussillac Settlement						
7771720	3573822		Roussillac						
1454291	3573823		Rouge Ravine						
7771721	3573823		Rouge River						
16948639	3573823		Rouge						
16948640	3573827		Roseau River						
16948641	3573827		Roseau						
1454292	3573829		Rosa Point						
7771722	3573829		Roja Point						
16948642	3573832		Rock River						
16948643	3573832		Rock						
16948644	3573837		Rivulet River						
16948645	3573837		Rivulet						
2986053	3573840	link	https://en.wikipedia.org/wiki/Rio_Claro,_Trinidad_and_Tobago						
11760594	3573840	fr	Río Claro						
13394108	3573840		Rio Claro						
13801120	3573840	unlc	TTRCR						
15374191	3573840	wkdt	Q514272						
1454293	3573841		Rincon						
7771723	3573841		Rincon Island						
1454294	3573842		Great Dog River						
4307606	3573842		Richmond River						
16948646	3573842		Richmond						
1454295	3573843		Richmond Islet						
4307607	3573843		Richmond Island						
1454296	3573848		Rest House Ravine						
7771724	3573848		Rest House River						
16948647	3573848		Rest House						
1454297	3573855		Redhead Village						
7771725	3573855		Redhead						
15522159	3573856	wkdt	Q31592531						
15958926	3573856		Red Cliff						
1454298	3573859		Rampanagas Ravine						
7771726	3573859		Rampanalgas River						
16948648	3573859		Rampanalgas						
1454299	3573860		Rampanagas Village						
7771727	3573860		Rampanalgas						
1454300	3573861		Rambert Village						
7771728	3573861		Rambert						
16948649	3573862		Radix Lagoon River						
16948650	3573862		Radix Lagoon						
1454301	3573863		Radix Point						
4307608	3573863		Point Radix						
15683002	3573864	wkdt	Q31592546						
15958927	3573864		Quoin Cliff						
1454302	3573865		Siparia River						
7771729	3573865		Quinam River						
16948651	3573865		Quinam						
1454303	3573868		Louis d’Or River						
4307609	3573868		Queens River						
16948652	3573868		Queens						
7155606	3573869	link	https://en.wikipedia.org/wiki/Queens_Park_Savannah						
7323598	3573869		Queen’s Park Savannah						
1454304	3573870		Queen Islet						
4307610	3573870		Queen’s Island						
16948653	3573872		Quebrada River						
16948654	3573872		Quebrada						
16948655	3573874		Quarahoon River						
16948656	3573874		Quarahoon						
16948657	3573876		Pure River						
16948658	3573876		Pure						
15693790	3573877	wkdt	Q31391316						
15958928	3573877		Pulteney Hill						
16948659	3573879		Providence River						
16948660	3573879		Providence						
1454305	3573882		Princess Town						
2986054	3573882	link	https://en.wikipedia.org/wiki/Princes_Town						
13394109	3573882		Princes Town						
13801119	3573882	unlc	TTPTW						
1454306	3573884		Primera Plia Ravine						
7771730	3573884		Primera Pria River						
16948661	3573884		Primera Pria						
1454307	3573886		Preau Village						
7771731	3573886		Preau						
16948662	3573887		Poui River						
16948663	3573887		Poui						
15900323	3573888	wkdt	Q31592561						
15958929	3573888		Morne Poui						
1454308	3573890		City of Port-of-Spain						
1454309	3573890		Port-au-Spain						
1595937	3573890	de	Port-of-Spain						
1595938	3573890	en	Port of Spain						
1595939	3573890	es	Puerto España						
1595940	3573890	ca	Port-of-Spain						
1595941	3573890	fi	Port of Spain						
1595942	3573890	fr	Port-d'Espagne	1					
1595943	3573890	he	פורט אוף ספיין						
1595944	3573890	id	Port-of-Spain						
1595945	3573890	io	Port-of-Spain						
1595946	3573890	it	Port of Spain						
1595947	3573890	ja	ポートオブスペイン						
1595948	3573890	ko	포트 오브 스페인						
1595949	3573890	ko	포트오브스페인						
1595950	3573890	nl	Port of Spain						
1595951	3573890	no	Port of Spain						
1595952	3573890	pl	Port-of-Spain						
1595953	3573890	pt	Port of Spain						
1595954	3573890	sk	Port of Spain						
1595955	3573890	sv	Port of Spain						
1635642	3573890	mk	Порт оф Спејн						
1635643	3573890	zh	西班牙港						
1649540	3573890	da	Port of Spain						
1649708	3573890	el	Πορτ οφ Σπέιν						
1901538	3573890	vo	Port of Spain						
1987748	3573890	pl	Port of Spain						
1987749	3573890	am	ፖርት ኦፍ ስፔን						
1987750	3573890	lt	Port of Speinas						
1987751	3573890	ru	Порт-оф-Спейн						
2986055	3573890	link	https://en.wikipedia.org/wiki/Port_of_Spain						
8513237	3573890	iata	POS						
11327105	3573890	ar	بورت أوف سبين						
11327106	3573890	az	Port of Speyn						
11327107	3573890	be	Порт-оф-Спейн						
11327108	3573890	bg	Порт ъф Спейн						
11327109	3573890	bn	পোর্ট অব স্পেন						
11327110	3573890	bo	པོ་རོ་ཊི་ཨོཕ་སི་པེ་ན།						
11327111	3573890	ce	Порт-оф-Спейн						
11327112	3573890	da	Port-of-Spain						
11327113	3573890	el	Πορτ-οφ-Σπέιν						
11327114	3573890	eo	Portospeno						
11327115	3573890	eu	Port-of-Spain						
11327116	3573890	fa	پرت آو اسپاین						
11327117	3573890	gl	Porto España						
11327118	3573890	hi	पोर्ट ऑफ स्पेन						
11327119	3573890	hr	Port-of-Spain						
11327120	3573890	ht	Pò of Espay						
11327121	3573890	ka	პორტ-ოვ-სპეინი						
11327122	3573890	kk	Порт-оф-Спейн						
11327123	3573890	ky	Порт-Оф-Спейн						
11327124	3573890	lrc	پرت آو اسپاین						
11327125	3573890	lv	Portofspeina						
11327126	3573890	ml	പോർട്ട് ഓഫ് സ്പെയിൻ						
11327127	3573890	mr	पोर्ट ऑफ स्पेन						
11327128	3573890	nah	Acalquixohuayan Caxtillan						
11327129	3573890	nov	Portu de Spania						
11327130	3573890	os	Порт-оф-Спейн						
11327131	3573890	pa	ਪੋਰਟ ਆਫ਼ ਸਪੇਨ						
11327132	3573890	sah	Порт оф Спейн						
11327133	3573890	sr	Порт ов Спејн						
11327134	3573890	ta	போர்ட் ஆஃப் ஸ்பெய்ன்						
11327135	3573890	th	พอร์ต-ออฟ-สเปน						
11327136	3573890	uk	Порт-оф-Спейн						
11327137	3573890	ur	پورٹ آف اسپین						
11327138	3573890	uz	Port-of-speyn						
11327139	3573890	vep	Port of Spein						
11327140	3573890	nan	Port-of-Spain						
13801113	3573890	unlc	TTPOS						
15615188	3573890	wkdt	Q39178						
7352734	3573891	en	City of Port of Spain						
7352735	3573891		Port of Spain		1				
8234890	3573891	link	https://en.wikipedia.org/wiki/Port_of_Spain_City_Corporation						
11760551	3573891	fr	Port-d'Espagne						
13698656	3573891	en	Port of Spain		1				
13699203	3573891		Port-of-Spain						
1454310	3573893		Pool Station						
7771732	3573893		Poole Station						
16948664	3573894		Poole River						
16948665	3573894		Poole						
16710661	3573897	unlc	TTPTS						
16712406	3573897		Point Lisas Industrial Port						
2986056	3573899	link	https://en.wikipedia.org/wiki/Point_Fortin	1	1				
11760597	3573899	fr	Point  Fortin						
13394110	3573899		Point Fortin						
13801115	3573899	unlc	TTPTF						
1454311	3573901		Pointe-a-Pierre Ward						
1454312	3573901		Pointe-à-Pierre						
7771733	3573901		Ward of Pointe-à-Pierre						
2986057	3573902	link	https://en.wikipedia.org/wiki/Pointe-%C3%A0-Pierre						
7771734	3573902		Pointe-à-Pierre						
13801117	3573902	unlc	TTPTP						
15613049	3573902	wkdt	Q5549687						
13801111	3573903	unlc	TTPLY						
16948666	3573904		Plum River						
16948667	3573904		Plum						
1454313	3573905		Plum Mitan Settlement						
1454314	3573905		Mitan						
7771735	3573905		Plum Mitan						
16948668	3573909		Platanal River						
16948669	3573909		Platanal						
1454315	3573915		Pitch Lake of La Brea						
2986058	3573915	link	https://en.wikipedia.org/wiki/Pitch_Lake						
7771736	3573915		Pitch Lake						
16948670	3573917		Piparo River						
16948671	3573917		Piparo						
1454316	3573918		Piparo Settlement						
2986059	3573918	link	https://en.wikipedia.org/wiki/Piparo						
7771737	3573918		Piparo						
16948672	3573920		Pilote River						
16948673	3573920		Pilote						
7490156	3573921	link	https://en.wikipedia.org/wiki/Pigeon_Point%2C_Tobago						
7566315	3573921		Pigeon Point						
1454317	3573925		Kenny’s Bay						
7771738	3573925		Pierre Bay						
1454318	3573926		Ponte-à-Pierre						
1454319	3573926		Pointe a Pierre						
1454320	3573926		Point-a-Pierre						
1454321	3573926		Point a Pierre						
1454322	3573926		Stoney Point						
1454323	3573926		Pont-à-Pierre						
7771739	3573926		Pointe-à-Pierre						
16471622	3573926	en	Point Pierre				1		
16471623	3573926	en	Pierre Point				1		
1454324	3573927		Mount Pierre						
7771740	3573927		Morne Pierre						
15671129	3573927	wkdt	Q31592591						
15670706	3573929	wkdt	Q31592621						
15958930	3573929		Piedra Blanca						
1454325	3573932		Piarco Savanna Village						
2986060	3573932	link	https://en.wikipedia.org/wiki/Piarco						
7771741	3573932		Piarco						
13801110	3573932	unlc	TTPIA						
16948674	3573936		Petit Tuero River						
16948675	3573936		Petit Tuero						
1454326	3573938		Petit Trou Village						
7080179	3573938	link	https://en.wikipedia.org/wiki/Petit_Trou						
7771742	3573938		Petit Trou						
15753926	3573938	wkdt	Q7178380						
1454327	3573941		Petite Pool River						
1454328	3573941		Petit Poole River						
1454329	3573941		Pool River						
7771743	3573941		Petit Pool River						
16948676	3573941		Petit Pool						
1454330	3573942		Petite Platanal River						
7771744	3573942		Petit Platanal River						
16948677	3573942		Petit Platanal						
1454331	3573943		Petite Negre Rock						
7771745	3573943		Petit Negre Rock						
1454332	3573944		Petite Matelot River						
7771746	3573944		Petit Matelot River						
16948678	3573944		Petit Matelot						
16948679	3573945		Petit Lézard River						
16948680	3573945		Petit Lézard						
16948681	3573950		Petite Pilote River						
16948682	3573950		Petite Pilote						
16948683	3573951		Petite Marianne River						
16948684	3573951		Petite Marianne						
1454333	3573952		Petit Anse River						
7771747	3573952		Petite l’Anse River						
16948685	3573952		Petite l’Anse						
1454334	3573954		Petit l’Anse						
7771748	3573954		Petite l’Anse						
16948686	3573963		Pero Seco River						
16948687	3573963		Pero Seco						
1454335	3573964		Pepper						
7771749	3573964		Pepper Village						
1454336	3573965		Peñal Village						
2986061	3573965	link	https://en.wikipedia.org/wiki/Penal						
13801112	3573965	unlc	TTPNL						
16948688	3573966		Pembroke River						
16948689	3573966		Pembroke						
11298223	3573967	link	https://en.wikipedia.org/wiki/Pembroke%2C_Tobago						
11392383	3573967		Pembroke						
1454337	3573968		Black Islands						
1454338	3573968		Pelican Rock						
7771750	3573968		Pelican Rocks						
16948690	3573975		Parlatuvier West River						
16948691	3573975		Parlatuvier West						
16948692	3573976		Parlatuvier East River						
16948693	3573976		Parlatuvier East						
16948694	3573979		Paria River						
16948695	3573979		Paria						
1454339	3573980		Paria Forest Reserve						
1454340	3573980		Paria Undemarcated Forest Reserve						
7771751	3573980		Paria Reserve						
1454343	3573985		Panawatee River						
7771752	3573985		Parawatee River						
16948696	3573985		Parawatee						
16948697	3573990		Papure River						
16948698	3573990		Papure						
1454344	3573995		Palo Seco Village						
7771753	3573995		Palo Seco						
1454345	3573997		Palmyra Village						
7771754	3573997		Palmyra						
1454346	3573998		Palmiste Point						
7771755	3573998		Palmist Point						
1454347	3573999		Palmiste Ravine						
7771756	3573999		Palmiste River						
16948699	3573999		Palmiste						
16948700	3574000		Palmiste River						
16948701	3574000		Palmiste						
16652100	3574003		Otho Point						
16652101	3574003		Othoe Point						
1454348	3574005		Ortoire Nariva Windbelt Reserve						
4307612	3574005		Ortoire Windbelt Reserve						
1454349	3574006		Ortire River						
1454350	3574006		Guatuaro River						
4307613	3574006		Ortoire River						
6890795	3574006	link	https://en.wikipedia.org/wiki/Ortoire_River						
16948702	3574006		Ortoire						
1454351	3574008		Ortoire Ward						
1454352	3574008		Ortoire						
7771757	3574008		Ward of Ortoire						
16948703	3574010		Oropuna River						
16948704	3574010		Oropuna						
1454353	3574011		River Oropuche						
1454354	3574011		Oropuche						
7771758	3574011		Oropuche River						
16948705	3574012		Oropuche River						
16948706	3574012		Oropuche						
1454355	3574017		Orange Valley Village						
7771759	3574017		Orange Valley						
1454356	3574023		Omega						
7771760	3574023		Omega Island						
15365218	3574028	wkdt	Q31391320						
15958931	3574028		North Post						
1454357	3574032		Northern Mountain Range						
2986062	3574032	link	https://en.wikipedia.org/wiki/Northern_Range						
7771761	3574032		Northern Range						
15562296	3574032	wkdt	Q7058903						
6889918	3574042	link	https://en.wikipedia.org/wiki/Nelson_Island%2C_Trinidad_and_Tobago						
7771762	3574042		Nelson						
16948707	3574044		Neg River						
16948708	3574044		Neg						
16948709	3574047		Navette River						
16948710	3574047		Navette						
1454358	3574049		Bois Neuf River						
1454359	3574049		Navaret River						
7771763	3574049		Navet River						
16948711	3574049		Navet						
15308707	3574050	wkdt	Q6982282						
15958932	3574050		Navet Dam						
1454360	3574052		Ecclesville Windbelt Reserve						
1454361	3574052		Ecclesville Windbelt Forest Reserve						
7771764	3574052		Nariva Windbelt Reserve						
1454362	3574053		Nariva Lagoon						
4307614	3574053		Nariva Swamp						
7139825	3574053	link	https://en.wikipedia.org/wiki/Nariva_Swamp						
16948712	3574054		Nariva River						
16948713	3574054		Nariva						
1454363	3574055		Canqué River						
7771765	3574055		Nariva River						
16948714	3574055		Nariva						
15707242	3574056	wkdt	Q31391322						
15958933	3574056		Nariva Hill						
16948715	3574058		Naranjo River						
16948716	3574058		Naranjo						
16948717	3574059		Naranjo River						
16948718	3574059		Naranjo						
16948719	3574060		Naranjo River						
16948720	3574060		Naranjo						
15417343	3574062	wkdt	Q31592696						
15958934	3574062		Naranja						
1454365	3574063		Naparima						
7771766	3574063		Naparima Hill						
15550390	3574063	wkdt	Q31391324						
1454366	3574064		Naparima						
1454367	3574064		Naparima Ward						
7771767	3574064		Ward of Naparima						
15315636	3574069	wkdt	Q35735438						
15958935	3574069		Mucurapo						
1454368	3574071		Mount Stewart Village						
7771768	3574071		Mount Stewart						
1454369	3574072		Mount Saint George Village						
4307615	3574072		Mount Saint George						
1454370	3574075		Little Courland Bay						
1454371	3574075		Mount Irving Bay						
4307616	3574075		Mount Irvine Bay						
2986063	3574081	link	https://en.wikipedia.org/wiki/Morvant						
7771769	3574081		Morvant						
16948721	3574083		Moruga River						
16948722	3574083		Moruga						
1454372	3574086		Moruga						
1454373	3574086		Moruga Ward						
2986064	3574086	link	https://en.wikipedia.org/wiki/Moruga						
7771770	3574086		Ward of Moruga						
1454374	3574087		Moruga Village						
7771771	3574087		Moruga						
14949272	3574087	wkdt	Q2667607						
7771772	3574089		Morro Point						
7771773	3574089		Point Morro						
1454375	3574091		Murucupano River						
7771774	3574091		Morocupano River						
16948723	3574091		Morocupano						
16948724	3574094		Morne l’Enfer River						
16948725	3574094		Morne l’Enfer						
1454376	3574095		Morne l’Enfer Forest Reserve						
7771775	3574095		Morne l’Enfer Reserve						
16948726	3574096		Morne d’Or River						
16948727	3574096		Morne d’Or						
16948728	3574097		Morne Diablo River						
16948729	3574097		Morne Diablo						
16948730	3574101		Moriquite River						
16948731	3574101		Moriquite						
1454377	3574104		Moriah Village						
4307617	3574104		Moriah						
16948732	3574105		Moreau River						
16948733	3574105		Moreau						
16948734	3574106		Mora River						
16948735	3574106		Mora						
1454378	3574109		Mocra River						
7771776	3574109		Moora River						
16948736	3574109		Moora						
1627160	3574110	ca	Muntanyes de Montserrat						
4307618	3574110		Montserrat Hills						
1454379	3574111		Montserrat						
1454380	3574111		Montserrat Ward						
7771777	3574111		Ward of Montserrat						
13801108	3574112	unlc	TTMTS						
13826850	3574112		Montrose						
15454636	3574116	wkdt	Q35732011						
15958936	3574116		Mon Repos						
1454381	3574119		Monos Island						
2986065	3574119	link	https://en.wikipedia.org/wiki/Monos						
7771778	3574119		Monos						
1454382	3574121		Monkey Town Village						
7771779	3574121		Monkey Town						
1454383	3574124		Marito River						
4307619	3574124		Momuripo River						
16948737	3574124		Momuripo						
16948738	3574125		Mitan River						
16948739	3574125		Mitan						
16948740	3574127		Mission River						
16948741	3574127		Mission						
1454384	3574128		Miss Gutter						
7771780	3574128		Miss Gutter River						
1454385	3574130		Minister Point						
4307620	3574130		Minster Point						
1454386	3574131		Minorca						
7771781	3574131		Minorca Island						
1454387	3574132		Big Bacolet Bay						
1454388	3574132		Minster Bay						
4307621	3574132		Minister Bay						
1454389	3574134		Sandy Bay						
4307622	3574134		Milford Bay						
16948742	3574136		Miguel River						
16948743	3574136		Miguel						
1454390	3574139		Third Channel						
4307623	3574139		Middle Channel						
16948744	3574145		Melajo River						
16948745	3574145		Melajo						
1454391	3574146		Melajo Forest Reserve						
7771782	3574146		Melajo Reserve						
16948746	3574148		Mc Rae River						
16948747	3574148		Mc Rae						
1454392	3574149		Mc Bean Village						
7771783	3574149		Mc Bean						
16948748	3574150		Mayo River						
16948749	3574150		Mayo						
1454393	3574151		Montserrat Village						
7771784	3574151		Mayo						
1454394	3574152		Victoria Mayaro Forest Reserve						
4307624	3574152		Mayaro Reserve						
7032850	3574154	link	https://en.wikipedia.org/wiki/Mayaro_Bay						
7118836	3574154		Mayaro Bay						
1454395	3574155		Mayaro		1				
5424492	3574155	link	https://en.wikipedia.org/wiki/Rio_Claro-Mayaro_Regional_Corporation						
11760560	3574155	fr	Rio Claro-Mayaro						
16948750	3574157		Mausica River						
16948751	3574157		Mausica						
1454396	3574158		Maturite River						
7771785	3574158		Maturita River						
16948752	3574158		Maturita						
1454397	3574160		Matura Ravine						
7771786	3574160		Matura River						
16948753	3574160		Matura						
16948754	3574161		Matura River						
16948755	3574161		Matura						
1454398	3574162		Matura Forest Reserve						
7771787	3574162		Matura Reserve						
1454399	3574167		Matura Ward						
1454400	3574167		Matura						
7771788	3574167		Ward of Matura						
16948756	3574169		Matelot River						
16948757	3574169		Matelot						
13635184	3574171	link	https://en.wikipedia.org/wiki/Matelot,_Trinidad_and_Tobago						
13638662	3574171		Matelot						
1454401	3574172		Matapano River						
7771789	3574172		Matapane River						
16948758	3574172		Matapane						
16948759	3574174		Mason River						
16948760	3574174		Mason						
16948761	3574178		Marie Douleur River						
16948762	3574178		Marie Douleur						
16948763	3574179		Marianne River						
16948764	3574179		Marianne						
16948765	3574180		Marianne River						
16948766	3574180		Marianne						
16948767	3574181		Marianito River						
16948768	3574181		Marianito						
1454402	3574182		Marble Islet						
4307625	3574182		Marble Island						
16948769	3574183		Maraval River						
16948770	3574183		Maraval						
2986066	3574184	link	https://en.wikipedia.org/wiki/Maraval						
7771790	3574184		Maraval						
13801109	3574184	unlc	TTMVL						
16948771	3574185		Marac River						
16948772	3574185		Marac						
16948773	3574186		Maracas River						
16948774	3574186		Maracas						
1454403	3574188		Maracus Falls						
7771791	3574188		Maracas Falls						
1454404	3574190		Maraca Bay River						
7771792	3574190		Maracas Bay River						
16948775	3574190		Maracas Bay						
1454405	3574192		Maracas Village						
7771793	3574192		Maracas						
2986067	3574194	link	https://en.wikipedia.org/wiki/Marabella						
4307626	3574194		Marabella						
11760596	3574194	fr	Marabella						
13801107	3574194	unlc	TTMAR						
15519367	3574194	wkdt	Q3493518						
1454406	3574195		Macqueripe Bay						
7771794	3574195		Maqueripe Bay						
1454407	3574196		Mapipire Ravine						
7771795	3574196		Mapepire River						
16948776	3574196		Mapepire						
1454408	3574197		Mapepire Ravine						
7771796	3574197		Mapepire River						
16948777	3574197		Mapepire						
1454409	3574201		Manzanilla						
1454410	3574201		Manzanilla Ward						
7771797	3574201		Ward of Manzanilla						
16948778	3574202		Manticool River						
16948779	3574202		Manticool						
1454411	3574204		Man-o’-War Bay						
4307627	3574204		Man of War Bay						
1454412	3574205		Clarkes Bay						
4307628	3574205		Mangrove Bay						
16948780	3574206		Mandillon River						
16948781	3574206		Mandillon						
1454413	3574207		Manati						
7771798	3574207		Manati Island						
15608596	3574209	wkdt	Q31592711						
15958937	3574209		Manantial						
1454414	3574211		Manahambre Village						
7771799	3574211		Manahambre						
1454415	3574212		El Mamoral River						
7771800	3574212		Mamural River						
16948782	3574212		Mamural						
1454416	3574213		Mamural						
7771801	3574213		Mamoral						
16948783	3574215		Maloney River						
16948784	3574215		Maloney						
16179079	3574219	link	https://en.wikipedia.org/wiki/Malabar_Settlement						
16211641	3574219		Malabar Settlement						
1454417	3574220		Majorca						
4307629	3574220		Majorca Island						
16583827	3574222	link	https://en.wikipedia.org/wiki/Main_Ridge,_Tobago						
16586604	3574222		Main Ridge						
16948785	3574223		Mahaut River						
16948786	3574223		Mahaut						
1454418	3574224		Mahault River						
16652102	3574224		Mahoe River						
16652103	3574224		Mahaut River						
1454419	3574225		Mahoe River						
4307630	3574225		Mahaut River						
16948787	3574225		Mahaut						
16948788	3574226		Mahaut River						
16948789	3574226		Mahaut						
16652104	3574228		Mahout Bay						
16652105	3574228		Anse Mahaut						
1454420	3574229		Hospedales						
7771802	3574229		Maharabe Hill						
16948790	3574231		Madong River						
16948791	3574231		Madong						
1454421	3574232		Madaira River						
7771803	3574232		Madaria River						
16948792	3574232		Madaria						
1454422	3574234		Madame Francoise Ravine						
4307631	3574234		Madame Françoise River						
16948793	3574234		Madame Françoise						
1454423	3574235		Madame Espagnol River						
7771804	3574235		Madame Espagnole River						
16948794	3574235		Madame Espagnole						
16948795	3574236		Madamas River						
16948796	3574236		Madamas						
1454424	3574240		Machapoorie						
7771805	3574240		Machapure Hill						
1454425	3574241		Macaw Reserve						
7771806	3574241		Macaw Island						
16948797	3574242		Macaque River						
16948798	3574242		Macaque						
16948799	3574244		Macajuel River						
16948800	3574244		Macajuel						
15713670	3574245	wkdt	Q31592742						
15958938	3574245		The Lure						
16948801	3574247		Lucy River						
16948802	3574247		Lucy						
15879177	3574249	wkdt	Q14214454						
1454426	3574251		Roselle						
4307632	3574251		Lower Quarter						
1454427	3574255		Lothians						
7771807	3574255		Lothian						
1454428	3574259		Erin Lagoon						
7771808	3574259		Los Blanquizales Lagoon						
2986068	3574263	link	https://en.wikipedia.org/wiki/Lopinot						
7771809	3574263		Lopinot						
13801106	3574270	unlc	TTLOE						
13826851	3574270		Longdenville						
1454429	3574271		London Bridge						
4307633	3574271		London Bridge Rock						
1454430	3574272		La Charro River						
7771810	3574272		Lo Charro River						
16948803	3574272		Lo Charro						
1454431	3574274		Ravine Lizard						
1454432	3574274		Lézard River						
4307634	3574274		Lizard River						
16948804	3574274		Lizard						
1454433	3574275		Bird of Paradise Island						
1454434	3574275		Little Tobago Island						
4307635	3574275		Little Tobago						
7192164	3574275	link	https://en.wikipedia.org/wiki/Little_Tobago						
16948805	3574277		Little Moriquite River						
16948806	3574277		Little Moriquite						
16948807	3574278		Little John River						
16948808	3574278		Little John						
12195787	3574282	en	Port Point Lisas						
12195788	3574282		Lisas Point Port						
12195789	3574282	en	Point Lisas Port						
1454435	3574285		Lisas Point						
7180649	3574285	link	https://en.wikipedia.org/wiki/Point_Lisas						
7771811	3574285		Point Lisas						
13801118	3574285	unlc	TTPTS						
1454436	3574291		Les Boquets Island						
1454437	3574291		Les Bouquets						
16652106	3574291		Les Boquets Islands						
16948809	3574292		Leriche River						
16948810	3574292		Leriche						
16948811	3574294		Lengua River						
16948812	3574294		Lengua						
1454438	3574295		Lengua Village						
7771812	3574295		Lengua						
6889446	3574299	link	https://en.wikipedia.org/wiki/Lenagan_Island						
7771813	3574299		Lenagan						
1454439	3574300		Point Eglise						
7771814	3574300		Point L’Eglise						
1454440	3574301		Dent Madame Têteron						
7771815	3574301		Le Chapeau						
16948813	3574303		L’Ebranche River						
16948814	3574303		L’Ebranche						
16948815	3574305		Lawai River						
16948816	3574305		Lawai						
1454441	3574306		Veronica Village						
7771816	3574306		La Veronica						
2986069	3574309	link	https://en.wikipedia.org/wiki/Laventille						
4307636	3574309		Laventille						
11760592	3574309	fr	Laventille						
13801105	3574309	unlc	TTLLL						
1454442	3574314		Las Tablas River						
4307637	3574314		La Table River						
16948817	3574314		La Table						
16948818	3574316		La Seiva River						
16948819	3574316		La Seiva						
1454443	3574317		Las Cuevas Undemarcated Forest Reserve						
7771817	3574317		Las Cuevas Reserve						
8618386	3574317		Las Cuevas Forest Reserve						
1454444	3574319		Ensenada de las Cuevas						
1454445	3574319		Las Cuavas Bay						
7771818	3574319		Las Cuevas Bay						
1454446	3574324		La Pastoria						
7771819	3574324		La Pastora						
1454447	3574327		Anse Noire						
1454448	3574327		Noire Bay						
7771820	3574327		L’Anse Noire						
16948820	3574328		Lambeau River						
16948821	3574328		Lambeau						
16948822	3574332		La Lune River						
16948823	3574332		La Lune						
16948824	3574337		La Horquette River						
16948825	3574337		La Horquette						
1454449	3574338		La Guiria Ravine						
7771821	3574338		La Guiria River						
16948826	3574338		La Guiria						
16948827	3574340		Lagon Mahaut River						
16948828	3574340		Lagon Mahaut						
16948829	3574341		Lagon Doux River						
16948830	3574341		Lagon Doux						
1454450	3574342		La Gloria Estate						
4307638	3574342		La Gloria						
8618387	3574343		Lagon Sale River						
8618388	3574343		Lageon River						
1454451	3574344		La Fontaine Pointe						
4307639	3574344		La Fontaine Point						
16948831	3574347		La Cuesa River						
16948832	3574347		La Cuesa						
1454452	3574349		La Seiva River						
4307640	3574349		La Ceiba River						
16948833	3574349		La Ceiba						
1454453	3574350		La Carrière Village						
7771822	3574350		La Carrière						
16948834	3574351		La Brea River						
16948835	3574351		La Brea						
1454454	3574352		La Brea						
1454455	3574352		La Brea Ward						
7771823	3574352		Ward of La Brea						
1454456	3574353		La Brea Village						
2986070	3574353	link	https://en.wikipedia.org/wiki/La_Brea%2C_Trinidad_and_Tobago						
7771824	3574353		La Brea						
16948836	3574356		Kings Bay River						
16948837	3574356		Kings Bay						
1454457	3574358		King Bay						
4307641	3574358		King’s Bay						
1454458	3574359		King Peter Bay						
4307642	3574359		King Peter’s Bay						
16948838	3574360		Killdeer River						
16948839	3574360		Killdeer						
16200582	3574363	link	https://en.wikipedia.org/wiki/Kelly_Village						
16211642	3574363		Kelly Village						
15257175	3574365	wkdt	Q31391340						
15958939	3574365		Kapur Ridge						
16948840	3574366		Kaifungi River						
16948841	3574366		Kaifungi						
15630640	3574367	wkdt	Q34890847						
15958940	3574367		Peña de Juangalo						
16948842	3574368		Jordan River						
16948843	3574368		Jordan						
16948844	3574369		John River						
16948845	3574369		John						
7771825	3574370		Jermingham Junction						
7771826	3574370		Jerningham Junction						
1454459	3574371		Mount Jean						
7771827	3574371		Morne Jean						
15534046	3574371	wkdt	Q31592815						
16948846	3574373		Japlicooper River						
16948847	3574373		Japlicooper						
1454460	3574374		James Stewart						
7771828	3574374		James Smart						
15674598	3574375	wkdt	Q31391342						
15958941	3574375		Ismael Hill						
1454461	3574376		Islot Point						
1454462	3574376		Isolote Point						
7771829	3574376		Islote Point						
15233076	3574376	wkdt	Q34947083						
1454463	3574377		Islot Bay						
7771830	3574377		Islote Bay						
16948848	3574378		Irois River						
16948849	3574378		Irois						
1454464	3574379		Bay de Irois						
7771831	3574379		Irois Bay						
16948850	3574381		Inverawe River						
16948851	3574381		Inverawe						
1454465	3574382		Innis River						
7771832	3574382		Inniss River						
16948852	3574382		Inniss						
1454466	3574385		Iquane River						
4307643	3574385		Iguane River						
16948853	3574385		Iguane						
1454467	3574387		Iere Village						
7081659	3574387	link	https://en.wikipedia.org/wiki/Iere_Village						
7771833	3574387		Iere						
15752137	3574387	wkdt	Q5990061						
15431379	3574388	wkdt	Q34941899						
15958942	3574388		Icacos Point						
16948854	3574391		Huila River						
16948855	3574391		Huila						
13859798	3574393	en	Huevos Passage						
1454468	3574394		Island of Huevos						
2986071	3574394	link	https://en.wikipedia.org/wiki/Huevos						
7771834	3574394		Huevos						
16471618	3574394	en	Huevos Island						
16948856	3574397		Horquette River						
16948857	3574397		Horquette						
16948858	3574398		Hope River						
16948859	3574398		Hope						
16948860	3574400		Honda River						
16948861	3574400		Honda						
1454469	3574401		Quebrada Honda River						
7771835	3574401		Quebrada Honda						
16948862	3574402		Homard River						
16948863	3574402		Homard						
1454470	3574403		Homard Village						
7771836	3574403		Homard						
2986072	3574404	link	https://en.wikipedia.org/wiki/Hollis_Reservoir						
7771837	3574404		Hollis Reservoir						
16948864	3574406		Hillsborough West River						
16948865	3574406		Hillsborough West						
16948866	3574407		Hillsborough East River						
16948867	3574407		Hillsborough East						
15509592	3574408	wkdt	Q34835489						
15958943	3574408		Hillsborough Dam						
7771838	3574411		Saint Hilaire River						
7771839	3574411		Hilaire River						
8618389	3574412		Quebrada del Hierro River						
8618390	3574412		Quebrada del Hierro						
1454471	3574416		Hermitage Village						
7771840	3574416		Hermitage						
1454472	3574418		Hawkes Bill						
4307644	3574418		Hawk’s Bill						
1454473	3574420		Hasnally						
7771841	3574420		Hasnalli						
16948868	3574422		Harris River						
16948869	3574422		Harris						
15394873	3574423	wkdt	Q31592830						
15958944	3574423		Morne Harrison						
15696176	3574424	wkdt	Q31592844						
15958945	3574424		Mount Harris						
16948870	3574427		Gucharon River						
16948871	3574427		Gucharon						
15431234	3574428	wkdt	Q31391344						
15958946	3574428		Guayare Hill						
16948872	3574429		Guayanapa River						
16948873	3574429		Guayanapa						
1454474	3574430		Guaymare River						
7771842	3574430		Guayamare River						
16948874	3574430		Guayamare						
1454475	3574431		Guayamare Point						
7771843	3574431		Guayamara Point						
15803255	3574431	wkdt	Q34908751						
1454476	3574434		Guayaguayare Ward						
1454477	3574434		Guayaguayare						
4307645	3574434		Ward of Guayaguayare						
1454478	3574435		Guayaguayare Village						
2986073	3574435	link	https://en.wikipedia.org/wiki/Guayaguayare						
4307646	3574435		Guayaguayare						
13801103	3574435	unlc	TTGUA						
16948875	3574436		Guayabal River						
16948876	3574436		Guayabal						
16948877	3574437		Guayabal River						
16948878	3574437		Guayabal						
15531227	3574438	wkdt	Q34908738						
15958947	3574438		Guatuaro Point						
1454479	3574439		Guatepajaro River						
7771844	3574439		Guatapajaro River						
16948879	3574439		Guatapajaro						
16948880	3574440		Guatacare River						
16948881	3574440		Guatacare						
16948882	3574442		Guarapiche River						
16948883	3574442		Guarapiche						
16948884	3574443		Guaracarite River						
16948885	3574443		Guaracarite						
7534367	3574444	link	https://en.wikipedia.org/wiki/Guaracara_River						
7566316	3574444		Guaracara River						
1454480	3574445		Guaracara Junction Village						
7771845	3574445		Guaracara Junction						
16948886	3574447		Guapo River						
16948887	3574447		Guapo						
16948888	3574448		Guapo River						
16948889	3574448		Guapo						
13801104	3574450	unlc	TTGUO						
13826852	3574450		Guapo						
16948890	3574451		Guanapure River						
16948891	3574451		Guanapure						
16948892	3574452		Guanapo River						
16948893	3574452		Guanapo						
1454481	3574455		Cunapo						
1454482	3574455		Gunapo						
7771846	3574455		Guanapo						
16948894	3574456		Guanacuna River						
16948895	3574456		Guanacuna						
1454483	3574458		Valencia Forest Reserve						
1454484	3574458		Guaico-Valencia Undemarcated Reserve						
7771847	3574458		Guaico-Valencia Reserve						
16948896	3574460		Guaico River						
16948897	3574460		Guaico						
1454485	3574461		Guaico Village						
7079118	3574461	link	https://en.wikipedia.org/wiki/Guaico						
7771848	3574461		Guaico						
16948898	3574462		Gros Tuero River						
16948899	3574462		Gros Tuero						
15396738	3574463	wkdt	Q31391349						
15958948	3574463		Gros Morne						
1454486	3574466		Greenhill Village						
7771849	3574466		Green Hill						
1454487	3574467		Coffee Hill						
16652107	3574467		Green Hill						
1454492	3574474		Grande Ravine						
7771850	3574474		Grand Ravine						
1454493	3574475		Matelot Point						
7771851	3574475		Grand Matelot Point						
15651955	3574475	wkdt	Q34902593						
16948900	3574476		Grand Lagon River						
16948901	3574476		Grand Lagon						
16948902	3574477		Grand Goudron River						
16948903	3574477		Grand Goudron						
16948904	3574478		Grand Fond River						
16948905	3574478		Grand Fond						
1454494	3574479		Dehert Bay						
7771852	3574479		Grand Fond Bay						
15250033	3574481	wkdt	Q34902693						
15958949	3574481		Grande Riviere Point						
1454495	3574483		Grande Rivierre						
7771853	3574483		Grande Rivière						
1454496	3574486		Grande Riviere Village						
2986074	3574486	link	https://en.wikipedia.org/wiki/Grande_Riviere						
7771854	3574486		Grande Riviere						
15546826	3574486	wkdt	Q5595354						
1454497	3574489		Trou Grandecaille						
7771855	3574489		Trou Grande-écaille						
1454498	3574494		Quebrada Grande River						
7771856	3574494		Quebrada Grande						
16136438	3574496	link	https://en.wikipedia.org/wiki/Grande-Anse						
16211643	3574496		Grand Anse						
15626400	3574498	wkdt	Q34902505						
15958950	3574498		Gran Cayo Point						
1454499	3574499		Ganby Point						
4307648	3574499		Granby Point						
15646494	3574499	wkdt	Q34902531						
15203179	3574501	wkdt	Q34830631						
15958951	3574501		Cape Gracias-a-Dios						
1454500	3574504		Anse Goulême						
4307649	3574504		Gouleme Bay						
1454501	3574508		Great River						
4307650	3574508		Goldsborough River						
16948906	3574508		Goldsborough						
8618391	3574514		Golconda						
8618392	3574514		Colconda						
16948907	3574515		Godineau River						
16948908	3574515		Godineau						
1454502	3574516		Goat Islet						
4307651	3574516		Goat Island						
7547683	3574516	link	https://en.wikipedia.org/wiki/Goat_Island_%28Trinidad_and_Tobago%29						
15839804	3574517	wkdt	Q18528473						
15958952	3574517		Glamorgan						
1454503	3574518		Point Gimé						
7771857	3574518		Point Girod						
7424138	3574520		Fort King George						
7424139	3574520		Fort George						
16948909	3574522		Gasparillo River						
16948910	3574522		Gasparillo						
1454504	3574523		Gasparillo						
1454505	3574523		Gasparillo Islet						
7525655	3574523	link	https://en.wikipedia.org/wiki/Gasparillo_Island						
7771858	3574523		Gasparillo Island						
1454506	3574524		Gasparillo Village						
2986075	3574524	link	https://en.wikipedia.org/wiki/Gasparillo						
7771859	3574524		Gasparillo						
13801102	3574524	unlc	TTGSP						
2062	3574525		Gasparee						
2986076	3574525	link	https://en.wikipedia.org/wiki/Gaspar_Grande						
7771860	3574525		Gaspar Grande						
15641112	3574526	wkdt	Q31592860						
15958953	3574526		Morne Gasparee						
16948911	3574527		Garth River						
16948912	3574527		Garth						
1454507	3574531		Galpha Point						
7771861	3574531		Galfa Point						
15469585	3574531	wkdt	Q34892742						
1454508	3574532		Point Galera						
7771862	3574532		Galera Point						
15613673	3574532	wkdt	Q5518430						
1454509	3574533		Point Galeota						
4307652	3574533		Galeota Point						
13801116	3574533	unlc	TTPTG						
15360366	3574533	wkdt	Q34892717						
1454510	3574536		Fyzabad Village						
2986077	3574536	link	https://en.wikipedia.org/wiki/Fyzabad						
7771863	3574536		Fyzabad						
13801101	3574536	unlc	TTFXD						
15538812	3574536	wkdt	Q5511310						
1454511	3574539		Anse Fromager						
4307653	3574539		Fromager Bay						
16948913	3574543		Frenchmans River						
16948914	3574543		Frenchmans						
1454512	3574553		Four Roads Village						
7771864	3574553		Four Roads						
1454513	3574554		Anse Fourmi						
4307654	3574554		Fourmi Bay						
15481117	3574555	wkdt	Q34888252						
15958954	3574555		Fou Point						
1454514	3574557		Point Guapo						
7771865	3574557		Point Fortin						
16948915	3574559		Forest River						
16948916	3574559		Forest						
16948917	3574560		Forest River						
16948918	3574560		Forest						
15450695	3574562	wkdt	Q34886017						
15958955	3574562		Forest Point						
1454515	3574563		Fonrose Village						
7771866	3574563		Fonrose						
1454516	3574566		Brasso Caparo Village						
7771867	3574566		Flanagin Town						
1454517	3574567		Anse Flamengo						
4307655	3574567		Flamengo Bay						
15600172	3574568	wkdt	Q31592875						
15958956	3574568		Flagstaff						
1454518	3574569		Laurel Hill						
7771868	3574569		Five Rivers Estate						
1454519	3574570		Las Cotorras						
7771869	3574570		Five Islands						
1454520	3574571		La Filette Point						
7771870	3574571		Filette Point						
15242497	3574571	wkdt	Q34866746						
1454521	3574572		Fillette						
1454522	3574572		Filette Village						
7771871	3574572		Filette						
1454523	3574574		Fernando Ravine						
7771872	3574574		Ferdinand River						
16948919	3574574		Ferdinand						
1454524	3574578		Exchange Village						
7771873	3574578		Exchange						
1454525	3574579		Point Baleine						
1454526	3574579		Pointe Baleine						
1454527	3574579		Baleine Point						
7771874	3574579		Espolon Point						
15349664	3574579	wkdt	Q34863716						
1454528	3574581		River Esperance						
7771875	3574581		Esperance River						
16948920	3574581		Esperance						
1454529	3574582		Esperance Village						
7771876	3574582		Esperance						
16948921	3574585		Erin River						
16948922	3574585		Erin						
1454530	3574586		Erin Forest Reserve						
7771877	3574586		Erin Reserve						
15458657	3574587	wkdt	Q34863061						
15958957	3574587		Erin Point						
1454531	3574589		Herine Bay						
1454532	3574589		Bay de Erin						
7771878	3574589		Erin Bay						
1454533	3574590		Erin Ward						
1454534	3574590		Erin						
7771879	3574590		Ward of Erin						
16948923	3574591		Erasmus River						
16948924	3574591		Erasmus						
15794760	3574592	wkdt	Q34862736						
16948925	3574594		Englishman’s Bay River						
16948926	3574594		Englishman’s Bay						
7323599	3574595		Englishman’s Bay						
7032838	3574596	link	https://en.wikipedia.org/wiki/Englishman%27s_Bay						
1454535	3574598		Tucuche						
1454536	3574598		Mount Tucuche						
2986078	3574598	link	https://en.wikipedia.org/wiki/El_Tucuche						
16948927	3574600		El Rincon River						
16948928	3574600		El Rincon						
1454537	3574602		El Manacal						
1454538	3574602		Manacal Ravine						
7771880	3574602		El Manacal River						
16948929	3574603		El Mamo River						
16948930	3574603		El Mamo						
1454539	3574605		Cupan Ravine						
7771881	3574605		El Cupan River						
16948931	3574605		El Cupan						
1454540	3574607		Eckel Ville						
7771882	3574607		Eckel Village						
1454541	3574608		Ecclesville Village						
7771883	3574608		Ecclesville						
16948932	3574609		Eau Claire River						
16948933	3574609		Eau Claire						
1454542	3574610		East Rocks						
4307656	3574610		East Rock						
1454543	3574612		First Channel						
4307657	3574612		Eastern Channel						
1454544	3574615		Erthig						
4307658	3574615		Earthigg						
16948934	3574616		Durity River						
16948935	3574616		Durity						
15251794	3574617	wkdt	Q31391351						
15958958	3574617		Dunmore Hill						
13859799	3574619		Domus Bay						
13859800	3574619		Geoffroy Bay						
1454545	3574622		Boca de Dragos						
1454546	3574622		Drachenschlund						
1454547	3574622	es	Boca del Dragón				1		
1454548	3574622	en	Dragons Mouth	1					
1454549	3574622		Bocas del Drago						
1454550	3574622		The Dragon’s Mouths						
1454551	3574622		Boca del Drago						
1454552	3574622		Boca Navíos						
1454553	3574622	es	Bocas del Dragón	1					
1454554	3574622		Bocas de Dragos						
1454555	3574622		Boca del Dragos						
1454556	3574622		Boca de Navios						
4307659	3574622		Dragons Mouths						
7910376	3574622	link	https://en.wikipedia.org/wiki/Bocas_del_Drag%C3%B3n						
1454557	3574623		Dow Village						
1454558	3574623		Dow						
7771884	3574623		Dowe						
16948936	3574624		Douce Branche River						
16948937	3574624		Douce Branche						
16948938	3574625		Doubloon River						
16948939	3574625		Doubloon						
15461439	3574626	wkdt	Q34852113						
15958959	3574626		Dopsion Point						
1454559	3574627		Don Juan Ravine						
7771885	3574627		Don Juan River						
16948940	3574627		Don Juan						
15250097	3574629	wkdt	Q34851841						
15958960	3574629		Dominique Point						
16948941	3574630		Doctors River						
16948942	3574630		Doctors						
15591364	3574631	wkdt	Q31592891						
15958961	3574631		Morne Distree						
16948943	3574634		Diego Martin River						
16948944	3574634		Diego Martin						
1454561	3574635		Diego Martin						
1454562	3574635		Diego Martin Ward						
8791491	3574635	link	https://en.wikipedia.org/wiki/Diego_Martin						
1454563	3574636		Diego Martin Village						
2986079	3574636	link	https://en.wikipedia.org/wiki/Diego_Martin						
7771887	3574636		Diego Martin						
13801099	3574636	unlc	TTDMT						
15374544	3574636	wkdt	Q1220518						
8684472	3574638	link	https://en.wikipedia.org/wiki/Dibe_%28Trinidad_and_Tobago%29						
8802819	3574638		Dibe						
1454564	3574643		Diamond Village						
7771888	3574643		Diamond						
1454565	3574644		Mount Diablo						
7771889	3574644		Morne Diablo						
16948945	3574650		Depot River						
16948946	3574650		Depot						
1454566	3574653		Punta Delgada						
7771890	3574653		Delgada Point						
15264478	3574653	wkdt	Q34848433						
16948947	3574656		Defour River						
16948948	3574656		Defour						
15217983	3574657	wkdt	Q34848237						
15958962	3574657		Defour Point						
1454567	3574659		Débé Village						
2986080	3574659	link	https://en.wikipedia.org/wiki/Debe						
7771891	3574659		Debe						
7771892	3574659		Débé						
15707760	3574659	wkdt	Q48767330						
16948949	3574660		Dead Bay River						
16948950	3574660		Dead Bay						
16948951	3574661		Darrell Spring River						
16948952	3574661		Darrell Spring						
16948953	3574663		Damien River						
16948954	3574663		Damien						
1454568	3574665		Dabadie Village						
7771893	3574665		D’Abadie						
7771894	3574665		Dabadie						
8071016	3574665	link	https://en.wikipedia.org/wiki/D%27Abadie						
13801083	3574665	unlc	TT7AD						
13801098	3574665	unlc	TTDAE						
8618393	3574667		Cushe River						
8618394	3574667		Cush River						
16948955	3574667		Cushe						
16948956	3574668		Curumpalo River						
16948957	3574668		Curumpalo						
1454569	3574669		Grande Curucay River						
7771895	3574669		Curucaye River						
16948958	3574669		Curucaye						
1454570	3574671		Curepe Village						
2986081	3574671	link	https://en.wikipedia.org/wiki/Curepe						
7771896	3574671		Curepe						
13801096	3574671	unlc	TTCUR						
15344952	3574671	wkdt	Q5194706						
1454571	3574672		Curao Point						
7771897	3574672		Point Curao						
1454572	3574673		Coorampo River						
7771898	3574673		Curampo River						
16948959	3574673		Curampo						
1454573	3574674		Cooramata River						
7771899	3574674		Curamata River						
16948960	3574674		Curamata						
16948961	3574675		Curaguate River						
16948962	3574675		Curaguate						
16948963	3574676		Cupei River						
16948964	3574676		Cupei						
16948965	3574678		Cunupia River						
16948966	3574678		Cunupia						
1454574	3574679		Cunupia						
1454575	3574679		Cunupia Ward						
7771900	3574679		Ward of Cunupia						
1454576	3574680		Cunupia Village						
2986082	3574680	link	https://en.wikipedia.org/wiki/Cunupia						
7771901	3574680		Cunupia						
1454577	3574681		Gunaripa River						
7771902	3574681		Cunaripa River						
16948967	3574681		Cunaripa						
1454578	3574683		Cunapa River						
7771903	3574683		Cunapo River						
16948968	3574683		Cunapo						
16948969	3574684		Cunapo River						
16948970	3574684		Cunapo						
16948971	3574686		Cumuto River						
16948972	3574686		Cumuto						
1454579	3574687		Cumato River						
7771904	3574687		Cumuto River						
16948973	3574687		Cumuto						
8246173	3574688		Cumuto Reserve						
8246174	3574688		Long Stretch Forest Reserve						
1454580	3574689		Cumuto Village						
2986083	3574689	link	https://en.wikipedia.org/wiki/Cumuto						
7771905	3574689		Cumuto						
15309211	3574689	wkdt	Q5194192						
16948974	3574692		Cumana River						
16948975	3574692		Cumana						
16948976	3574693		Cumana River						
16948977	3574693		Cumana						
15657197	3574694	wkdt	Q34844454						
15958963	3574694		Cumana Point						
16948978	3574698		Cumaca River						
16948979	3574698		Cumaca						
15233714	3574702	wkdt	Q31592934						
15958964	3574702		Cerro de las Cuevas y Maracas						
16948980	3574703		Cuesa River						
16948981	3574703		Cuesa						
16948982	3574704		Cuche River						
16948983	3574704		Cuche						
1454581	3574706		Quare River						
7771906	3574706		Cuare River						
16948984	3574706		Cuare						
1454582	3574707	en	Crown Point Airport				1		
1893001	3574707	icao	TTCP						
1893002	3574707	iata	TAB						
2986084	3574707	link	https://en.wikipedia.org/wiki/Arthur_Napoleon_Raymond_Robinson_International_Airport						
8545237	3574707	en	Arthur Napoleon Raymond Robinson International Airport						
8545238	3574707	en	A.N.R. Robinson International Airport		1				
8545239	3574707	ja	クラウン・ポイント空港						
8545240	3574707	fa	فرودگاه بین‌المللی آرتور ناپلئون ریموند رابینسون						
8545241	3574707	fr	Aéroport international Arthur Napoleon Raymond Robinson						
8545242	3574707	fr	Aéroport international ANR Robinson						
9709883	3574707	de	A. N. R. Robinson International Airport	1					
15631154	3574707	wkdt	Q1431143						
1454583	3574708		Brown’s Point						
4307660	3574708		Crown Point						
15746682	3574708	wkdt	Q34844339						
16154469	3574708	link	https://en.wikipedia.org/wiki/Crown_Point%2C_Tobago						
1454584	3574710		Cronstadt						
7528511	3574710	link	https://en.wikipedia.org/wiki/Cronstadt_Island						
7771907	3574710		Cronstadt Islet						
16948985	3574712		Creosote River						
16948986	3574712		Creosote						
16948987	3574713		Crayfish River						
16948988	3574713		Crayfish						
16948989	3574714		Crapaud River						
16948990	3574714		Crapaud						
16948991	3574715		Crapaud River						
16948992	3574715		Crapaud						
16948993	3574716		Cranmore River						
16948994	3574716		Cranmore						
16948995	3574717		Cow Foot River						
16948996	3574717		Cow Foot						
16948997	3574718		Covigne River						
16948998	3574718		Covigne						
1454585	3574721		Rio de Cuba						
1454586	3574721		Rio de Couva						
7771908	3574721		Couva River						
16948999	3574721		Couva						
1454587	3574722		Couva						
4307661	3574722		Couva Production Platform						
1454588	3574723		Couva						
1454589	3574723		Couva Ward						
7771909	3574723		Ward of Couva						
1454590	3574724		Couva Savannah Village						
2986085	3574724	link	https://en.wikipedia.org/wiki/Couva						
11415924	3574724	fa	کووا						
11415925	3574724	ur	کؤوا						
13801097	3574724	unlc	TTCVA						
16949000	3574725		Courland River						
16949001	3574725		Courland						
15312115	3574726	wkdt	Q34842852						
15958965	3574726		Courland Point						
15498203	3574728	wkdt	Q34829965						
15958966	3574728		Cape Courbaril						
15488697	3574731	wkdt	Q34842654						
15958967	3574731		Corvo Point						
8618395	3574732		Coral Point						
8618396	3574732		Corral Point						
14936689	3574732	wkdt	Q34842416						
14898367	3574733	wkdt	Q34842609						
16949002	3574734		Coroyal River						
16949003	3574734		Coroyal						
15582087	3574739	wkdt	Q34842321						
15958968	3574739		Copper Hole						
16949004	3574740		Coora River						
16949005	3574740		Coora						
16949006	3574742		Cook’s River						
16949007	3574742		Cook’s						
16949008	3574748		Comparo River						
16949009	3574748		Comparo						
1454591	3574750		Kennedys Point						
4307662	3574750		Columbus Point						
14945981	3574750	wkdt	Q34841632						
8089678	3574751	link	https://en.wikipedia.org/wiki/Columbus_Channel						
8108710	3574751		Columbus Channel						
16660761	3574751	ru	Бока-де-ла-Сьерпе (пролив Колумба)						
16949010	3574753		Colenso River						
16949011	3574753		Colenso						
8618397	3574754		Golconda						
8618398	3574754		Colconda						
1454592	3574755		Point Courant						
7771910	3574755		Cape Cola						
16949012	3574756		Coffee River						
16949013	3574756		Coffee						
8618399	3574758		Corial Hill						
8618400	3574758		Cocoyal Hill						
16949014	3574760		Cocorite River						
16949015	3574760		Cocorite						
16949016	3574761		Cocorite River						
16949017	3574761		Cocorite						
1454593	3574768		Cocal Ward						
1454594	3574768		Cocal						
7771911	3574768		Ward of Cocal						
16949018	3574771		Clinton River						
16949019	3574771		Clinton						
1454595	3574773		Claxton Bay Village						
7075059	3574773	link	https://en.wikipedia.org/wiki/Claxton_Bay						
7771912	3574773		Claxton Bay						
13801093	3574773	unlc	TTCLA						
7202658	3574775	link	https://en.wikipedia.org/wiki/Rio_Claro%2C_Trinidad_and_Tobago						
16211644	3574775		Rio Claro						
16949020	3574777		Clair River						
16949021	3574777		Clair						
16949022	3574780		Cipero River						
16949023	3574780		Cipero						
8618401	3574782		Cemetiere River						
8618402	3574782		Cimetiere River						
16949024	3574782		Cemetiere						
16949025	3574783		Cimaronero River						
16949026	3574783		Cimaronero						
15524408	3574784	wkdt	Q34839916						
15958969	3574784		Chupara Point						
1454596	3574787		La Josefita						
7771913	3574787		Chimborazo						
7070057	3574788	link	https://en.wikipedia.org/wiki/Chickland						
7771914	3574788		Chickland						
16949027	3574792		Chaudiere River						
16949028	3574792		Chaudiere						
1454597	3574794		Chase						
7771915	3574794		Chase Village						
13801090	3574794	unlc	TTCHE						
16949029	3574795		Charuma River						
16949030	3574795		Charuma						
1454598	3574796		Charuma						
1454599	3574796		Charuma Ward						
7771916	3574796		Ward of Charuma						
2986086	3574798	link	https://en.wikipedia.org/wiki/Charlotteville						
4307663	3574798		Charlotteville						
13801092	3574798	unlc	TTCHV						
15559096	3574799	wkdt	Q34838588						
15958970	3574799		Charasca Point						
1454600	3574801		Chandanagere River						
7771917	3574801		Chandernagore River						
16949031	3574801		Chandernagore						
15462747	3574803	wkdt	Q31592963						
15958971	3574803		Morne Chaleur						
16949032	3574804		Chaguaramas River						
16949033	3574804		Chaguaramas						
1454601	3574805		Staubles Bay						
7771918	3574805		Chaguaramas Bay						
2986087	3574806	link	https://en.wikipedia.org/wiki/Chaguaramas%2C_Trinidad_and_Tobago						
7771919	3574806		Chaguaramas						
13801089	3574806	unlc	TTCHA						
1454602	3574807		Quebrada de Chaguaranal						
7771920	3574807		Quebrada de Chaguaramal						
15518878	3574808	wkdt	Q31592979						
15958972	3574808		Chaguaramal						
1454603	3574809		Chaguanas						
1454604	3574809		Chaguanas Ward						
8791492	3574809	link	https://en.wikipedia.org/wiki/Chaguanas						
5424421	3574810	link	https://en.wikipedia.org/wiki/Chaguanas						
11760591	3574810	fr	Chaguanas						
13394111	3574810		Chaguanas						
13394112	3574810		Chaguanas Village						
13801091	3574810	unlc	TTCHG						
16949034	3574811		Chagonaray River						
16949035	3574811		Chagonaray						
1454606	3574812		Chagonary Point						
1454607	3574812		Chagoray Point						
7771921	3574812		Chagonaray Point						
15683739	3574812	wkdt	Q34838146						
16949036	3574814		Centre River						
16949037	3574814		Centre						
1454608	3574816		Central Range Forest Reserve						
4307664	3574816		Central Range Reserve						
1454609	3574817		Central Highlands						
4307665	3574817		Central Range						
5904028	3574817	link	https://en.wikipedia.org/wiki/Central_Range%2C_Trinidad_and_Tobago						
7771922	3574818		Centeno						
7771923	3574818		Centento						
1454610	3574819		Ceniza Ravine						
7771924	3574819		Ceniza River						
16949038	3574819		Ceniza						
15502402	3574821	wkdt	Q34837970						
15958973	3574821		Cedros Point						
1454611	3574824		Cedros Ward						
1454612	3574824		Cedros						
7771925	3574824		Ward of Cedros						
6892650	3574825	link	https://en.wikipedia.org/wiki/Caura_River_%28Trinidad_and_Tobago%29						
7771926	3574825		Caura River						
16949039	3574825		Caura						
16949040	3574827		Cats Hill River						
16949041	3574827		Cats Hill						
15338615	3574829	wkdt	Q31391363						
15958974	3574829		Cats Hill						
16949042	3574831		Castara River						
16949043	3574831		Castara						
16949044	3574832		Castara Down River						
16949045	3574832		Castara Down						
2986088	3574834	link	https://en.wikipedia.org/wiki/Castara						
4307666	3574834		Castara						
15204178	3574834	wkdt	Q5049606						
16949046	3574836		Cascas River						
16949047	3574836		Cascas						
15308253	3574837	wkdt	Q34836580						
15958975	3574837		Cascajal Point						
16949048	3574838		Cascadura River						
16949049	3574838		Cascadura						
16949050	3574839		Cascade River						
16949051	3574839		Cascade						
1454613	3574840		Casa Cruz Point						
4307667	3574840		Cape Casa Cruz						
14845644	3574840	wkdt	Q34829870						
1454614	3574841		Carrera						
7771927	3574841		Carrera Islet						
1454615	3574843		Caroni Savanna						
1454616	3574843		Caroni Savannah						
4307668	3574843		Caroni Swamp						
6892838	3574845	link	https://en.wikipedia.org/wiki/Caroni_River_%28Trinidad_and_Tobago%29						
6922970	3574845		Caroni River						
16949052	3574845		Caroni						
7546713	3574846	link	https://en.wikipedia.org/wiki/Caroni-Arena_Dam						
7771928	3574846		Caroni Arena Dam						
13801088	3574848	unlc	TTCAR						
13826853	3574848		Caroni						
16949053	3574851		Carlo Salou River						
16949054	3574851		Carlo Salou						
1454622	3574854		Careenage Bay						
7771929	3574854		Carenage Bay						
1454623	3574855		Saint Pierre						
1454624	3574855		Saint Pierre Village						
7052559	3574855	link	https://en.wikipedia.org/wiki/Carenage						
7771930	3574855		Carenage						
13801095	3574855	unlc	TTCRN						
15463890	3574855	wkdt	Q18385079						
15461833	3574859	wkdt	Q34836299						
15958976	3574859		Carat Point						
16949055	3574860		Caratara River						
16949056	3574860		Caratara						
16949057	3574861		Caratal River						
16949058	3574861		Caratal						
1454625	3574864		Roxborough Bay						
4307669	3574864		Carapuse Bay						
2986089	3574866	link	https://en.wikipedia.org/wiki/Carapichaima						
7771931	3574866		Carapichaima						
13801094	3574866	unlc	TTCPC						
16949059	3574867		Carapa River						
16949060	3574867		Carapa						
16949061	3574868		Carapal River						
16949062	3574868		Carapal						
1454626	3574869		Calap River						
7771932	3574869		Carapal River						
16949063	3574869		Carapal						
15634624	3574870	wkdt	Q31391365						
15958977	3574870		Carapal Ridge						
1454627	3574871		Carenage River						
4307670	3574871		Caranache River						
16949064	3574871		Caranache						
16949065	3574872		Cap-de-Ville River						
16949066	3574872		Cap-de-Ville						
1454628	3574874		Cape-de-Ville						
7771933	3574874		Cap-de-Ville						
16151049	3574876	link	https://en.wikipedia.org/wiki/Caparo_River_%28Trinidad_and_Tobago%29						
16211645	3574876		Caparo River						
16949067	3574876		Caparo						
1454629	3574878		Cantaro Village						
7771934	3574878		Cantaro						
15300830	3574880	wkdt	Q34826383						
15958978	3574880		Cangrejos Point						
1454630	3574881		Couva Bay						
7771935	3574881		Cangrejos Bay						
1454631	3574884		Canarie River						
4307671	3574884		Canari River						
16949068	3574884		Canari						
15546308	3574885	wkdt	Q34826350						
15958979	3574885		Canari Point						
2986090	3574887	link	https://en.wikipedia.org/wiki/Canaan%2C_Tobago						
4307672	3574887		Canaan						
13801087	3574887	unlc	TTCAA						
16949069	3574889		Campo River						
16949070	3574889		Campo						
16949071	3574891		Cambural River						
16949072	3574891		Cambural						
1454632	3574893		Campbeltown						
4307673	3574893		Cambleton						
1454633	3574895		California Village						
7080854	3574895	link	https://en.wikipedia.org/wiki/California%2C_Trinidad_and_Tobago						
7771936	3574895		California						
1454634	3574898		Mount Calabash						
7771937	3574898		Morne Calebasse						
16949073	3574901		Caigual River						
16949074	3574901		Caigual						
16949075	3574902		Caigual River						
16949076	3574902		Caigual						
1454635	3574907		Cabresse Islet						
7771938	3574907		Cabresse Island						
1454636	3574911		Busy Corner Village						
7771939	3574911		Busy Corner						
1454637	3574912		Burro Ravine						
7771940	3574912		Burro River						
16949077	3574912		Burro						
1454638	3574914		Buenos Aires						
2986091	3574914	link	https://en.wikipedia.org/wiki/Buenos_Ayres						
7771941	3574914		Buenos Ayres						
15349271	3574914	wkdt	Q4985560						
1454639	3574915		Buen Intento Village						
7771942	3574915		Buen Intento						
1454640	3574916		Buccoo Reef						
4307674	3574916		Buccoo Coral Reef						
1454641	3574920		The Brothers						
4307675	3574920		Brothers Rocks						
1454642	3574923		Brisant Bay						
4307676	3574923		Anse Brisant						
16949078	3574930		Breakfast River						
16949079	3574930		Breakfast						
16949080	3574932		Brasso Venado River						
16949081	3574932		Brasso Venado						
16949082	3574936		Brasso Piedra River						
16949083	3574936		Brasso Piedra						
1454643	3574938		Brasso Village						
1454644	3574941		Bass River						
7771943	3574941		Boss River						
16949084	3574941		Boss						
15789183	3574945	wkdt	Q34813920						
15958980	3574945		Booby Point						
1454645	3574946		Booby Islet						
4307677	3574946		Booby Island						
15688872	3574947	wkdt	Q34813909						
15958981	3574947		Bontour Point						
1454646	3574949		Bonne Terre Village						
7771944	3574949		Bonne Terre						
7063103	3574950	link	https://en.wikipedia.org/wiki/Bonne_Aventure						
7771945	3574950		Bonne Aventure						
1454647	3574951		Bonasse Village						
7771946	3574951		Bonasse						
11298296	3574951	link	https://en.wikipedia.org/wiki/Bonasse						
15780381	3574951	wkdt	Q16844230						
9709880	3574952	de	Bon Accord	1					
9709881	3574952	fr	Bon Accord	1					
9709882	3574952	en	Bon Accord	1					
9762675	3574952		Bon Accord Village						
1454648	3574956		La Fragua Island						
1454649	3574956		La Fragua Islands						
7771947	3574956		Bolo Rocks						
1454650	3574957		Boissière						
4307678	3574957		Boissiere Village						
16949085	3574958		Bois Neuf River						
16949086	3574958		Bois Neuf						
1454651	3574961		Aripe River						
7771948	3574961		Blue River						
16949087	3574961		Blue						
16949088	3574962		Blue Basin River						
16949089	3574962		Blue Basin						
15693970	3574964	wkdt	Q35354707						
15958982	3574964		Blue Basin						
16949090	3574965		Bloody Bay River						
16949091	3574965		Bloody Bay						
1454652	3574969		Blanchisseuse Undemarcated Forest Reserve						
7771949	3574969		Blanchisseuse Reserve						
1454653	3574971		Blanchisseuse						
1454654	3574971		Blanchisseuse Ward						
7771950	3574971		Ward of Blanchisseuse						
1454655	3574972		Blanchisseuse Village						
2986092	3574972	link	https://en.wikipedia.org/wiki/Blanchisseuse						
7771951	3574972		Blanchisseuse						
16949092	3574975		Blanche River						
16949093	3574975		Blanche						
16949094	3574978		Blackwater River						
16949095	3574978		Blackwater						
16949096	3574979		Blackwater River						
16949097	3574979		Blackwater						
16949098	3574981		Black Swamp River						
16949099	3574981		Black Swamp						
16949100	3574982		Blacksoil River						
16949101	3574982		Blacksoil						
16949102	3574987		Black River						
16949103	3574987		Black						
16949104	3574990		Biche River						
16949105	3574990		Biche						
1454656	3574991		Biche Village						
2986093	3574991	link	https://en.wikipedia.org/wiki/Biche						
7771952	3574991		Biche						
15495815	3574991	wkdt	Q4903600						
15262309	3574993	wkdt	Q34808688						
15958983	3574993		Bennette Point						
16183714	3574995	link	https://en.wikipedia.org/wiki/Belmont%2C_Port_of_Spain						
16211646	3574995		Belmont						
1454657	3574996		Belmont House						
4307679	3574996		Belmont						
16949106	3574997		Belle River						
16949107	3574997		Belle						
16949108	3574999		Bel Air River						
16949109	3574999		Bel Air						
1454658	3575000		Anse Bateau						
4307680	3575000		Bateau Bay						
1454659	3575001		Basseterre Village						
7771953	3575001		Basse Terre						
1454660	3575003		Barrow River						
7771954	3575003		Rio Barro						
1454661	3575004		Barrel of Beef						
4307681	3575004		Barrel of Beef Rock						
1454662	3575005		Barrel of Beef						
16652108	3575005		Barrel of Beef Rock						
16949110	3575006		Barrancones River						
16949111	3575006		Barrancones						
15468829	3575007	wkdt	Q34807403						
15958984	3575007		Barrancones Point						
15568120	3575009	wkdt	Q34807395						
15958985	3575009		Barracuta Point						
1454663	3575010		Barrackpore Settlement						
7771955	3575010		Barrackpore						
13801085	3575010	unlc	TTBAE						
2986094	3575012	link	https://en.wikipedia.org/wiki/Barataria%2C_Trinidad_and_Tobago						
7771956	3575012		Barataria						
13801082	3575012	unlc	TT4BT						
1454664	3575015		Bamboo Village						
7771957	3575015		Bamboo						
1454665	3575016		Biron Bay						
7771958	3575016		Balmoral Bay						
1454666	3575017		Balmain Village						
7771959	3575017		Balmain						
13801086	3575017	unlc	TTBAN						
16949112	3575018		Balata River						
16949113	3575018		Balata						
16949114	3575022		Balantia River						
16949115	3575022		Balantia						
1454667	3575023		Balandra Ravine						
7771960	3575023		Balandra River						
16949116	3575023		Balandra						
15225724	3575026	wkdt	Q34802408						
15958986	3575026		Bagatelle Point						
16949117	3575027		Bacolet River						
16949118	3575027		Bacolet						
15447952	3575028	wkdt	Q34802297						
15958987	3575028		Bacolet Point						
6897862	3575030	link	https://en.wikipedia.org/wiki/Bacolet						
6922971	3575030		Bacolet						
16949119	3575033		Baccus River						
16949120	3575033		Baccus						
1454668	3575036		Avoca Ravine						
7771961	3575036		Avoca River						
16949121	3575036		Avoca						
16949122	3575038		Arouca River						
16949123	3575038		Arouca						
1454669	3575039		Arouca Village						
2986095	3575039	link	https://en.wikipedia.org/wiki/Arouca%2C_Trinidad_and_Tobago						
7771962	3575039		Arouca						
13801084	3575039	unlc	TTARA						
2986096	3575041	link	https://en.wikipedia.org/wiki/Arnos_Vale%2C_Trinidad_and_Tobago						
4307682	3575041		Arnos Vale						
16949124	3575043		Aripo River						
16949125	3575043		Aripo						
15158706	3575044	wkdt	Q34799696						
15958988	3575044		Aripo Point						
1454670	3575045		Cerro Aripo						
2986097	3575045	link	https://en.wikipedia.org/wiki/El_Cerro_del_Aripo						
16949126	3575046		Aripero River						
16949127	3575046		Aripero						
1454671	3575047		Aripero						
7771963	3575047		Aripero Estate						
16949128	3575048		Arima River						
16949129	3575048		Arima						
1454672	3575049		Arima Forest Reserve						
7771964	3575049		Arima Fuel Reserve						
1454673	3575050		Arima Ward						
1454674	3575050		Arima						
4307683	3575050		Ward of Arima						
1454675	3575051		Town of Arima						
4307684	3575051		Arima						
5424420	3575051	link	https://en.wikipedia.org/wiki/Arima,_Trinidad_and_Tobago						
11760595	3575051	fr	Arima						
13801135	3575051	unlc	TTZAA						
2185904	3575052		Arima	1	1				
5701662	3575052	link	https://en.wikipedia.org/wiki/Arima						
7352736	3575052	en	Borough of Arima						
9393320	3575052	fa	آریما						
9393321	3575052	ka	არიმა						
9393322	3575052	ko	아리마						
11522359	3575052	ar	آريما						
11522360	3575052	ur	آریما						
11760554	3575052	fr	Arima						
1454676	3575053		Argyll River						
4307685	3575053		Argyle River						
16949130	3575053		Argyle						
16949131	3575054		Arena River						
16949132	3575054		Arena						
16949133	3575055		Arena River						
16949134	3575055		Arena						
1454677	3575056		Arana River						
7771965	3575056		Arena River						
16949135	3575056		Arena						
16949136	3575057		Arena River						
16949137	3575057		Arena						
1454678	3575058		Arena Forest Reserve						
4307686	3575058		Arena Reserve						
1454679	3575059		Arenal Point						
7771966	3575059		Punta del Arenal						
15465922	3575063	wkdt	Q34798802						
15958989	3575063		Anglais Point						
15555385	3575064	wkdt	Q34798672						
15958990	3575064		André Point						
16949138	3575065		Ananas River						
16949139	3575065		Ananas						
1454682	3575066		Anana						
7771967	3575066		Morne Ananas						
16949140	3575067		Ambard River						
16949141	3575067		Ambard						
1454683	3575068		Alley’s Creek						
7771968	3575068		Allys Creek						
16949142	3575068		Allys						
15395981	3575069	wkdt	Q34797695						
15958991	3575069		Alice Point						
15689805	3575070	wkdt	Q34797644						
15958992	3575070		Alcatras Point						
16949143	3575074		Acono River						
16949144	3575074		Acono						
15668854	3575075	wkdt	Q34796465						
15958993	3575075		Abercromby Point						
1474275	3630695		Golfo Triste						
1474276	3630695		Golfo de Paria						
4402666	3630695		Gulf of Paria						
5760982	3630695	link	https://en.wikipedia.org/wiki/Gulf_of_Paria						
1887606	6300909	icao	TTPP						
1890048	6300909	iata	POS						
3032735	6300909	link	https://en.wikipedia.org/wiki/Piarco_International_Airport						
5892560	6300909	en	Piarco International Airport, Trinidad						
5892561	6300909	en	Piarco International Airport	1					
8513236	6300909	fr	Aéroport international de Piarco						
15601096	6300909	wkdt	Q788810						
8234891	7521937	link	https://en.wikipedia.org/wiki/Chaguanas_Borough_Corporation						
11760555	7521937	fr	Chaguanas						
5424496	7521938	link	https://en.wikipedia.org/wiki/Couva-Tabaquite-Talparo_Regional_Corporation						
11760556	7521938	fr	Couva-Tabaquite-Talparo						
5424490	7521939	link	https://en.wikipedia.org/wiki/Diego_Martin_Regional_Corporation						
11760557	7521939	fr	Diego Martin						
8234892	7521940	link	https://en.wikipedia.org/wiki/Eastern_Tobago						
5424488	7521941	link	https://en.wikipedia.org/wiki/Penal-Debe_Regional_Corporation						
11760558	7521941	fr	Penal-Debe						
5424489	7521942	link	https://en.wikipedia.org/wiki/Princes_Town_Regional_Corporation						
11760559	7521942	fr	Princes Town						
8234893	7521943	link	https://en.wikipedia.org/wiki/Point_Fortin_Borough_Corporation						
11760552	7521943	fr	Point Fortin						
5424493	7521944	link	https://en.wikipedia.org/wiki/Sangre_Grande_Regional_Corporation						
11760561	7521944	fr	Sangre Grande						
5424494	7521945	link	https://en.wikipedia.org/wiki/Siparia_Regional_Corporation						
11760562	7521945	fr	Siparia						
5424491	7521946	link	https://en.wikipedia.org/wiki/San_Juan-Laventille_Regional_Corporation						
11760563	7521946	fr	San Juan-Laventille						
5424495	7521947	link	https://en.wikipedia.org/wiki/Tunapuna-Piarco_Regional_Corporation						
11760564	7521947	fr	Tunapuna-Piarco						
7442575	8231890	en	James Park						
7442576	8231891	en	Scarborough Botanic Gardens						
7442577	8231892	en	St. Joseph’s Convent						
16766363	8231892	en	Saint Joseph’s Convent						
7442578	8231893	en	General Hospital						
7442579	8231893		Scarborough General Hospital						
7442580	8231893		Tobago County Hospital						
7442581	8231894	en	Tobago House of Assembly						
7442582	8231895	en	Hall of Justice						
7442583	8231896	en	Fairfield Complex						
7442584	8231897	en	Port Authority						
7442617	8231911	en	Customs and Excise						
7442704	8231956	en	Trinidad and Tobago Electricity Commission						
7442705	8231958	en	Ministry of Agriculture Land and Marine Resources						
7442774	8231993	en	Ministry of Works						
7442775	8231994	en	Ministry of Finance						
7442776	8231995	en	Central Administrative Services Tobago						
7442777	8231996	en	Tobago Institute of Education						
7442780	8232002	en	Shaw Park						
7444660	8233028	en	Crown Point Light						
7444661	8233029	en	Lodge Point						
7444668	8233033	en	Fort King George Light Tower						
7444698	8233048	en	Seaview Guest House						
7444699	8233049	en	Della Mira Guest House						
7444700	8233050	en	Mills Guest House						
7444701	8233051	en	Jacob’s Guest House						
7444702	8233052	en	Federal Villa						
7444703	8233053	en	Republic Bank						
7444704	8233054	en	Scarborough Health Centre						
7444705	8233055	en	Hope Cottage						
7444706	8233056	en	Public Services Association Guest House						
7448762	8235253		Half Moon Blue Hotel						
7448763	8235253		Old Donkey Cart House						
10642699	8709948		King George V Park				1		
16162386	8709960	link	https://en.wikipedia.org/wiki/Emperor_Valley_Zoo						
16222396	8709960		Emperor Valley Zoo						
16222397	8710002		Guaracara Park						
16177816	8710032	link	https://en.wikipedia.org/wiki/Devil%27s_Woodyard						
16222398	8710032		Devil’s Woodyard						
16471625	8985965	en	Chacachacare Island Light						
16150129	10174847	link	https://en.wikipedia.org/wiki/Queen%27s_Park_Oval						
12215822	11433864		Pointe-a-Pierre						
12215823	11433864	en	Pointe A Pierre						
16710660	11433864	unlc	TTPTP						
13635182	11468245	link	https://en.wikipedia.org/wiki/Trincity						
13801129	11468245	unlc	TTTCY						
13157536	11525718	en	Scarborough						
13157537	11525719	en	Chaguaramas						
13157538	11525720	en	Brighton						
16710656	11525720	unlc	TTBSH						
13157539	11525721	en	Point Fortin						
16710658	11525721	unlc	TTPTF						
13157540	11525722	en	Anse Tembladora						
16710662	11525722	unlc	TTTEM						
13157541	11525723	en	Galeota Point Terminal						
16710659	11525723	unlc	TTPTG						
13157542	11525724	en	Port Of Spain						
16710657	11525724	unlc	TTPOS						
16199776	11608906	link	https://en.wikipedia.org/wiki/Hasely_Crawford_Stadium						
