518204	933907		Ile de Sable						
518205	933907		Tromelin						
518206	933907		Tromelin Island						
518207	933907		Sandy Island						
1907896	933907	en	Tromelin Island						
1907897	933907	fr	Île Tromelin						
1907898	933907	es	Isla Tromelin						
1907899	933907	de	Tromelin						
1907900	933907	ca	Illa de Tromelin						
1907901	933907	cs	Tromelin						
1907902	933907	et	Tromelin						
1907903	933907	it	Tromelin						
1907904	933907	ja	トロメリン島						
1907905	933907	nl	Tromelin						
1907906	933907	pt	Tromelin						
1907907	933907	sk	Tromelin						
1994725	933907	eo	Tromelino						
1994726	933907	ro	Insula Tromelin						
2929501	933907	link	https://en.wikipedia.org/wiki/Tromelin_Island						
3049999	933907	link	https://ru.wikipedia.org/wiki/%D0%A2%D1%80%D0%BE%D0%BC%D0%BB%D0%B5%D0%BD_%28%D0%BE%D1%81%D1%82%D1%80%D0%BE%D0%B2%29						
7752603	933907	no	Tromelinøya						
518208	933908	fr	Île Tromelin						
1641858	933909	en	Europa Island						
1641859	933909	pl	Europa						
1641860	933909	es	Isla Europa						
1641861	933909	de	Europainsel						
1641862	933909	eo	Eŭropinsulo						
1641863	933909	fr	Île Europa						
1641864	933909	it	Europa						
1641865	933909	ja	ユローパ島						
1641866	933909	nl	Europa-eiland						
1641867	933909	no	Europaøya						
1641868	933909	pt	Ilha Europa						
1641869	933909	tr	Europe Adası						
1641870	933909	uk	Європа						
1786398	933909	cs	Ostrov Europa						
1903598	933909	ast	Europa						
1903599	933909	hr	Europa						
1903600	933909	ru	Европа						
1989693	933909	ro	Insula Europa						
1989694	933909	sk	Europa						
1989695	933909	sv	Europa						
2929502	933909	link	https://en.wikipedia.org/wiki/Europa_Island						
3050000	933909	link	https://ru.wikipedia.org/wiki/%D0%95%D0%B2%D1%80%D0%BE%D0%BF%D0%B0_%28%D0%BE%D1%81%D1%82%D1%80%D0%BE%D0%B2%29						
518211	933910	fr	Île Europa						
519331	936201		Baxos da India						
519332	936201		Baixo da Judia						
519333	936201		Récifs Bassas da India						
519334	936201		Europa Rocks						
519335	936201		Basse de Judie						
519336	936201		Bassas-de- India						
13523709	936201	link	https://en.wikipedia.org/wiki/Bassas_da_India						
1992814	936202	en	Bassas da India						
1992815	936202	de	Bassas da India						
1992816	936202	pl	Bassas da India						
1992817	936202	es	Bassas da India						
1992818	936202	fr	Bassas da India						
1992819	936202	cs	Bassas da India						
1992820	936202	eo	Bassas da India						
1992821	936202	hr	Bassas da India						
1992822	936202	it	Bassas da India						
1992823	936202	ja	バサス・ダ・インディア						
1992824	936202	nl	Bassas da India						
1992825	936202	no	Bassas da India						
1992826	936202	pt	Bassas da Índia						
1992827	936202	ro	Bassas da India						
1992828	936202	sk	Bassas da India						
1992829	936202	sv	Bassas da India						
519337	936203		Dark Head						
519338	936203		North Cape						
519339	936203		Cape Vertical						
4315709	936203		Cap Vertical						
15649779	936203	wkdt	Q34829034						
519340	936204		Cape Verdoyant						
4315712	936204		Cap Verdoyant						
15489919	936204	wkdt	Q34829007						
15582894	936207	wkdt	Q31602525						
15959815	936207		Mont des Têtes Grises						
519341	936212		Chenal du Sud						
4315743	936212		Canal du Sud						
519342	936213		Le Styx						
4315745	936213		Styx						
15460565	936214	wkdt	Q35423675						
15959822	936214		Val des Sternes						
519343	936216		Dark Head						
4315750	936216		Pointe Sombre						
519344	936218		Cap Seince						
4315757	936218		Pointe Seince						
519345	936219		Red Crag						
4315772	936219		Morne Rouge						
16179243	936219	link	https://en.wikipedia.org/wiki/Morne_Rouge						
519346	936223		Cap du Gallieni						
4315788	936223		Cap de la Reconnaissance						
15567646	936223	wkdt	Q34827400						
519347	936225		Île de la Prise de Possession						
519348	936225		Possession Island						
519349	936225		Île du Roi Charles						
519350	936225		Île Possession						
519351	936225		Prise de Possession Island						
4315799	936225		Île de la Possession						
8101769	936225	link	https://en.wikipedia.org/wiki/%C3%8Ele_de_la_Possession						
519352	936227		Îles des Pingouins						
519353	936227		Île Inaccessible						
519354	936227		Isle of Pingouins						
519355	936227		Île Française						
519356	936227		Penguin Island						
4315804	936227		Île des Pingouins						
7499974	936227	link	https://en.wikipedia.org/wiki/%C3%8Ele_des_Pingouins						
15264754	936228	wkdt	Q35423637						
15959868	936228		Val des Pierriers						
519357	936232		Windy Bay						
4315815	936232		Baie du Petit Caporal						
519358	936234		Roche Percée						
4315818	936234		Rocher Percé						
519359	936235		Roche Penchée						
4315819	936235		Rocher Percé						
519360	936236		Baie du Mâle						
519361	936236		Bull Bay						
519362	936236		Baie de l'Abondance						
4315829	936236		Baie du Pacha						
519363	936238		Monts des Nuées						
4315842	936238		Arête des Nuées						
15398395	936238	wkdt	Q31602553						
15163558	936239	wkdt	Q31602567						
15959880	936239		Crête du Nouvel An						
15323419	936242	wkdt	Q34828497						
15959881	936242		Cap Nord						
519364	936243		Chenal du Nord						
4315851	936243		Canal du Nord						
519365	936244		Baie du Noël						
4315854	936244		Crique de Noël						
15734001	936245	wkdt	Q34828516						
15959886	936245		Cap Négligé						
519366	936246		Ship Cove						
519367	936246		Baie du Navire						
4315856	936246		Crique du Navire						
15328572	936247	wkdt	Q35433883						
15959888	936247		Vallée du Naufrage						
519368	936252		Moines Point						
4315869	936252		Pointe des Moines						
519369	936253		Rivière Marinette						
4315871	936253		Rivière Moby Dick						
15251450	936258	wkdt	Q34827369						
15959895	936258		Cap de la Meurthe						
519370	936259		Cap Max Douguet						
519371	936259		Max Douguet Point						
4315876	936259		Pointe Max Douguet						
15305348	936261	wkdt	Q34827838						
15959903	936261		Cap du Marquis de Castries						
519372	936263		Pic Marion						
4315883	936263		Mont Marion-Dufresne						
519373	936264		Campinchi Bay						
4315884	936264		Baie du Marin						
519374	936266		Malpassée Rivière						
4315890	936266		Malpassée						
519375	936273		Mont Lesquin						
4315915	936273		Pic Lesquin						
519376	936276		Cinq Géants						
4315918	936276		Les Cinq Géants						
519377	936277		Rocheren Bec d'Aigle						
4315919	936277		Les Aiguilles						
15687311	936277	wkdt	Q31602633						
15482730	936278	wkdt	Q31602647						
15959926	936278		Le Pignon Rouge						
519378	936281		Le Haut Roc						
4315924	936281		Le Grand Roc						
15331238	936291	wkdt	Q31602674						
15959945	936291		La Tour Blanche						
15575691	936292	wkdt	Q31602689						
15959946	936292		La Tour						
15774503	936295	wkdt	Q31454551						
15959948	936295		La Selle Mexicaine						
15349251	936296	wkdt	Q31454552						
15959949	936296		La Selle Anglaise						
519379	936298		Pyramid Rock						
519380	936298		Rocher Pyramidal						
4315944	936298		La Pyramide						
15869708	936309	wkdt	Q31602702						
15959956	936309		La Citadelle						
15156625	936313	wkdt	Q31602729						
15959959	936313		La Bonne Mère						
15444839	936315	wkdt	Q31602743						
15959961	936315		Monts Jules Verne						
519381	936318		Brisant du Comus						
519382	936318		Rochers de la Meurthe						
519383	936318		Brisant de la Meurthe						
519384	936318		Brisants du Comus						
519385	936318		Brisants de la Meurthe						
519386	936318		Comus Breakers						
519387	936318		Heroine Breakers						
4315993	936318		Brisants de l'Héroïne						
15290134	936323	wkdt	Q34828030						
15959978	936323		Cap Goodridge						
519388	936325		Pointe Sud-Est						
519389	936325		Southeast Point						
4316026	936325		Cap du Gauss						
15582562	936325	wkdt	Q34827813						
15504502	936326	wkdt	Q34827801						
15959984	936326		Cap du Gallieni						
15203172	936329	wkdt	Q31602757						
15959995	936329		Pic Fanning						
519390	936330		Aride Island						
519391	936330		Île Aride						
519392	936330		Ile Orientale						
519393	936330		East Island						
519394	936330		Île Chabrol						
4316047	936330		Île de l'Est						
6889345	936330	link	https://en.wikipedia.org/wiki/%C3%8Ele_de_l%27Est						
15425643	936331	wkdt	Q31602770						
15960001	936331		Monts Duclesmeur						
15567141	936334	wkdt	Q31602784						
15960005	936334		Arête des Djinns						
519395	936336		Cape Deception						
4316070	936336		Cap de la Déception						
15600673	936336	wkdt	Q34827289						
519396	936338		Crozet Islands						
519397	936338		Archipel des Crozet						
4316077	936338		Îles Crozet						
3059067	936339		Crozet	1	1				
8234881	936339	link	https://en.wikipedia.org/wiki/%C3%8Eles_Crozet						
8356369	936339	fr	Archipel Crozet						
15475796	936341	wkdt	Q31454557						
15960015	936341		Cratère en Coeur						
519398	936342		Hog Island						
519399	936342		Îles des Porcs						
519400	936342		L'île aux Cochons						
519401	936342		Île Dauphine						
519402	936342		Ile des Porcs						
519403	936342		Groupe de l'Ouest						
4316091	936342		Île aux Cochons						
8092617	936342	link	https://en.wikipedia.org/wiki/%C3%8Ele_aux_Cochons						
15514166	936343	wkdt	Q34826782						
15960024	936343		Cap Chivaud						
519404	936344		Lively Bay						
4316112	936344		Crique de la Chaloupe						
15527253	936347	wkdt	Q35433461						
15960037	936347		Vallée de la Cascade						
519405	936351		Point de la Capuche						
4316121	936351		Pointe du Capuchon						
15868073	936353	wkdt	Q35433706						
15960044	936353		Vallée des Branloires						
519406	936360		Baie du Naufragé						
519407	936360		Baie de l'Aventure						
4316172	936360		Anse de l'Aventure						
15597995	936361	wkdt	Q31602842						
15960054	936361		Monts Arides						
519408	936362		Arch Rock						
4316184	936362		Rocher de l'Arche						
519409	936364		Douze Apôtres						
519410	936364		Apostles Islands						
519411	936364		Les Apôtres						
519412	936364		Les Sauvages						
519413	936364		Îles des Apôtres						
519414	936364		The Apostles						
519415	936364		Apostles Island						
2929574	936364	link	https://en.wikipedia.org/wiki/%C3%8Elots_des_Ap%C3%B4tres						
4316187	936364		Îlots des Apôtres						
519416	936366		Cape Antares						
4316189	936366		Cap de l'Antarès						
519417	936367		Baie de l'America						
519418	936367		America Bay						
519419	936367		American Bay						
4316195	936367		Baie Américaine						
7149441	936370	link	https://en.wikipedia.org/wiki/Alfred_Faure						
7323649	936370		Base Alfred Faure						
7756455	936370	no	Alfred Faure						
13286772	936370		Port Alfred						
15256141	936370	wkdt	Q940837						
534171	1024028	fr	Saint Christophe						
534172	1024028	en	Juan de Nova Island						
1995598	1024028	pl	Juan de Nova						
1995599	1024028	fr	Juan de Nova						
1995600	1024028	es	Juan de Nova						
1995601	1024028	de	Juan de Nova						
1995602	1024028	cs	Juan da Nova						
1995603	1024028	gl	Juan de Nova						
1995604	1024028	it	Juan de Nova						
1995605	1024028	nl	Juan de Nova						
1995606	1024028	pt	Juan de Nova						
1995607	1024028	ro	Juan de Nova						
1995608	1024028	ru	Жуан ди Нова						
1995609	1024028	sk	Juan de Nova						
2930011	1024028	link	https://en.wikipedia.org/wiki/Juan_de_Nova_Island						
3050023	1024028	link	https://ru.wikipedia.org/wiki/%D0%96%D1%83%D0%B0%D0%BD_%D0%B4%D0%B8_%D0%9D%D0%BE%D0%B2%D0%B0						
6910456	1024028	fr	Île Juan de Nova						
15457648	1024028	wkdt	Q237034						
534173	1024029	fr	Île Juan de Nova						
534176	1024032		Glorieuse						
4334611	1024032		Île Glorieuse						
15576339	1024032	wkdt	Q34805247						
534177	1024033	en	Glorioso Islands						
534178	1024033	en	Glorieuses Islands						
1909635	1024033	fr	Îles Glorieuses						
1909636	1024033	es	Islas Gloriosas						
1909637	1024033	de	Îles Glorieuses						
1909638	1024033	cs	Glorieuses						
1909639	1024033	hr	Otočje Glorieuses						
1909640	1024033	ja	グロリオソ諸島						
1909641	1024033	nl	Glorieuzen						
1909642	1024033	no	Glorieusesøyene						
1909643	1024033	pt	Ilhas Gloriosas						
1909644	1024033	sk	Glorieuses						
1995595	1024033	ro	Insulele Glorioase						
1995596	1024033	sv	Glorieuses						
2930012	1024033	link	https://en.wikipedia.org/wiki/Glorioso_Islands						
3050024	1024033	link	https://ru.wikipedia.org/wiki/%D0%93%D0%BB%D0%BE%D1%80%D1%8C%D1%91%D0%B7						
534179	1024034		Le Lys						
534180	1024034		Ile du Lise						
4334612	1024034		Île du Lys						
6889685	1024034	link	https://en.wikipedia.org/wiki/%C3%8Ele_du_Lys						
534181	1024035		Le rocher Sud						
4334613	1024035		Rocher Sud						
534182	1024036		Verte Rocks						
4334614	1024036		Roches Vertes						
534183	1024037	fr	Îles Glorieuses						
15641165	1545813	wkdt	Q34829075						
15959800	1545813		Cap Yule						
754722	1545816		Baie Young Williams						
754723	1545816		Young Williams Bay						
754724	1545816		Baie du Young Villiams						
4315699	1545816		Baie du Young William						
754725	1545817		Yacht Club Bay						
754726	1545817		Rosa Hafen						
4315700	1545817		Baie du Yacht-Club						
754727	1545818		Mont Wywille Thomson						
754728	1545818		Mount Wyville Thomson						
4315701	1545818		Mont Wyville Thomson						
15451658	1545818	wkdt	Q31602870						
754729	1545819		Wood Rocks						
4315702	1545819		Roches Wood						
15483144	1545820	wkdt	Q31602884						
15959801	1545820		Mont Wild						
754730	1545824		Côte des Weazels						
4315703	1545824		Côte des Weasels						
754731	1545825		Anse du Vulcain						
754732	1545825		Vulvain Cove						
754733	1545825		Vulvan Cove						
754734	1545825		Vulcans Cove						
4315704	1545825		Anse du Vulcan						
15206704	1545830	wkdt	Q31602926						
15959802	1545830		Mont de Volz						
754735	1545832		Baie du Volage						
754736	1545832		Volage Bay						
4315705	1545832		Anse du Volage						
754737	1545833		Vlaming Head						
4315706	1545833		Pointe Vlaming						
754738	1545836		Île G. Larrazet						
4315707	1545836		Île Violette						
754739	1545839		Baie Victoria						
4315708	1545839		Bassin Victoria						
13935048	1545840	fr	Montagnes Vertes						
754740	1545842		Green Island						
754741	1545842		Grüne Insel						
4315710	1545842		Île Verte						
15524880	1545842	wkdt	Q34793548						
754742	1545843		Green Mount						
4315711	1545843		Morne Vert						
15366754	1545846	wkdt	Q31739833						
15959803	1545846		Tables de Vergennes						
754743	1545848		Treppe						
4315713	1545848		Mont de Vénus						
15700172	1545849	wkdt	Q31454560						
15959804	1545849		Cratères Vénus						
15400118	1545850	wkdt	Q31602977						
15959805	1545850		Mont Ventoux						
15522194	1545851	wkdt	Q35408074						
15959806	1545851		Trouée du Vent						
15224511	1545852	wkdt	Q35703261						
15959807	1545852		Plateau du Vent						
15593770	1545854	wkdt	Q34794120						
15959808	1545854		Îlot Vedette						
754744	1545855		Robben Inseln						
754745	1545855		Île Seal						
754746	1545855		Seal Islands						
4315714	1545855		Île du Veau Marin						
15440960	1545855	wkdt	Q34791602						
754747	1545856		Rivett Arm						
4315715	1545856		Bras Vanhöffen						
754748	1545858		Glacier Belot						
754749	1545858		Zeye-Gletscher						
4315716	1545858		Glacier Vallot						
15331305	1545860	wkdt	Q31602991						
15959809	1545860		Mont de la Valdivia						
15479045	1545861	wkdt	Q31603005						
15959810	1545861		Mont Uranie						
754750	1545863		Plateau du Tussok						
4315717	1545863		Plateau du Tussock						
754751	1545865		Détroit Tucker						
754752	1545865		Tucker Strait						
4315718	1545865		Détroit de Tucker						
754753	1545866		Deuxième Lac						
754754	1545866		Zème Lac						
4315719	1545866		Lac des Truites						
754755	1545867		Cap de la Brume						
4315720	1545867		Pointe Tromelin						
15529554	1545868	wkdt	Q35423688						
15959811	1545868		Val des Trolls						
13935049	1545869	fr	Rivière des Trois Lacs						
754756	1545873		Looms Bay						
754757	1545873		Baie du Loon						
4315721	1545873		Passe des Trois Canots						
754758	1545876		Les Trois Rochers						
4315722	1545876		Rochers Trémarec						
15669393	1545878	wkdt	Q35424274						
15959812	1545878		Val Travers						
754759	1545879		Hüttenberg						
4315723	1545879		Mont Trapèze						
15432399	1545882	wkdt	Q31603048						
15959813	1545882		Mont de la Tourmente						
7529832	1545883	link	https://en.wikipedia.org/wiki/Plateau_des_Tourbi%C3%A8res						
7566405	1545883		Plateau des Tourbières						
13935050	1545884	fr	Col des Tourbières						
754760	1545888		Thunder Bay						
754761	1545888		Port du Tonnerre						
754762	1545888		Thunder Harbour						
4315724	1545888		Baie du Tonnerre						
754763	1545889		Dach-Berg						
4315725	1545889		Mont du Toit						
15207803	1545889	wkdt	Q31347267						
754764	1545890		Mount Tizard						
4315726	1545890		Mont Tizard						
15313115	1545890	wkdt	Q31347275						
754765	1545891		La Tirelire						
4315727	1545891		Mont de la Tirelire						
15533410	1545891	wkdt	Q31603076						
15765274	1545897	wkdt	Q35433959						
15959814	1545897		Vallée du Thermomètre						
754766	1545898		Mont du Théodolithe						
4315728	1545898		Mont du Théodolite						
754767	1545900		Récif Terror						
754768	1545900		Terror Reef						
4315729	1545900		Roches du Terror						
754769	1545901		Pointe Alphonse Rio						
754770	1545901		Cap Alphonse Rio						
4315730	1545901		Cap des Terres Rouges						
15451700	1545901	wkdt	Q34827696						
754771	1545905		Mont des Rafales						
4315731	1545905		Mont des Tempêtes						
15447639	1545905	wkdt	Q31603119						
15370766	1545906	wkdt	Q31603133						
15959816	1545906		Failaise des Tempêtes						
15179997	1545907	wkdt	Q35433945						
15959817	1545907		Vallée du Telluromètre						
754772	1545908		La Table du Telluromètre						
4315732	1545908		Table du Telluromètre						
754773	1545910		Piton Taine						
4315733	1545910		Piton Taisne						
15523180	1545911	wkdt	Q31603176						
15959818	1545911		Mont de la Table Haute						
754774	1545912		K18						
4315734	1545912		Table du Mont Lacroix						
754775	1545914		Table Bay						
4315735	1545914		Baie de la Table						
15394360	1545916	wkdt	Q34793272						
15959819	1545916		Île Swire						
754776	1545917		Baie des Cygnes						
754777	1545917		Swains Bay						
754778	1545917		Baie des Bergers						
4315736	1545917		Baie des Swains						
754779	1545918		Point Suzanne						
4315737	1545918		Pointe Suzanne						
754780	1545919		Baie Supply						
754781	1545919		Supply Bay						
4315738	1545919		Anse du Supply						
754782	1545920		Lac Studer						
4315739	1545920		Lac Supérieur						
15552540	1545921	wkdt	Q31454562						
15959820	1545921		Cratère Supérieur						
15783950	1545922	wkdt	Q34793266						
15959821	1545922		Île Sullivan						
754783	1545924		Îlot Suhm						
754784	1545924		Suhm Island						
4315740	1545924		Île Suhm						
15884056	1545924	wkdt	Q3593232						
754785	1545925		Prinz Heinrich Hafen						
754786	1545925		Baie Suffren						
754787	1545925		Prince Henry Anchorage						
4315741	1545925		Anse Suffren						
13935051	1545926	fr	Rivière du Sud						
754788	1545927		South Point						
4315742	1545927		Pointe Sud						
754789	1545928		Erfolg Harbor						
754790	1545928		Success Harbour						
754791	1545928		Port Cook						
4315744	1545928		Port du Success						
13935052	1545929	fr	Val Studer						
754792	1545931		Marie Insel						
4315746	1545931		Îlot Stoll						
15595922	1545931	wkdt	Q34794082						
13935053	1545933	fr	Lac des Sternes						
15439803	1545934	wkdt	Q34793245						
15959823	1545934		Île Stafford						
754793	1545935		Roche Spry						
754794	1545935		Spry Rock						
4315747	1545935		Roches Spry						
754795	1545936		Sprightly Harbor						
754796	1545936		Port de Sprightly						
4315748	1545936		Port du Sprightly						
754797	1545937		Mouse Island						
754798	1545937		Île Souris						
4315749	1545937		Îlots de la Souris						
15693018	1545940	wkdt	Q35433834						
15959824	1545940		Vallée des Souilles						
15446124	1545943	wkdt	Q35424198						
15959825	1545943		Val Sombre						
754799	1545946		Île Solitaire						
754800	1545946		Solitary Island						
4315751	1545946		Îlot Solitaire						
15249171	1545947	wkdt	Q34793240						
15959826	1545947		Île Soé						
15255304	1545950	wkdt	Q35423662						
15959827	1545950		Val des Skuas						
754801	1545951		Ravens Island						
754802	1545951		Île du Corbeau						
754803	1545951		Raven Island						
4315752	1545951		Île aux Skuas						
15698297	1545953	wkdt	Q35424185						
15959828	1545953		Val Sinistre						
15457402	1545957	wkdt	Q35423959						
15959829	1545957		Val du Silence						
15445217	1545958	wkdt	Q31603218						
15959830	1545958		Mont du Signal						
754804	1545960		Sibbald Island						
4315753	1545960		Île Sibbald						
754805	1545961		Îlot Scharbau						
4315754	1545961		Îlot Sharbau						
15618532	1545961	wkdt	Q34794077						
15626661	1545963	wkdt	Q35433920						
15959831	1545963		Vallée du Sextant						
754806	1545964		Récif Saint Lanne						
754807	1545964		Roche Saint-Lanne						
4315755	1545964		Roche Sersey						
15502887	1545966	wkdt	Q35703204						
15959832	1545966		Plateau des Sept Laux						
15683049	1545967	wkdt	Q35424248						
15959833	1545967		Val Sénestre						
754808	1545968		Saddle Hill						
4315756	1545968		Mont de la Selle						
15617610	1545968	wkdt	Q31603231						
754809	1545972		Scott Point						
4315758	1545972		Pointe Scott						
754810	1545973		Pointe Nord						
754811	1545973		Smith Point						
754812	1545973		Pointe Smith						
4315759	1545973		Pointe Schmith						
15550216	1545975	wkdt	Q34828837						
15959834	1545975		Cap Sauvigny						
15214544	1545976	wkdt	Q35703088						
15959835	1545976		Plateau de Sauveterre						
754813	1545979		3ème Lac						
754814	1545979		Troisième Lac						
4315760	1545979		Lac des Saumons						
754815	1545982		Cape Sandwich						
4315761	1545982		Cap Sandwich						
15526939	1545982	wkdt	Q34828798						
754816	1545984		Salamanca Rocks						
754817	1545984		Roches Salamanca						
4315762	1545984		Rochers du Salamanca						
15352926	1545989	wkdt	Q34794073						
15959836	1545989		Îlot Saint-Salvy						
754818	1545990		Saint Paul Island						
754819	1545990		Saint Paul						
1998308	1545990	de	Sankt-Paul-Insel						
1998309	1545990	fr	Saint-Paul						
1998310	1545990	en	Île Saint-Paul						
1998311	1545990	af	Sint-Pauleiland						
1998312	1545990	ja	サンポール島						
1998313	1545990	ja	アムステルダム島						
1998314	1545990	nl	Saint-Paul						
1998315	1545990	ro	Insula Sfântul-Paul						
1998316	1545990	ru	Сен-Поль						
1998317	1545990	sk	Ostrov svätého Pavla						
1998318	1545990	sv	Saint-Paul						
1998319	1545990	zh	圣保罗岛						
2935137	1545990	link	https://en.wikipedia.org/wiki/%C3%8Ele_Saint-Paul						
3050572	1545990	link	https://ru.wikipedia.org/wiki/%D0%A1%D0%B5%D0%BD-%D0%9F%D0%BE%D0%BB%D1%8C						
4315763	1545990		Île Saint-Paul						
9369188	1545990	es	Isla de San Pablo						
9369189	1545990	it	Isola Saint-Paul						
9369190	1545990	be	Востраў Сен-Поль						
9369191	1545990	br	Enez Sant-Paol						
9369192	1545990	ca	Illa de Sant Pau						
9369193	1545990	cs	Svatý Pavel						
9369194	1545990	el	Νήσος Αγίου Παύλου						
9369195	1545990	eo	Sankta-Paŭlo						
9369196	1545990	gl	Illa Saint-Paul						
9369197	1545990	hr	Otok Saint-Paul						
9369198	1545990	hu	Szent Pál-sziget						
9369199	1545990	ko	생폴 섬						
9369200	1545990	lij	Isoa de San Paolo						
9369201	1545990	lv	Sentpola						
9369202	1545990	oc	Illa de Sant Paul						
9369203	1545990	sr	Острво Свети Павле						
9369204	1545990	uk	Сен-Поль						
9369205	1545990	ur	جزیرہ سینٹ پال						
9369206	1545990	vi	Đảo Saint-Paul						
9369207	1545990	pl	Wyspa Świętego Pawła						
9369208	1545990	pt	São Paulo						
11380536	1545990	ar	جزيرة سان بول						
11380537	1545990	az	Sen-Pol adası						
11380538	1545990	ka	სენ-პოლი						
15250507	1545991	wkdt	Q31603257						
15959837	1545991		Mont Saint-Ours						
754820	1545992		Nord-Bucht						
4315764	1545992		Anse de Saint-Malo						
754821	1545993		Île Saint Lannes Gramont						
2935138	1545993	link	https://en.wikipedia.org/wiki/%C3%8Ele_Saint-Lanne_Gramont						
4315765	1545993		Île Saint-Lanne Gramont						
754822	1545994		Etang Saint-Hubert						
4315766	1545994		Étang de Saint-Hubert						
754823	1545997		Saint Alouarn Peak						
754824	1545997		Snowy Peak						
754825	1545997		Pic Saint-Alouarn						
754826	1545997		Smoking Mount						
4315767	1545997		Pic Saint-Allouarn						
15310174	1545997	wkdt	Q31603268						
754827	1545998		Shot Bag Bay						
4315768	1545998		Crique du Sac à Plomb						
754828	1546001		Sandy Cove						
4315769	1546001		Anse Sablonneuse						
13935054	1546002	fr	Étang de la Sablière						
15201042	1546003	wkdt	Q35433822						
15959838	1546003		Vallée des Sables						
754829	1546006		Royal Sound						
4315770	1546006		Passe Royale						
754830	1546007		Le Banc Roure						
754831	1546007		Roûre Ledge						
4315771	1546007		Banc Roûre						
15673859	1546008	wkdt	Q31603281						
15959839	1546008		Mont Rouge						
15781860	1546010	wkdt	Q34828703						
15959840	1546010		Cap Rouge						
754832	1546013		Snowy Peak						
754833	1546013		Pic Enneigé						
754834	1546013		Mont Fourchu						
754835	1546013		Forked Mount						
754836	1546013		Mount Ross						
2935139	1546013	link	https://en.wikipedia.org/wiki/Mont_Ross						
3050574	1546013	link	https://ru.wikipedia.org/wiki/%D0%9C%D0%BE%D0%BD%D1%82-%D0%A0%D0%BE%D1%81%D1%81						
4315773	1546013		Mont Ross						
754837	1546014		Cape Rosnevet						
4315774	1546014		Cap Rosnevet						
15469393	1546014	wkdt	Q34828677						
15746855	1546015	wkdt	Q34828656						
15959841	1546015		Cap Rosily						
754838	1546016		Rosa Harbor						
4315775	1546016		Port Rosa						
754839	1546018		Round Island						
754840	1546018		Îles Rondes						
754841	1546018		Ile Mingan						
754842	1546018		Ile Rondes						
4315776	1546018		Île Ronde						
15721545	1546018	wkdt	Q34793061						
13935055	1546019		Butte Ronde						
13935056	1546019	fr	Îlot Channer						
13935057	1546019	fr	Roche Channer						
13935058	1546019	fr	Île Channer						
754843	1546021		Wyville Thomson Peninsula						
754844	1546021		Presqu'île Amiral Ronarc'h						
754845	1546021		Presqu'ile Poincaré						
4315777	1546021		Ronarc'h Presqu'île						
7524917	1546021	link	https://en.wikipedia.org/wiki/Presqu%27%C3%AEle_Ronarc%27h						
754846	1546024		Île Roland						
754847	1546024		Roland Island						
4315778	1546024		Île du Roland						
15322032	1546025	wkdt	Q34827508						
15959842	1546025		Cap de Rohan						
754848	1546026		Rocky Bay						
4315779	1546026		Baie Rocheuse						
754849	1546027		Mont Rochegude						
4315780	1546027		Presqu'île Rochegude						
15584024	1546029	wkdt	Q31603293						
15959843	1546029		Mont Robert Bureau						
754850	1546030		Nord Hafen						
4315781	1546030		Anse Risler						
15506518	1546031	wkdt	Q34794062						
15959844	1546031		Îlot Rio						
15267892	1546033	wkdt	Q35434096						
15959845	1546033		Vallée Ring						
754851	1546035		Monts Richards						
754852	1546035		Mount Richards						
4315782	1546035		Mont Richards						
15307357	1546035	wkdt	Q31603306						
754853	1546039		Rhodes Bay						
754854	1546039		Baie Rhodes						
4315783	1546039		Baie de Rhodes						
15479602	1546040	wkdt	Q35423524						
15959846	1546040		Val de Rhèmes						
15772016	1546041	wkdt	Q35423946						
15959847	1546041		Val du Retour						
15603948	1546046	wkdt	Q31603319						
15959848	1546046		Mont du Renne						
754855	1546048		Sierra René Bossière						
4315784	1546048		Crête René Bossière						
15426112	1546048	wkdt	Q31603330						
754856	1546049		Point de Reconnaissance						
754857	1546049		Ile de Réunion						
754858	1546049		Bligh's Cap						
754859	1546049		Île l'Oiseau						
4315785	1546049		Îlot du Rendez-vous						
15493399	1546049	wkdt	Q34793843						
754860	1546053		Baie du Repulse						
754861	1546053		Repulse Bay						
4315786	1546053		Baie du Recul						
754862	1546054		Baie Cumberland						
754863	1546054		Cumberland Bay						
4315787	1546054		Baie de Recques						
754864	1546055		Recherche Point						
4315789	1546055		Pointe de la Recherche						
754865	1546057		Mont Raymond						
4315790	1546057		Mont Raymond Rallier du Baty						
15770364	1546057	wkdt	Q24930351						
15482542	1546058	wkdt	Q34793025						
15959849	1546058		Île Ravelo						
15308702	1546060	wkdt	Q35423650						
15959850	1546060		Val des Rapides						
754866	1546062		Bras Roux						
4315791	1546062		Bras Raoux						
754867	1546064		Péninsule de 1'Amiral						
754868	1546064		Presqu'île Rallier du Baty						
754869	1546064		Rallier du Baty						
4315792	1546064		Péninsule Rallier du Baty						
7554027	1546064	link	https://en.wikipedia.org/wiki/Rallier_du_Baty_Peninsula						
15465202	1546065	wkdt	Q35424111						
15959851	1546065		Val Raide						
754870	1546066		Mount des Rafales						
4315793	1546066		Mont des Rafales						
15523559	1546067	wkdt	Q35433908						
15959852	1546067		Vallée du Radioleine						
754871	1546068		Baie Radioleine						
4315794	1546068		Anse du Radioleine						
754872	1546069		Récif Rabre						
754873	1546069		Rabre Reef						
4315795	1546069		Roche Rabre						
15652740	1546070	wkdt	Q31603357						
15959853	1546070		Mont de la Rabouillère						
15376183	1546071	wkdt	Q31603363						
15959854	1546071		Mont Rabot						
754874	1546072		Baie de Quiberon						
4315796	1546072		Anse de Quiberon						
15611260	1546073	wkdt	Q34816942						
15959855	1546073		Mont des Quatre Points						
15254867	1546074	wkdt	Q31603374						
15959856	1546074		Eperon de la Quarantaine						
15538330	1546076	wkdt	Q31603400						
15959857	1546076		Pyramide Branca						
13935059	1546077		Étang des Pylônes						
13935060	1546077	fr	Étang des Dragons						
15651519	1546078	wkdt	Q34794057						
15959858	1546078		Îlot Py						
15411991	1546080	wkdt	Q34790145						
15959859	1546080		Île aux Prions						
754875	1546081		Pointe des Roches						
4315797	1546081		Pointe Pringle						
754876	1546083		Presqu'ile Prince de Galles						
754877	1546083		Prince of Wales Foreland						
4315798	1546083		Presqu'île du Prince de Galles						
15358501	1546086	wkdt	Q34792975						
15959860	1546086		Île Powell						
754878	1546092		Signal Port-Raymond						
4315800	1546092		Port-Raymond						
15504584	1546094	wkdt	Q31603413						
15959861	1546094		Mont du Portillon						
15459174	1546095	wkdt	Q31603426						
15959862	1546095		Mont Porthos						
754879	1546098		Seelhorst-Hafen						
4315801	1546098		Port-Couvreux						
2426660	1546102	ru	Порт-о-Франсэ						
2935140	1546102	link	https://en.wikipedia.org/wiki/Port-aux-Fran%C3%A7ais						
3050575	1546102	link	https://ru.wikipedia.org/wiki/%D0%9F%D0%BE%D1%80%D1%82-%D0%BE-%D0%A4%D1%80%D0%B0%D0%BD%D1%81%D1%8D						
9468187	1546102	ja	ポルトーフランセ						
9468188	1546102	lt	Port o Fransė						
9468189	1546102	lv	Portofransē						
9468190	1546102	os	Порт-о-Франсэ						
9468191	1546102	th	ปอโรฟร็องแซ						
9468192	1546102	uk	Порт-о-Франсе						
9468193	1546102	zh	法兰西港						
11462001	1546102	ru	Порт-о-Франсе						
13503064	1546102	en	Port-aux-Français						
13800145	1546102	unlc	TFPFR						
13857782	1546102	fr	Port-aux-Français						
13895950	1546102	ko	포르토프랑셰						
15249503	1546102	wkdt	Q839559						
754880	1546103		Harbour Island						
4315802	1546103		Île du Port						
8690685	1546103	link	https://en.wikipedia.org/wiki/%C3%8Ele_du_Port						
15159192	1546104	wkdt	Q34827886						
15959863	1546104		Cap du Ponant						
15687152	1546107	wkdt	Q34828590						
15959864	1546107		Cap Poincaré						
15453798	1546108	wkdt	Q35433896						
15959865	1546108		Vallée du Podomètre						
754881	1546109		Pointe du Demi-Tour						
4315803	1546109		Pointe Pléneau						
15689053	1546111	wkdt	Q35433524						
15959866	1546111		Vallée de la Planchette						
15529272	1546112	wkdt	Q35433512						
15959867	1546112		Vallée de la Plage Jaune						
754882	1546113		Penguin Cove						
754883	1546113		Anse Pingouin						
4315805	1546113		Anse des Pingouins						
754884	1546117		Mont du Cirque						
4315806	1546117		Mont Pierre Lejay						
15272886	1546117	wkdt	Q31603466						
754885	1546118		Curie Glacier						
4315807	1546118		Glacier Pierre Curie						
754886	1546121		La Chaussée du Phoque						
754887	1546121		Seal Ledge						
4315808	1546121		Chaussée du Phoque						
754888	1546122		Baie Teal						
754889	1546122		Baie du Phoque						
754890	1546122		Baie du Veau Marin						
754891	1546122		Seal Bay						
4315809	1546122		Anse du Phoque						
15812901	1546123	wkdt	Q35434083						
15959869	1546123		Vallée Phonolite						
754892	1546124		Roche Détacheé						
754893	1546124		Remarkable Boulder						
754894	1546124		Rocher Détaché Remarquable						
4315810	1546124		Roche Phonolite						
754895	1546125		Port Phonolithe						
4315811	1546125		Port Phonolite						
754896	1546126		Baie Philippe						
4315812	1546126		Baie Phillips						
754897	1546129		Elizabeth Head						
754898	1546129		Cap Elisabeth						
4315813	1546129		Cap Phérivong						
15409053	1546129	wkdt	Q34828565						
15461393	1546130	wkdt	Q31603493						
15959870	1546130		Falaise des Pétrels Noirs						
754899	1546132		Petit Etang de Saint Hubert						
4315814	1546132		Étang du Petit Saint-Hubert						
15439354	1546133	wkdt	Q31603506						
15959871	1546133		Petit Ross						
754900	1546134		Roche Perey						
754901	1546134		Roche Percy						
754902	1546134		Percy Rock						
4315816	1546134		Roche Perry						
754903	1546139		Le Val Perché						
4315817	1546139		Val Perché						
15852736	1546139	wkdt	Q35424085						
754904	1546141		Îlot Penn						
754905	1546141		Penn Island						
4315820	1546141		Île Penn						
754906	1546142		Penmare Point						
754907	1546142		Pointe Penmarch						
4315821	1546142		Pointe de Penmarc'h						
754908	1546143		Baie de Douarmenez						
754909	1546143		Rivière Penfeld						
754910	1546143		Penfeld						
4315822	1546143		Baie de Penfeld						
15827476	1546144	wkdt	Q3593165						
15959872	1546144		Île Pender						
15790865	1546145	wkdt	Q31603549						
15959873	1546145		Mont Pégoud						
754911	1546146		Mount Peeper						
4315823	1546146		Mont Peeper						
754912	1546147		Blue Skin Beach						
4315824	1546147		Plage du Peau-Bleue						
754913	1546148		Anse Peau Bleve						
4315825	1546148		Anse Peau-Bleue						
754914	1546149		Rochers de la Pearl						
4315826	1546149		Falaise de la Pearl						
15646434	1546149	wkdt	Q31603562						
15597432	1546152	wkdt	Q34827863						
15959874	1546152		Cap du Patanela						
754915	1546155		Ilots Pasquiou						
4315827	1546155		Roches Pasquiou						
15461481	1546159	wkdt	Q31603575						
15959875	1546159		Mont Pâris						
15690745	1546160	wkdt	Q34827460						
15959876	1546160		Cap de Paris						
13935061	1546161	fr	Anse des Papous						
754916	1546163		Mount Palliser						
4315828	1546163		Mont Palliser						
13935062	1546165	fr	Anse du Pacha						
754917	1546166		Anse de Lours						
4315830	1546166		Anse de l'Ours						
754918	1546169		West Point						
754919	1546169		West Kap						
4315831	1546169		Pointe Ouest						
754920	1546171		West Island						
754921	1546171		Île de l'Quest						
754922	1546171		Ouest Island						
754923	1546171		Saddle Island						
4315832	1546171		Île de l'Ouest						
11298109	1546171	link	https://en.wikipedia.org/wiki/%C3%8Ele_de_l%27Ouest						
13935063	1546173	fr	Rivière de l'Otarie						
754924	1546175		Weineck Bay						
4315833	1546175		Baie d'Orvilliers						
754925	1546176		Orography Point						
4315834	1546176		Pointe de l'Orographie						
754926	1546177		Pointe des Cormorans						
4315835	1546177		Pointe de l'Ornithologue						
15415436	1546178	wkdt	Q35423625						
15959877	1546178		Val des Orgues						
15616415	1546180	wkdt	Q35434047						
15959878	1546180		Vallée Olsen						
754927	1546181		Mont de la Table						
754928	1546181		Mont de la Table de l'Oiseau						
754929	1546181		Table Mount						
754930	1546181		Table Mountain						
4315836	1546181		La Table de l'Oiseau						
754931	1546182		Weihnachts-Hafen						
754932	1546182		Christmas Harbor						
754933	1546182		Port Christmas						
4315837	1546182		Baie de l'Oiseau						
754934	1546183		Pointe aux Oeufs						
754935	1546183		Egg Point						
4315838	1546183		Pointe de l'Oeuf						
754936	1546187		Observatory Bay						
754937	1546187		Beobachtungs-Bucht						
4315839	1546187		Baie de l'Observatoire						
754938	1546188		Oakeley Point						
4315840	1546188		Pointe Oakeley						
754939	1546189		Boat Harbour						
4315841	1546189		Crique Nunn						
15477343	1546190	wkdt	Q31603618						
15959879	1546190		Éperon des Nuées						
754940	1546191		Cloudy Islands						
4315843	1546191		Îles Nuageuses						
8074613	1546191	link	https://en.wikipedia.org/wiki/%C3%8Eles_Nuageuses						
754941	1546192		Anse S. Nozal						
4315844	1546192		Anse Nozal						
754942	1546193		Cap Novara						
754943	1546193		Pointe Novara						
754944	1546193		Novara Point						
4315845	1546193		Pointe de la Novara						
5900204	1546195	link	https://en.wikipedia.org/wiki/Notre-Dame_des_Vents						
5905338	1546195	br	Itron-Varia an Avelioù						
6128936	1546195		Notre-Dame des Vents						
754945	1546196		Baie des Cascades						
4315846	1546196		Anse du Notothénia						
754946	1546198		Baie Peu Profunde						
754947	1546198		Flachwasser Bucht						
754948	1546198		Shoal Water Bay						
4315847	1546198		Baie Norvégienne						
7033906	1546198	link	https://en.wikipedia.org/wiki/Baie_Norv%C3%A9gienne						
754949	1546199		Long Sound						
754950	1546199		Norton Sound						
4315848	1546199		Chenal Norton						
754951	1546200		Baie Française						
754952	1546200		Big Elephant Bay						
754953	1546200		Baie Françoise						
4315849	1546200		Baie du Noroît						
754954	1546203		North Islet						
754955	1546203		Ilot du Nord						
4315850	1546203		Îlot Nord						
15423180	1546203	wkdt	Q34794016						
15580136	1546204	wkdt	Q31603646						
15959882	1546204		Falaises Noires						
754956	1546205		Old Shoe Hole						
4315852	1546205		Plage Noire						
754957	1546206		Schwarze Insel						
754958	1546206		Black Island						
4315853	1546206		Île Noire						
15553446	1546206	wkdt	Q34792621						
15621332	1546211	wkdt	Q34792610						
15959883	1546211		Île Niñas						
754959	1546215		Cape Neumayer						
754960	1546215		Cape Charles						
4315855	1546215		Cap Neumayer						
15569980	1546215	wkdt	Q34828460						
15479137	1546216	wkdt	Q35433774						
15959884	1546216		Vallée des Neiges						
15628969	1546217	wkdt	Q31603675						
15959885	1546217		Piton des Neiges						
754961	1546219		Murray Island Anchorage						
4315857	1546219		Port Navalo						
15261981	1546220	wkdt	Q35424072						
15959887	1546220		Val Naumann						
754962	1546221		Glacier Scott						
4315858	1546221		Glacier Naumann						
754963	1546225		Îlot Murray						
754964	1546225		Murray Island						
4315859	1546225		Île Murray						
15763891	1546225	wkdt	Q34792456						
15413248	1546226	wkdt	Q31603690						
15959889	1546226		Mont Muraille						
754965	1546229		Yale Bluff						
754966	1546229		Mount des Moutons						
4315860	1546229		Mont des Moutons						
15736555	1546229	wkdt	Q31347343						
15654656	1546230	wkdt	Q35423612						
15959890	1546230		Val des Moustaches						
754967	1546232		Île Massel						
754968	1546232		Mussel Island						
4315861	1546232		Île aux Moules						
15445208	1546236	wkdt	Q35703195						
15959891	1546236		Plateau des Mouettes						
15901030	1546237	wkdt	Q35433486						
15959892	1546237		Vallée de la Mouche						
754969	1546238		Sprightly Bay						
4315862	1546238		Baie de la Mouche						
754970	1546239		Mount Mosely						
4315863	1546239		Mont Moseley						
14943469	1546239	wkdt	Q31347358						
754971	1546240		Cirque du Mont Moseley						
4315864	1546240		Cirque Moseley						
754972	1546241		Pointe Escarpée						
754973	1546241		Bluff Point						
754974	1546241		Pointe Morne						
4315865	1546241		Pointe du Morne						
754975	1546242		Baie du Morbihan						
754976	1546242		Baie Royale						
754977	1546242		Royal Sound						
754978	1546242		Gulf of Morbihan						
4315866	1546242		Golfe du Morbihan						
7173936	1546242	link	https://en.wikipedia.org/wiki/Golfe_du_Morbihan_%28Kerguelen%29						
13935064	1546243	fr	Rivière des Moraines						
754979	1546247		Islet Point						
754980	1546247		Pointe Îlot						
754981	1546247		Pointe de l'Ilof						
4315867	1546247		Pointe du Monolithe						
754982	1546250		Point Molloy						
4315868	1546250		Pointe Molloy						
754983	1546252		Îlot Bedja						
4315870	1546252		Îlot Moilimou Bedja						
15510369	1546252	wkdt	Q34794002						
754984	1546258		Roches du Milieu						
754985	1546258		Middle Rock						
754986	1546258		Middle Rocks						
754987	1546258		Mittel Felsen						
4315872	1546258		Rocher du Milieu						
754988	1546259		Middle Harbor						
754989	1546259		Zwischenhafen						
4315873	1546259		Port du Milieu						
15897229	1546260	wkdt	Q31603704						
15959893	1546260		Mont du Milieu						
15565813	1546262	wkdt	Q34793991						
15959894	1546262		Îlot Mierry						
13935065	1546265	fr	Ravin du Mica						
13935066	1546266	fr	Étang de la Météo						
15214811	1546267	wkdt	Q35433753						
15959896	1546267		Vallée des Merveilles						
15681256	1546268	wkdt	Q31603718						
15959897	1546268		Mont Mermoz						
754990	1546273		Roche Mingan						
754991	1546273		Mingan Rock						
4315874	1546273		Roche Mengam						
754992	1546274		Melissas Bay						
4315875	1546274		Baie du Mélissas						
15412901	1546275	wkdt	Q31603760						
15959898	1546275		Mont Melchior						
15203140	1546276	wkdt	Q35703288						
15959899	1546276		Plateau Méjean						
754993	1546281		Îles Max Christensen						
4315877	1546281		Îlots Max Christensen						
15271128	1546282	wkdt	Q31603775						
15959900	1546282		Monts Mawson						
754994	1546284		Pointe des Dunes						
4315878	1546284		Pointe Matley						
15264190	1546287	wkdt	Q34792299						
15959901	1546287		Île Massar						
8693917	1546288	link	https://en.wikipedia.org/wiki/Lac_Marville						
8802878	1546288		Lac Marville						
15268872	1546289	wkdt	Q31603789						
15959902	1546289		Mont de Martonne						
754995	1546290		La Roche Godon						
754996	1546290		Camp Heurtin						
4315879	1546290		Martin-de-Viviès						
754997	1546291		Maroon Island						
754998	1546291		Île Maroon						
4315880	1546291		Île Marron						
15266443	1546291	wkdt	Q34792294						
754999	1546292		Kaiser-Bassin						
755000	1546292		Bassin de l'Empereur						
4315881	1546292		Baie de la Marne						
755001	1546293		Mittel Hafen						
4315882	1546293		Marmite Port						
15452553	1546299	wkdt	Q31603803						
15959904	1546299		Mont Marion-Dufresne						
755002	1546300		Cape Marigny						
755003	1546300		Cap Poincaré						
4315885	1546300		Cap Marigny						
15478530	1546300	wkdt	Q34828373						
755004	1546301		Marien Hafen						
755005	1546301		Mary Harbor						
755006	1546301		Port Mary						
4315886	1546301		Port Marie						
755007	1546302		Marianne Strait						
4315887	1546302		Détroit de la Marianne						
13935067	1546303	fr	Lac Margot						
755008	1546304		Wolff Spitze						
4315888	1546304		Pointe Marcq						
15236491	1546305	wkdt	Q35392584						
15959905	1546305		Couloir Mangin						
755009	1546308		Pinguin Bay						
4315889	1546308		Baie des Manchots						
15549172	1546309	wkdt	Q34793976						
15959906	1546309		Îlot Malou						
13935068	1546311	fr	Étang du Magnétisme						
755010	1546312		Île Madec						
4315891	1546312		Îlot Madec						
15831836	1546312	wkdt	Q34793969						
755011	1546313		Anse des Durvillea						
4315892	1546313		Anse des Macrocystis						
755012	1546314		McMurdo Island						
4315893	1546314		Île MacMurdo						
15236302	1546314	wkdt	Q34792245						
15696390	1546315	wkdt	Q34828313						
15959907	1546315		Cap Mac Lear						
755013	1546316		Pic Mac Lean						
4315894	1546316		Mont Mac Lean						
15378517	1546316	wkdt	Q31603817						
755014	1546317		Table Top						
755015	1546317		Mount MacCormick						
4315895	1546317		Mont MacCormick						
755016	1546319		Mont du Château						
4315896	1546319		Mont Lyall						
15343407	1546319	wkdt	Q31347380						
15316559	1546321	wkdt	Q31603846						
15959908	1546321		Mont des Lunettes Noires						
755017	1546323		Lucky Point						
4315897	1546323		Pointe Lucky						
755018	1546327		Anse Mallet						
4315898	1546327		Anse Louison						
755019	1546329		Baie Saint-Louis						
755020	1546329		Port Saint Louis						
755021	1546329		Port Louison						
755022	1546329		Louise Harbor						
4315899	1546329		Port Louise						
755023	1546331		Cape Louis						
755024	1546331		Cap Saint Louis						
4315900	1546331		Cap Louis						
755025	1546333		Presqu'île Loranchet						
4315901	1546333		Péninsule Loranchet						
8100576	1546333	link	https://en.wikipedia.org/wiki/Loranchet_Peninsula						
15345808	1546335	wkdt	Q35423512						
15959909	1546335		Val de Longue Attente						
755026	1546336		Long Island						
4315902	1546336		Île Longue						
15808521	1546336	wkdt	Q34792185						
755027	1546337		London River						
4315903	1546337		Baie de Londres						
755028	1546338		Hourglass Island						
4315904	1546338		Îlot Lolette						
15683140	1546338	wkdt	Q34793958						
15447542	1546339	wkdt	Q34828285						
15959910	1546339		Cap Listenois						
755029	1546340		Bull Beach						
755030	1546340		Plage des Macrorhines						
4315905	1546340		Plage des Lions Marins						
755031	1546343		Moore Point						
755032	1546343		Cape Ligneville						
4315906	1546343		Cap Ligniville						
15439294	1546343	wkdt	Q34828273						
15668981	1546344	wkdt	Q31603860						
15959911	1546344		Mont du Lignite						
15243553	1546345	wkdt	Q31603874						
15959912	1546345		Mont Lieutard						
15212554	1546347	wkdt	Q31347395						
15959913	1546347		Mont des Lichens						
755033	1546348		Swain Islands						
755034	1546348		Iles Swain						
4315907	1546348		Îles Leygues						
8070766	1546348	link	https://en.wikipedia.org/wiki/%C3%8Eles_Leygues						
755035	1546349		Bassin de la Joliette						
755036	1546349		Süd-Bucht						
755037	1546349		La Joliette						
4315908	1546349		Le Vieux Port						
755038	1546352		Tysack Bay						
755039	1546352		Tyzack Bay						
4315909	1546352		Baie Le Verrier						
15606506	1546353	wkdt	Q35423932						
15959914	1546353		Val du Levant						
15429458	1546355	wkdt	Q31603902						
15959915	1546355		Mont Levallois						
755040	1546356		Trou du Ressac						
755041	1546356		Surfy Hole						
4315910	1546356		Le Trou du Ressac						
15505677	1546357	wkdt	Q31603915						
15959916	1546357		Le Trièdre						
755042	1546362		Trois Vallées						
4315911	1546362		Les Trois Vallées						
755043	1546363		Îlots Swains						
755044	1546363		Three Swains						
4315912	1546363		Les Trois Swains						
15775236	1546364	wkdt	Q31603930						
15959917	1546364		Les Trois Ménestrels						
755045	1546366		Les 3 Frères						
4315913	1546366		Les Trois Frères						
15230324	1546366	wkdt	Q31603944						
755046	1546371		The Beehives						
4315914	1546371		Les Ruches						
15627162	1546372	wkdt	Q31603985						
15959918	1546372		Les Rois Mages						
13935069	1546376	fr	Les Quatre Mares						
755047	1546377		Vier Hügel						
4315916	1546377		Les Quatre Collines						
755048	1546378		Cat's Ears						
755049	1546378		Oreilles de Chat						
755050	1546378		The Cat's Ears						
4315917	1546378		Les Oreilles du Chat						
13935070	1546383	fr	Les Mamelles						
15411684	1546391	wkdt	Q31604028						
15959919	1546391		Les Deux Frères						
15605489	1546392	wkdt	Q31604042						
15959920	1546392		Les Deux Cônes						
15214242	1546394	wkdt	Q31347439						
15959921	1546394		Les Dames Anglaises						
15630779	1546395	wkdt	Q31604055						
15959922	1546395		Les Créneaux						
15429075	1546398	wkdt	Q31347454						
15959923	1546398		Les Bessons						
15469954	1546401	wkdt	Q31604069						
15959924	1546401		Le Rhigi						
755051	1546402		Thumb Peak						
755052	1546402		Daumenspitze						
4315920	1546402		Le Pouce						
15238022	1546402	wkdt	Q31604082						
15166976	1546405	wkdt	Q31604109						
15959925	1546405		Le Podium						
15471634	1546407	wkdt	Q31604124						
15959927	1546407		Le Pignon						
15647625	1546408	wkdt	Q31347461						
15959928	1546408		Le Phare						
755053	1546410		Petit Mont Ballon						
4315921	1546410		Le Petit Ballon						
15560614	1546410	wkdt	Q31604136						
755054	1546414		Zuckerhut-Berg						
755055	1546414		The Sugar Loaf						
755056	1546414		Sugar Loaf						
755057	1546414		Pain de Sucre						
4315922	1546414		Le Pain de Sucre						
13935071	1546415	fr	Anse des Léopards						
755058	1546417		Mont Léon						
4315923	1546417		Mont Léon Lutaud						
15559404	1546417	wkdt	Q31604179						
15852291	1546418	wkdt	Q3593123						
15959929	1546418		Île Léon Lefèvre						
15273602	1546420	wkdt	Q31454566						
15959930	1546420		Le Museau de Tanche						
15600257	1546424	wkdt	Q31604207						
15959931	1546424		Le Lubéron						
755059	1546433		Grand Pierrier						
4315925	1546433		Le Grand Pierrier						
755060	1546436		Terre Basse						
4315926	1546436		Le Grand Couloir						
15611918	1546437	wkdt	Q34816695						
15959932	1546437		Le Grand Carré						
755061	1546438		Grand Mont Ballon						
4315927	1546438		Le Grand Ballon						
15692054	1546440	wkdt	Q31347500						
15959933	1546440		Le Grand Balcon						
755062	1546442		Kastell Insel						
4315928	1546442		Le Galiton						
15499360	1546443	wkdt	Q31454569						
15959934	1546443		Le Fourneau						
755063	1546444		Ziegenruck						
4315929	1546444		Le Dos de Chèvre						
15502924	1546445	wkdt	Q31604302						
15959935	1546445		Le Donjon						
755064	1546446		Red Dome						
755065	1546446		Süd-Dom						
4315930	1546446		Le Dôme Rouge						
755066	1546448		Sugar Loaf						
755067	1546448		Pain de Sucre						
755068	1546448		Doight de Sainte-Anne						
755069	1546448		Le Pain de Sucre						
4315931	1546448		Le Doigt de Sainte-Anne						
755070	1546449		Roche Rosbraz						
755071	1546449		Round Rock						
4315932	1546449		Le Diamant						
15633730	1546450	wkdt	Q31454570						
15959936	1546450		Le Cyclope						
755072	1546451		Colosseum						
4315933	1546451		Le Colosse						
15445222	1546451	wkdt	Q31604330						
755073	1546453		Pointe Le Clere						
755074	1546453		Paquita Point						
4315934	1546453		Pointe Le Clerc						
15483370	1546454	wkdt	Q31454571						
15959937	1546454		Le Chaudron						
755075	1546455		Ilot Matley						
755076	1546455		Matelot Island						
755077	1546455		Île Matley						
4315935	1546455		Le Château d'If						
15617419	1546457	wkdt	Q31604344						
15959938	1546457		Le Casque						
15571560	1546458	wkdt	Q31604358						
15959939	1546458		Le Capitole						
755078	1546459		Palissaden-Berg						
4315936	1546459		Le Camp de César						
15339699	1546460	wkdt	Q31454573						
15959940	1546460		Le Brûlot						
15442818	1546461	wkdt	Q31604385						
15959941	1546461		Le Bicorne						
15571702	1546462	wkdt	Q31604399						
15959942	1546462		Le Belvédère						
15252294	1546466	wkdt	Q31604427						
15959943	1546466		Crête des Laves						
755079	1546470		Look Out Point						
755080	1546470		Pointe Vigie						
4315937	1546470		Pointe Laure						
15472105	1546472	wkdt	Q31604441						
15959944	1546472		La Tour de Pise						
755081	1546474		Lathom Rocks						
4315938	1546474		Rochers Latham						
755082	1546476		Man's Head						
4315939	1546476		La Tête d'Homme						
15363481	1546477	wkdt	Q31604464						
15959947	1546477		La Terrine						
755083	1546478		Falaises des Manchots						
755084	1546478		Pinguin Terrasse						
4315940	1546478		La Terrasse des Pingouins						
8100764	1546484	link	https://en.wikipedia.org/wiki/Baie_Larose						
8108780	1546484		Baie Larose						
15460436	1546485	wkdt	Q35433573						
15959950	1546485		Vallée de Larmor						
15572901	1546488	wkdt	Q31347533						
15959951	1546488		La Rambarde						
15323027	1546489	wkdt	Q31604472						
15959952	1546489		La Rambarde						
755085	1546490		Ninepin Rock						
755086	1546490		Rocher Quille						
4315941	1546490		La Quille						
755087	1546491		Ninepin Rock						
755088	1546491		Nine-Pin Fels						
755089	1546491		Ninepin						
755090	1546491		Rocher de la Quille						
755091	1546491		Rocher Quille						
4315942	1546491		La Quille						
755092	1546493		Pyramide Mexicaine						
4315943	1546493		La Pyramide Mexicaine						
755093	1546501		Hintere Bucht						
4315945	1546501		Bras du Lapérouse						
15218308	1546503	wkdt	Q31604538						
15959953	1546503		Mont de Lans						
755094	1546504		Tongue Island						
4315946	1546504		Îlot Langue						
15540664	1546504	wkdt	Q34793952						
755095	1546506		Pointe De Langle						
4315947	1546506		Pointe de Langle						
15581712	1546508	wkdt	Q31347541						
15959954	1546508		La Muraille de Chine						
755096	1546510		Le Mont-Joie						
4315948	1546510		La Montjoie						
755097	1546512		Glacier Lamark						
4315949	1546512		Glacier Lamarck						
14939330	1546514	wkdt	Q31604564						
15959955	1546514		La Lapine						
755098	1546515		Bear-up Bay						
755099	1546515		Baie du Repos						
4315950	1546515		Baie Laissez Porter						
755100	1546520		Cratère Explosif						
4315951	1546520		La Grande Marmite						
15445472	1546520	wkdt	Q31454575						
13935072	1546524	fr	La Grande Cascade						
755101	1546535		Le Bastion						
4315952	1546535		La Citadelle						
15464448	1546535	wkdt	Q31347561						
755102	1546536		Chimney Top Mount						
755103	1546536		Schornstein Spitze						
755104	1546536		Sommet Cheminée						
4315953	1546536		La Cheminée						
15707035	1546536	wkdt	Q31604685						
15492186	1546537	wkdt	Q31604697						
15959957	1546537		La Cathédrale						
755105	1546542		Isthme des Lacs						
4315954	1546542		Isthme du Lac						
15509886	1546543	wkdt	Q34793945						
15959958	1546543		Îlot Laboureur						
15871050	1546545	wkdt	Q34793939						
15959960	1546545		Îlot Labernede						
755106	1546549		Hoffnungs-see						
4315955	1546549		Lac des Korrigans						
755107	1546551		Rallier du Baty						
755108	1546551		Port Rallier du Baty						
4315956	1546551		Port Kirk						
13935073	1546552	fr	Cap Kidder						
755109	1546554		Kap Wachenhausen						
755110	1546554		Cape Kersaint						
755111	1546554		Cape Wachenhusen						
4315957	1546554		Cap Kersaint						
15685894	1546554	wkdt	Q34828141						
755112	1546555		Îles Kernabat						
4315958	1546555		Îlots Kernabat						
755113	1546556		Kerguelen Islands						
4315959	1546556		Îles Kerguelen						
16736621	1546556	link	https://en.wikipedia.org/wiki/Kerguelen_Islands						
16736622	1546556		Desolation Islands						
755114	1546557		Kerguelen Island						
755115	1546557		La grande île de Kerguelen						
755116	1546557		Desolation Island						
755117	1546557		Kerguelen						
4315960	1546557		Île Kerguelen						
15627918	1546557	wkdt	Q34792024						
16171942	1546557	link	https://en.wikipedia.org/wiki/Desolation_Island						
3059068	1546558		Kerguelen	1	1				
8234882	1546558	link	https://en.wikipedia.org/wiki/Kerguelen_Islands						
755118	1546559		South Kent Island						
755119	1546559		Kent Island						
4315961	1546559		Île Kent Sud						
15665614	1546559	wkdt	Q34792012						
755120	1546560		Outer Kent Island						
755121	1546560		North Kent Island						
4315962	1546560		Île Kent Nord						
15683240	1546560	wkdt	Q34792006						
755122	1546561		Iles Kent						
755123	1546561		Brisants Kent						
755124	1546561		Kent Islands						
4315963	1546561		Îlots Kent						
755125	1546562		German Bay						
755126	1546562		Baie Allemande						
755127	1546562		Deutsche Bai						
4315964	1546562		Baie Keller						
755128	1546568		West-Bucht						
4315965	1546568		Bras Jules Laboureur						
755129	1546569		Port Girard						
4315966	1546569		Port Jules Girard						
15627039	1546570	wkdt	Q34791989						
15959962	1546570		Île Jules						
755130	1546580		Presqu'île Jeanne d'Arc						
755131	1546580		Bismarck Peninsula						
4315967	1546580		Presqu'île Joffre						
15622752	1546581	wkdt	Q31604724						
15959963	1546581		Arête Jérémine						
755132	1546582		Cap Noir						
4315968	1546582		Cap Jeannel						
15678545	1546582	wkdt	Q34828103						
755133	1546583		Crosbie-Gebirge						
755134	1546583		Presqu'île Joffre						
755135	1546583		Péninsule Joffre						
4315969	1546583		Presqu'île Jeanne d'Arc						
8089328	1546583	link	https://en.wikipedia.org/wiki/P%C3%A9ninsule_Jeanne_d%27Arc						
755136	1546585		Ile J. Bart						
4315970	1546585		Île Jean Bart						
15308272	1546585	wkdt	Q34791977						
755137	1546586		Chenal Baptiste Charcot						
755138	1546586		Chenal du J. B. Charcot						
4315971	1546586		Chenal du Jean-Baptiste Charcot						
755139	1546588		White Ash Bay						
4315972	1546588		Plage Jaune						
755140	1546591		Lac du Col						
4315973	1546591		Lac des Jaspes						
755141	1546592		The Garden						
4315974	1546592		Anse du Jardin						
15492948	1546593	wkdt	Q31604749						
15959964	1546593		Mont Jalu						
755142	1546595		Baie d'Angar						
4315975	1546595		Anse Jacques Bourcart						
13935074	1546596	fr	Jacotte						
755143	1546600		Irish Bay						
4315976	1546600		Baie Irlandaise						
13935075	1546602	fr	Étang Iono						
755144	1546603		Invisible Bay						
4315977	1546603		Baie Invisible						
755145	1546605		Îlot Inskip						
4315978	1546605		Île Inskip						
15459020	1546607	wkdt	Q31454578						
15959965	1546607		Cratère Inférieur						
755146	1546610		Port Borda						
4315979	1546610		Mouillage des Îles Borda						
755147	1546611		Drei-Insein-Hafen						
755148	1546611		Island Harbor						
755149	1546611		Three-Island-Harbour						
755150	1546611		Island Harbour						
4315980	1546611		Port des Îles						
755151	1546615		Haynes Islet						
755152	1546615		Îlot Haynes						
4315981	1546615		Îlot Hynes						
15618302	1546615	wkdt	Q34793901						
755153	1546616		Chenal de l'Hydrographie						
4315982	1546616		Passe de l'Hydrographie						
755154	1546617		Hutchinson Point						
755155	1546617		Hutchison Point						
755156	1546617		Pointe Est						
4315983	1546617		Pointe Hutchison						
755157	1546618		Husker Strait						
4315984	1546618		Passe Husker						
15459141	1546620	wkdt	Q34816718						
15959966	1546620		Les Hauts de Hurlevent						
755158	1546621		Hunter Sound						
755159	1546621		Chenal du Chasseur						
4315985	1546621		Chenal du Hunter						
755160	1546626		Howe Island						
4315986	1546626		Île Howe						
6889823	1546626	link	https://en.wikipedia.org/wiki/%C3%8Ele_Howe						
755161	1546630		Pointe du Débarquement						
755162	1546630		Hosken Point						
755163	1546630		Pointe Débarquement						
4315987	1546630		Pointe Hosken						
755164	1546631		Hopeful Harbor						
755165	1546631		Port de l'Esperance						
4315988	1546631		Baie du Hopeful						
755166	1546632		Mount Hooker						
4315989	1546632		Mont Hooker						
15244793	1546632	wkdt	Q31347597						
755167	1546633		Stosch Peninsula						
4315990	1546633		Presqu'île Hoche						
755168	1546634		Winter Harbor						
4315991	1546634		Port d'Hiver						
755169	1546635		Hillsborough Bay						
4315992	1546635		Baie du Hillsborough						
15508071	1546641	wkdt	Q31308668						
15959967	1546641		Piton Herbeux						
755170	1546643		Henry Island						
755171	1546643		Ilot Henry						
4315994	1546643		Île Henry						
15655338	1546643	wkdt	Q34791834						
755172	1546644		Mont Rallier						
755173	1546644		Mont Henri Rallier						
755174	1546644		Mont Henri						
4315995	1546644		Mont Henri Rallier du Baty						
755175	1546645		Bras Henri Bossière						
4315996	1546645		Fjord Henri Bossière						
755176	1546646		Mont Amiral Humann						
4315997	1546646		Mont de l'Hémicycle						
755177	1546648		Helen Harbor						
4315998	1546648		Port Hélène						
15687036	1546649	wkdt	Q31454580						
15959968	1546649		Cratère Hébert						
755178	1546650		Fossil Wood Mount						
755179	1546650		Mount Havergal						
4315999	1546650		Mont Havergal						
15425765	1546650	wkdt	Q31604828						
15565406	1546651	wkdt	Q31315430						
15959969	1546651		Haut Roc						
755180	1546653		Vanhöffen Insel						
4316000	1546653		Île Haute						
8693877	1546653	link	https://en.wikipedia.org/wiki/%C3%8Ele_Haute						
15887802	1546654	wkdt	Q31604842						
15959970	1546654		Mont Haug						
755181	1546655		Harston Rock						
755182	1546655		Rocher Harston						
4316001	1546655		Roche Harston						
13935076	1546656	fr	Pointe du Harem						
755183	1546658		Hallett Islands						
755184	1546658		Îlots Hallet						
4316002	1546658		Îlots Hallett						
755185	1546659		Swains Haulover						
4316003	1546659		Halage des Swains						
755186	1546660		Castaways Haulover						
4316004	1546660		Halage des Naufragés						
755187	1546661		Baie de l'Isthe						
4316005	1546661		Anse du Halage						
755188	1546663		Guynemer Peak						
4316006	1546663		Pic Guynemer						
755189	1546665		Point Guite						
4316007	1546665		Pointe Guite						
15585977	1546667	wkdt	Q34791806						
15959971	1546667		Île Guillou						
755190	1546669		Repère Guillaume						
4316008	1546669		Guillaume						
15330219	1546670	wkdt	Q34793876						
15959972	1546670		Îlot Guibon						
755191	1546671		Ile Guerite						
755192	1546671		Sentry Box Island						
4316009	1546671		Îlot Guérite						
15440873	1546671	wkdt	Q34793881						
755193	1546674	fr	Étang du G.R.I.						
4316010	1546674		Étang du Groupe de Recherches Ionosphériques						
15416714	1546675	wkdt	Q34827637						
15959973	1546675		Cap des Grottes						
755194	1546676		Grotto Bay						
4316011	1546676		Anse des Grottes						
755195	1546677		Bullauge						
4316012	1546677		Anse du Gros Ventre III						
755196	1546678		Lion Marin Bay						
4316013	1546678		Anse du Gros Ventre						
755197	1546679		Baie du Lion Marin						
4316014	1546679		Anse Grimaldi						
755198	1546681		Greenland Harbour						
755199	1546681		Port Greenland						
755200	1546681		Grönland						
4316015	1546681		Baie Greenland						
755201	1546682		Île Greak						
4316016	1546682		Îlot Greak						
15711626	1546682	wkdt	Q34793870						
15576335	1546683	wkdt	Q31604892						
15959974	1546683		Eperon du Gravimètre						
15630396	1546684	wkdt	Q34793865						
15959975	1546684		Îlot Gras						
15680207	1546685	wkdt	Q31604904						
15959976	1546685		Grand Ross						
13935077	1546686	fr	Rivière de la Grande Muraille						
755202	1546689		Le Trou du Grand Calme						
4316017	1546689		Trou du Grand Calme						
755203	1546691		Repère Gracieuse						
4316018	1546691		Gracieuse						
15493848	1546693	wkdt	Q31604917						
15959977	1546693		Monts des Grâces						
755204	1546694		Gourdain Pass						
4316019	1546694		Passe Gourdon						
755205	1546697		Plage des Pingouins						
4316020	1546697		Plage des Gorfous						
755206	1546698		Goodenough Point						
4316021	1546698		Pointe Goodenough						
755207	1546702		Glass Rocks						
755208	1546702		Rochers de Glace						
4316022	1546702		Roches Glass						
13935078	1546705	fr	Rivière des Glaciers						
15441589	1546707	wkdt	Q31604929						
15959979	1546707		Mont du Givre						
15866900	1546710	wkdt	Q31604942						
15959980	1546710		Mont Gergovie						
755209	1546712		Cape George						
755210	1546712		Le cap George						
4316023	1546712		Cap George						
15692306	1546712	wkdt	Q34828018						
15626975	1546713	wkdt	Q34827335						
15959981	1546713		Cap de la Géologie						
755211	1546719		Gazelle Strait						
755212	1546719		Détroit de la Gazelle						
4316024	1546719		Passage de la Gazelle						
755213	1546720		Gazelle Basin						
4316025	1546720		Bassin de la Gazelle						
15464498	1546721	wkdt	Q31604956						
15959982	1546721		Mont Gay-Lussac						
15752214	1546724	wkdt	Q31604969						
15959983	1546724		Mont Gaspard						
755214	1546726		Mont A. Gampert						
4316027	1546726		Mont Gampert						
15363371	1546726	wkdt	Q31604982						
13935079	1546727	fr	Pic Gamma						
15907405	1546727	wkdt	Q31347610						
755215	1546729		Pénisule Gallieni						
4316028	1546729		Presqu'île Gallieni						
16152229	1546731	link	https://en.wikipedia.org/wiki/Gallieni_Massif						
16211937	1546731		Massif Gallieni						
15490356	1546734	wkdt	Q34827789						
15959985	1546734		Cap du Gaillard						
755216	1546735		Ile Juby						
4316029	1546735		Île Gaby						
11297453	1546735	link	https://en.wikipedia.org/wiki/%C3%8Ele_Gaby						
15612057	1546739	wkdt	Q34793855						
15959986	1546739		Îlot Futifu						
755217	1546740		F.K. 3						
4316030	1546740		Fundamental Katalog Nombre Trois						
755218	1546742		Fullers Harbor						
4316031	1546742		Port Fuller						
13935080	1546745	fr	Lac Froid						
755219	1546747		Anse de la Fresnaye						
4316032	1546747		Baie de la Fresnaye						
755220	1546748	fr	Territoire des Terres Australes et Antarctiques Françaises						
755221	1546748		French Southern Indian Ocean Islands						
755222	1546748		Îles Australes Françaises						
755223	1546748		French Southern and Antarctic Territories						
755224	1546748		French Southern and Antarctic Lands						
755225	1546748		French Antarctica and Southern Lands						
755226	1546748		Îles Australes						
755227	1546748		Southern and Antarctic Territories						
755228	1546748		French Antarctica						
2256635	1546748	abbr	TAAF						
2417751	1546748	fr	Terres Australes et Antarctiques Françaises						
2418032	1546748	am	የፈረንሳይ ደቡባዊ ግዛቶች	1					
2418033	1546748	ar	الأقاليم الجنوبية الفرنسية	1					
2418034	1546748	be	Французскія Паўднёвыя тэрыторыі	1					
2418035	1546748	bg	Френски Южни Територии	1					
2418036	1546748	bn	ফরাসী দক্ষিণাঞ্চল	1					
2418037	1546748	ca	Territoris Australs Francesos	1					
2418038	1546748	cs	Francouzská jižní území	1					
2418039	1546748	cy	Tiroedd Deheuol ac Antarctig Ffrainc	1					
2418040	1546748	da	De Franske Besiddelser i Det Sydlige Indiske Ocean og Antarktis	1					
2418041	1546748	de	Französische Süd- und Antarktisgebiete	1					
2418042	1546748	el	Γαλλικά Νότια Εδάφη	1					
2418043	1546748	en	French Southern Territories	1					
2418044	1546748	es	Territorios Australes Franceses	1					
2418045	1546748	et	Prantsuse Lõunaalad	1					
2418046	1546748	eu	Hegoaldeko lurralde frantsesak	1					
2418047	1546748	fa	سرزمین‌های جنوب فرانسه	1					
2418048	1546748	fi	Ranskan eteläiset ja antarktiset alueet	1					
2418049	1546748	fr	Terres australes françaises (les)						
2418050	1546748	ga	Críocha Francacha Dheisceart an Domhain	1					
2418051	1546748	gl	Territorios Austrais Franceses	1					
2418052	1546748	he	הטריטוריות הדרומיות של צרפת	1					
2418053	1546748	hi	फ़्रांसीसी दक्षिणी क्षेत्र	1					
2418054	1546748	hr	Francuski južni i antarktički teritoriji	1					
2418055	1546748	hu	Francia Déli Területek	1					
2418056	1546748	ia	Territorios meridional francese	1					
2418057	1546748	id	Wilayah Selatan Prancis	1					
2418058	1546748	is	Frönsku suðlægu landsvæðin	1					
2418059	1546748	it	Terre australi francesi	1					
2418060	1546748	ja	仏領極南諸島	1					
2418061	1546748	ko	프랑스 남부 지방	1					
2418062	1546748	lo	ເຂດແດນທາງໃຕ້ຂອຝຮັ່ງ	1					
2418063	1546748	lt	Prancūzijos Pietų sritys	1					
2418064	1546748	lv	Francijas Dienvidjūru teritorija	1					
2418065	1546748	mk	Француски Јужни територии	1					
2418066	1546748	ms	Wilayah Selatan Perancis	1					
2418067	1546748	mt	It-Territorji Franċiżi tan-Nofsinhar	1					
2418068	1546748	nb	De franske sørterritorier	1					
2418069	1546748	nl	Franse Gebieden in de zuidelijke Indische Oceaan	1					
2418070	1546748	nn	Dei franske sørterritoria	1					
2418071	1546748	pl	Francuskie Terytoria Południowe i Antarktyczne	1					
2418072	1546748	pt	Territórios Franceses do Sul	1					
2418073	1546748	ro	Teritoriile Australe și Antarctice Franceze	1					
2418074	1546748	ru	Французские Южные территории	1					
2418075	1546748	sk	Francúzske južné a antarktické územia	1					
2418076	1546748	sl	Francosko južno ozemlje	1					
2418077	1546748	sr	Француске Јужне Територије	1					
2418078	1546748	sv	Franska Sydterritorierna	1					
2418079	1546748	th	เฟรนช์เซาเทิร์นเทร์ริทอรีส์	1					
2418080	1546748	tr	Fransız Güney Toprakları	1					
2418081	1546748	uk	Французькі Південні Території	1					
2418082	1546748	ur	فرانسیسی جنوبی خطے	1					
2418083	1546748	vi	Lãnh thổ phía Nam Thuộc Pháp	1					
2418084	1546748	zh-TW	法属南部领土	1					
2935141	1546748	link	https://en.wikipedia.org/wiki/French_Southern_and_Antarctic_Lands						
7091098	1546748	af	Franse Suidelike Gebiede	1					
7091099	1546748	as	দক্ষিণ ফ্ৰান্সৰ অঞ্চল	1					
7091100	1546748	az	Fransanın Cənub Əraziləri	1					
7091101	1546748	br	Douaroù aostral Frañs	1					
7091102	1546748	bs	Francuske Južne Teritorije	1					
7091103	1546748	ee	Anyiehe Franseme nutome	1					
7091104	1546748	gu	ફ્રેંચ સધર્ન ટેરિટરીઝ	1					
7091105	1546748	ka	ფრანგული სამხრეთის ტერიტორიები	1					
7091106	1546748	kn	ಫ್ರೆಂಚ್ ದಕ್ಷಿಣ ಪ್ರದೇಶಗಳು	1					
7091107	1546748	ml	ഫ്രഞ്ച് ദക്ഷിണ ഭൂപ്രദേശം	1					
7091108	1546748	mr	फ्रेंच दाक्षिणात्य प्रदेश	1					
7091109	1546748	my	ပြင်သစ် တောင်ပိုင်း ပိုင်နက်များ	1					
7091110	1546748	ne	फ्रेन्च दक्षिणी राज्यहरू	1					
7091111	1546748	or	ଫରାସୀ ଦକ୍ଷିଣ କ୍ଷେତ୍ର	1					
7091112	1546748	rm	Territoris Franzos Meridiunals	1					
7091113	1546748	sw	Himaya za Kusini za Kifaranza	1					
7091114	1546748	ta	பிரெஞ்சு தெற்கு பிரதேசங்கள்	1					
7091115	1546748	te	ఫ్రెంచ్ దక్షిణ ప్రాంతాలు	1					
7091116	1546748	ti	ናይ ፈረንሳይ ደቡባዊ ግዝኣታት	1					
7091117	1546748	to	Potu fonua tonga fakafalanisē	1					
7091118	1546748	zu	i-French Southern Territories	1					
7948377	1546748	fr	Terres australes françaises	1					
10301896	1546748	link	http://id.loc.gov/authorities/names/n82094862						
16490087	1546748	zh-CN	法属南部领地						
16925868	1546748	zh-Hant	法屬南部屬地	1					
16931451	1546748	ce	Французийн къилба латтанаш	1					
16931452	1546748	dz	ཕྲནཅ་གི་ལྷོ་ཕྱོགས་མངའ་ཁོངས	1					
16931453	1546748	fo	Fronsku sunnaru landaøki	1					
16931454	1546748	fy	Franse Gebieden in de zuidelijke Indyske Oseaan	1					
16931455	1546748	gd	Ranntairean a Deas na Frainge	1					
16931456	1546748	ha	Yankin Faransi ta Kudu	1					
16931457	1546748	hy	Ֆրանսիական Հարավային Տարածքներ	1					
16931458	1546748	ig	Ụmụ ngalaba Frenchi Southern	1					
16931459	1546748	jv	Wilayah Prancis nang Kutub Kidul	1					
16931460	1546748	kk	Францияның оңтүстік аймақтары	1					
16931461	1546748	km	ដែនដី​បារាំង​នៅ​ភាគខាងត្បូង	1					
16931462	1546748	ks	فرانسِسی جَنوٗبی عَلاقہٕ	1					
16931463	1546748	ky	Франциянын Түштүктөгү аймактары	1					
16931464	1546748	lb	Franséisch Süd- an Antarktisgebidder	1					
16931465	1546748	ln	Terres australes et antarctiques françaises	1					
16931466	1546748	mn	Францын өмнөд газар нутаг	1					
16931467	1546748	no	De franske sørterritorier	1					
16931468	1546748	pa	ਫਰੈਂਚ ਦੱਖਣੀ ਪ੍ਰਦੇਸ਼	1					
16931469	1546748	ps	د فرانسې جنوبي سیمې	1					
16931470	1546748	qu	Territorios Australes Franceses	1					
16931471	1546748	sd	فرانسيسي ڏاکڻي علائقا	1					
16931472	1546748	si	දකුණු ප්‍රංශ දූපත් සමූහය	1					
16931473	1546748	so	Dhul xadeedka Koonfureed ee Faransiiska	1					
16931474	1546748	sq	Territoret Jugore Franceze	1					
16931475	1546748	tg	Минтақаҳои Ҷанубии Фаронса	1					
16931476	1546748	tk	Fransuz günorta territoriýalary	1					
16931477	1546748	tt	Франциянең Көньяк Территорияләре	1					
16931478	1546748	ug	فىرانسىيەنىڭ جەنۇبىي زېمىنى	1					
16931479	1546748	uz	Fransuz Janubiy hududlari	1					
16931480	1546748	wo	Teer Ostraal gu Fraas	1					
16931481	1546748	yo	Agbègbè Gúúsù Faranṣé	1					
16931482	1546748	zh	法属南部领地	1					
15572159	1546755	wkdt	Q34790929						
15959987	1546755		Île de la Francès						
755229	1546756		Cape Francis						
755230	1546756		Gros-Cap						
4316033	1546756		Cap Français						
15680070	1546756	wkdt	Q34827968						
755231	1546757		Baie de l'Illustration						
4316034	1546757		Baie du Français						
755232	1546761		Fortune Islands						
4316035	1546761		Îles de la Fortune						
15610984	1546763	wkdt	Q31605024						
15959988	1546763		Mont Fontaine						
13935081	1546764	fr	Plateau des Fondrières						
755233	1546765		Foundry Bay						
755234	1546765		Arm of the Foundry						
755235	1546765		Foundry Branch						
4316036	1546765		Bras de la Fonderie						
755236	1546766		Prinz Adalbert Insel						
4316037	1546766		Île Foch						
6889520	1546766	link	https://en.wikipedia.org/wiki/%C3%8Ele_Foch						
755237	1546768		Jeschke Harbor						
4316038	1546768		Port Fleuriais						
15510432	1546770	wkdt	Q31347640						
15959989	1546770		Mont de la Flamme						
15735029	1546771	wkdt	Q31605049						
15959990	1546771		Mont du Filon						
755238	1546773		Bonfire Beach						
755239	1546773		Plage Feu de Joie						
4316039	1546773		Plage du Feu de Joie						
755240	1546774		Cape Ferron						
755241	1546774		Cap Ferron						
755242	1546774		South Pringle Point						
4316040	1546774		Cap Féron						
15595255	1546774	wkdt	Q34827993						
755243	1546776		Le Fernand						
4316041	1546776		Mont du Fernand						
14939585	1546776	wkdt	Q31605063						
755244	1546777		Baie des Moules						
755245	1546777		Mussel Bay						
4316042	1546777		Baie Fermée						
15436671	1546783	wkdt	Q31605103						
15959991	1546783		Mont des Fées						
15278768	1546784	wkdt	Q31605118						
15959992	1546784		Faux Sommet						
15499862	1546785	wkdt	Q31605132						
15959993	1546785		Mont Fauve						
15428346	1546786	wkdt	Q34865474						
15959994	1546786		Fausse Pointe						
755246	1546787		Point Farman						
4316043	1546787		Pointe Farman						
755247	1546788		Tafelberg Halbinsel						
755248	1546788		Presqu'île de la Table						
755249	1546788		Table Peninsula						
4316044	1546788		Presqu'île Fanny						
15412028	1546792	wkdt	Q31605145						
15959996	1546792		Mont de la Faille						
755250	1546796		Mount Evans						
4316045	1546796		Mont Evans						
15347224	1546796	wkdt	Q31347646						
755251	1546797		Ubungs Bay						
755252	1546797		Baie de l'Exercice						
755253	1546797		Uebungs-Bai						
4316046	1546797		Port de l'Eure						
15267719	1546804	wkdt	Q31605157						
15959997	1546804		Mont Étienne Peau						
15312693	1546814	wkdt	Q31605170						
15959998	1546814		Mont Erébus						
13935082	1546819	fr	Pointe de l'Épave						
755254	1546820		Vordere Bucht						
4316048	1546820		Bras Enzensperger						
15527544	1546823	wkdt	Q35423599						
15959999	1546823		Val des Entrelacs						
755255	1546824		Presqu'île du Ben Edra						
4316049	1546824		Presqu'île d'Entrecasteaux						
755256	1546825		Falaise d'Entrecasteaux						
755257	1546825		Presqu'île d'Entrecasteaux						
755258	1546825		Cap d'Entrecasteaux						
755259	1546825		D'Entrecasteaux Head						
4316050	1546825		Pointe d'Entrecasteaux						
755260	1546830		Hell Gate						
755261	1546830		Portes de l'Enfer						
755262	1546830		Hell's Gate						
755263	1546830		Porte de l'Enfer						
4316051	1546830		Les Portes de l'Enfer						
755264	1546834		Elizabeth Harbor						
4316052	1546834		Port Élisabeth						
755265	1546836		Elizabeth Head						
4316053	1546836		Cap Élisabeth						
755266	1546840		Pointe Éléphant						
755267	1546840		Dinner Point						
4316054	1546840		Promontoire Éléphant						
755268	1546845		Eclipse Bay						
4316055	1546845		Baie de l'Eclipse						
4316056	1546846	fr	Anse de l'Échouage						
755270	1546851		Anse des Laminaires						
4316057	1546851		Anse des Durvillea						
755271	1546853		Duncan Cove						
4316058	1546853		Anse du Duncan						
755272	1546854		Lindenberg-Gletscher						
4316059	1546854		Glacier Dumont d'Urville						
15470315	1546856	wkdt	Q31454581						
15960000	1546856		Cratères Dumas						
13935083	1546861	fr	Plateau des Drumlins						
15672329	1546861	wkdt	Q35703178						
755273	1546864		Baie aux Iles						
755274	1546864		Insel Bai						
755275	1546864		Islands Bay						
4316060	1546864		Baie Doumergue						
15547212	1546866	wkdt	Q34793822						
15960002	1546866		Îlot Douguet						
15754470	1546868	wkdt	Q31605209						
15960003	1546868		Mont Double						
15623036	1546872	wkdt	Q34827755						
15960004	1546872		Cap Donatien Cot						
755276	1546873		Mount Doctor Recamier						
4316061	1546873		Mont Docteur Récamier						
755277	1546874		Green Rocks						
4316062	1546874		Roches du Docteur Green						
755278	1546875		La Dive						
755279	1546875		Dives						
4316063	1546875		Mont de la Dives						
15254825	1546875	wkdt	Q31605236						
755280	1546878		La Table de Diomède						
4316064	1546878		Table de Diomède						
755281	1546880		Port Sunday						
755282	1546880		Sontags Harbour						
755283	1546880		Sunday Harbor						
4316065	1546880		Port Dimanche						
755284	1546881		Cape Digby						
4316066	1546881		Cap Digby						
15259658	1546881	wkdt	Q34827743						
755285	1546889		Rocks of Despair						
755286	1546889		Despair Rocks						
755287	1546889		Roches du Désespoir						
4316067	1546889		Rochers du Désespoir						
15473284	1546891	wkdt	Q31605287						
15960006	1546891		Monts de la Déroute						
755288	1546892		Repère Denise						
4316068	1546892		Denise						
13935084	1546893	fr	Pointe Denis						
755289	1546895		Half-Moon Beach						
4316069	1546895		Plage Demi-Lune						
13935085	1546897	fr	Pic Delta						
15419301	1546898	wkdt	Q34827301						
15960007	1546898		Cap de la Découverte						
13935086	1546899	fr	Étang de la Décharge						
755290	1546902		Dayman Islands						
4316071	1546902		Îles Dayman						
755291	1546903		Cores Rocks						
755292	1546903		Davis Islets						
4316072	1546903		Îles Davis						
755293	1546904		Passe du Varech						
755294	1546904		Tang Pass						
4316073	1546904		Passe Daussy						
13935087	1546905	fr	Pointe des Dauphins						
15695130	1546906	wkdt	Q34790580						
15960008	1546906		Île Dauphine						
755295	1546907		Foul Hawse Bay						
755296	1546907		Baie du Portail						
755297	1546907		Foul Bay						
755298	1546907		Fowl Haven						
4316074	1546907		Baie de la Dauphine						
755299	1546908		Cape Dauphin						
4316075	1546908		Cap Dauphin						
15786997	1546908	wkdt	Q34827085						
15600941	1546911	wkdt	Q35423410						
15960009	1546911		Val Danièle						
15468461	1546912	wkdt	Q31605299						
15960010	1546912		Mont Daniel Barbier						
15596211	1546913	wkdt	Q34827072						
15960011	1546913		Cap Daniel						
15608738	1546916	wkdt	Q35703148						
15960012	1546916		Plateau des Damiers						
755300	1546921		Saltskin Point						
4316076	1546921		Pointe du Cuir Salé						
13935088	1546922	fr	Mont Crozier						
15362642	1546922	wkdt	Q24930375						
15442395	1546923	wkdt	Q31605326						
15960013	1546923		Mont Crozet						
755301	1546924		Croy Island						
4316078	1546924		Île de Croy						
15782395	1546924	wkdt	Q34790736						
15282306	1546925	wkdt	Q31605340						
15960014	1546925		Mont Crosbie						
755302	1546928		Crystal Point						
4316079	1546928		Pointe Cristal						
755303	1546931		Credener Harbor						
755304	1546931		Credner Harbor						
4316080	1546931		Port Credner						
15453106	1546932	wkdt	Q31605353						
15960016	1546932		Pic du Cratère						
755305	1546936		Lac Cratère						
755306	1546936		Le Cratère						
755307	1546936		Crater Lake						
4316081	1546936		Bassin du Cratère						
15457724	1546937	wkdt	Q34793833						
15960017	1546937		Îlot du Cran de Mire						
755308	1546938		White Bay Point						
755309	1546938		Cox Point						
755310	1546938		Pointe de la Baie Blanche						
4316082	1546938		Pointe Cox						
755311	1546939		Rochers Cox						
755312	1546939		Roches Cox						
4316083	1546939		Îlots Cox						
755313	1546941	fr	Presqu'île Amiral Courbet						
755314	1546941		Observations Halbinsel						
755315	1546941	fr	Presqu'île de l'Observatoire						
755316	1546941	fr	Presqu'île Courbet						
755318	1546941		Niedrige Halbinsel						
4316084	1546941		Péninsule Courbet						
7154990	1546941	link	https://en.wikipedia.org/wiki/Courbet_Peninsula						
755319	1546942		Strauchberg						
4316085	1546942		Mont Courbet						
755320	1546943		Cap Seyrolle						
4316086	1546943		Cap Coupé						
15374847	1546943	wkdt	Q34826851						
755321	1546945		Cape Cotter						
4316087	1546945		Cap Cotter						
15308244	1546945	wkdt	Q34826839						
15431502	1546946	wkdt	Q35423422						
15960018	1546946		Val de Coste Noire						
13935089	1546948	fr	Pointe des Cormorans						
15201119	1546949	wkdt	Q34793811						
15960019	1546949		Îlot des Cormorans						
755322	1546951		Grande Arête de Glace						
755323	1546951		Cook's Glacier						
755324	1546951		Glacier Cook						
2935142	1546951	link	https://en.wikipedia.org/wiki/Cook_Ice_Cap						
4316088	1546951		Calotte Glaciaire Cook						
15589071	1546952	wkdt	Q35433740						
15960020	1546952		Vallée des Contacts						
15586724	1546953	wkdt	Q34791482						
15960021	1546953		Île du Commandant Loranchet						
755325	1546954		Mont de Rosily						
4316089	1546954		Mont du Commandant						
15495688	1546955	wkdt	Q34790456						
15960022	1546955		Île Colomban						
13935090	1546956	fr	Étang des Collets						
755326	1546959		Hog Island						
755327	1546959		Ile au Cochon						
755328	1546959		Ilot du Cochon						
755329	1546959		Ile du Cochon						
4316090	1546959		Île aux Cochons						
15367635	1546959	wkdt	Q34790100						
755330	1546960		Clugny Island						
755331	1546960		Iles Clugny						
755332	1546960		Clugny Islet						
4316092	1546960		Île Clugny						
755333	1546962		Muscle Bay						
4316093	1546962		Baie Clémenceau						
755334	1546965		Rochers Clark						
4316094	1546965		Roches Clark						
755335	1546969		Grab Island						
755336	1546969		Grave Island						
755337	1546969		Île Tombeau						
755338	1546969		Îlot du Cimetière						
4316095	1546969		Île du Cimetière						
15355427	1546969	wkdt	Q34791470						
755339	1546972		Repère Christiane						
4316096	1546972		Christiane						
15289743	1546973	wkdt	Q34793711						
15960023	1546973		Îlot aux Choux						
755340	1546974		Club-Moss Bay						
755341	1546974		Baie du Bouquet d'Arbres						
4316097	1546974		Anse aux Choux						
755342	1546977		Taube-Hafen						
755343	1546977		Port Pigeon						
4316098	1546977		Port du Chionis						
755344	1546979		Rocky Bay						
755345	1546979		Baie Rocheuse						
755346	1546979		Iceberg Bay						
4316099	1546979		Baie de Chimay						
755347	1546981		Presqu'île aux Canards						
4316100	1546981		Pointe du Chien						
755348	1546984		La Roche du Chenal						
755349	1546984		Rocher du Chenal						
755350	1546984		Fairway Rock						
4316101	1546984		Roche du Chenal						
755351	1546986		Ile Nord						
755352	1546986		Île du Nord						
755353	1546986		North Island						
4316102	1546986		Îlot du Chaton						
15313033	1546986	wkdt	Q34793827						
15156387	1546987	wkdt	Q31605405						
15960025	1546987		Château-Gaillard						
755354	1546989		Schlossberg						
755355	1546989		Mont du Château						
755356	1546989		Castel Mount						
4316103	1546989		Monts du Château						
15244481	1546989	wkdt	Q31605418						
15901139	1546990	wkdt	Q34791465						
15960026	1546990		Île du Château						
13935091	1546991	fr	Cirque du Château						
755357	1546992		Katzen Insel						
755358	1546992		Cat Island						
4316104	1546992		Île du Chat						
15830942	1546992	wkdt	Q34791460						
755359	1546993		Pic Chastaing						
4316105	1546993		Pic Chastain						
15686152	1546993	wkdt	Q31605429						
755360	1546994		Elephant River						
4316106	1546994		Rivière des Chasseurs						
15137017	1546995	wkdt	Q31347687						
15960027	1546995		Mont Chasseneige						
15498311	1546997	wkdt	Q34827133						
15960028	1546997		Cap de Chartres						
755361	1546999		Long Point						
4316107	1546999		Pointe Charlotte						
755362	1547000		Mont Babin						
755363	1547000		Mont Felix						
4316108	1547000		Mont Charles Vélain						
15243943	1547000	wkdt	Q31605442						
15339652	1547001	wkdt	Q31605456						
15960029	1547001		Pic Charcot						
15463548	1547002	wkdt	Q35433859						
15960030	1547002		Vallée du Charbon						
755364	1547004		Coal Harbour						
4316109	1547004		Anse du Charbon						
15415916	1547006	wkdt	Q31605469						
15960031	1547006		Mont Chaotique						
755365	1547007		Bassin du Prince Impérial						
755366	1547007		Kronprinz Bassin						
4316110	1547007		Baie Chanzy						
755367	1547008		Roche Channer						
755368	1547008		Île Channer						
4316111	1547008		Îlot Channer						
15886274	1547008	wkdt	Q3593594						
755369	1547012		Îles de l'Eure						
755370	1547012		Rittmeyer Islands						
755371	1547012		Rhodes Group						
755372	1547012		Challenger Islands						
4316113	1547012		Îlots du Challenger						
755373	1547013		Cape Challenger						
4316114	1547013		Cap du Challenger						
15489760	1547013	wkdt	Q34827766						
15293635	1547014	wkdt	Q34826759						
15960032	1547014		Cap Chabrillat						
755374	1547015		Cezembre Islet						
755375	1547015		Îlot Césembre						
4316115	1547015		Îlot Cézembre						
15545183	1547015	wkdt	Q34793789						
755376	1547017		Center Bay						
755377	1547017		Centre Bay						
4316116	1547017		Baie du Centre						
755378	1547018		Posadowsky Bergland						
755379	1547018		Luyken Plateau-Land						
4316117	1547018		Plateau Central						
15527111	1547018	wkdt	Q34817368						
15249061	1547019	wkdt	Q31605483						
15960033	1547019		Piton Central						
15334973	1547023	wkdt	Q35433728						
15960034	1547023		Vallée des Cavernes						
15566147	1547028	wkdt	Q31605496						
15960035	1547028		Castor et Pollux						
15373697	1547031	wkdt	Q35433846						
15960036	1547031		Vallée du Casque						
755380	1547032		Cascade River						
755381	1547032		Cascade Reach						
4316118	1547032		Baie des Cascades						
15201915	1547036	wkdt	Q31605520						
15960038	1547036		Mont Carroz						
755382	1547038		Roon Peninsula						
4316119	1547038		Presqu'île Carnot						
755383	1547039		Carmen Island						
4316120	1547039		Île de la Carmen						
15499208	1547039	wkdt	Q34790919						
755384	1547044		Pointe du Doris						
4316122	1547044		Pointe du Canot						
755385	1547047		Cancale Islets						
4316123	1547047		Îlots Cancale						
755386	1547051		Duck Island						
4316124	1547051		Île du Canard						
15796371	1547051	wkdt	Q34791454						
755387	1547052		Mount Campbell						
4316125	1547052		Mont Campbell						
15468507	1547052	wkdt	Q31347693						
15474527	1547054	wkdt	Q34793762						
15960039	1547054		Îlot Camille						
755388	1547055		Anse du Cirque						
4316126	1547055		Anse de Camaret						
15431692	1547056	wkdt	Q31605558						
15960040	1547056		Mont Calliope						
755389	1547058		Loom Bay						
755390	1547058		Baie de l'Inquiétude						
4316127	1547058		Baie Caillé						
755391	1547059		Green Island						
4316128	1547059		Îlots Cagne						
13935092	1547060	fr	Rivière Cachée						
755392	1547061		Hidden Bay						
755393	1547061		Verborgene Bai						
4316129	1547061		Baie Cachée						
755394	1547063		Pointe de la Boucle						
755395	1547063		Rings End Point						
4316130	1547063		Pointe des Cabanes						
755396	1547065		Mount Bungay						
4316131	1547065		Mont Bungay						
755397	1547067		Port Jeanne d'Arc Channel						
755398	1547067		Chenal de Buenos-Aires						
755399	1547067		Lewald-Strasse						
4316132	1547067		Passe de Buenos-Aires						
755400	1547068		Buchanan Island						
755401	1547068		Shag Rock						
755402	1547068		Ile Buchanan						
4316133	1547068		Îlot Buchanan						
15897920	1547068	wkdt	Q34793756						
15296520	1547073	wkdt	Q31605598						
15960041	1547073		Mont Bromley						
15238898	1547074	wkdt	Q34826627						
15960042	1547074		Cap Brissac						
755403	1547076		Breakwater Bay						
4316134	1547076		Baie du Brise-Lames						
755404	1547078		Cap Lieutard						
755405	1547078		Breakers Bluff						
4316135	1547078		Cap des Brisants						
15821202	1547078	wkdt	Q34827591						
11169875	1547080	fr	Ille Briggs						
15512177	1547081	wkdt	Q34790308						
15960043	1547081		Île Briand						
755406	1547086		Arm Point						
755407	1547086		Arm Spitze						
4316136	1547086		Pointe Bras						
755408	1547087		Îles Bénodet						
755409	1547087		Benodet Islands						
755410	1547087		Îlots de Boynes						
755411	1547087		Benodet Islets						
2935143	1547087	link	https://en.wikipedia.org/wiki/%C3%8Eles_de_Boynes						
4316137	1547087		Îles de Boynes						
15291232	1547088	wkdt	Q34793740						
15960045	1547088		Îlot Boyle						
15665850	1547091	wkdt	Q31605611						
15960046	1547091		Mont Bourges						
755412	1547092		Cape Bourbon						
4316138	1547092		Cap Bourbon						
15577095	1547092	wkdt	Q34826605						
755413	1547093		Jachmann Halbinsel						
4316139	1547093		Presqu'le Bouquet de la Grye						
755414	1547095		Presqu'île des Megalestris						
4316140	1547095		Presqu'iîle du Bougainville						
15573635	1547100	wkdt	Q35703220						
15960047	1547100		Plateau du Bouc						
755415	1547103		Bosler Rocks						
4316141	1547103		Roches Bosler						
13935093	1547106	fr	Rivière du Borgne						
755416	1547108		Börgen Inseln						
4316142	1547108		Îles Borda						
755417	1547110		Fresh Water Lake						
755418	1547110		Lac d'Eau Douce						
4316143	1547110		Lac Bontemps						
755419	1547112		Cape Bon Espoir						
4316144	1547112		Cap Bon Espoir						
15461821	1547112	wkdt	Q34826593						
755420	1547113		Snugg Cover Cove						
755421	1547113		Anse Charles Aubry						
755422	1547113		Snugg Corner Cove						
4316145	1547113		Anse du Bon Coin						
755423	1547114		Baie du Hopeful						
755424	1547114		Hopeful Harbor						
755425	1547114		Port de l'Esperance						
755426	1547114		Port Hopeful						
4316146	1547114		Mouillage Bon Abri						
755427	1547115		Bra Bolinder						
755428	1547115		Lewald-Strasse						
755429	1547115		Bolinder Arm						
755430	1547115		Bras Bolinder						
4316147	1547115		Bras Bolinders						
755431	1547116		Devil's Punch Bowl						
4316148	1547116		Ravin Bol de Punch du Diable						
755432	1547117		Mont Tabulaire						
755433	1547117		Table Boisguehenneu						
4316149	1547117		Table de Boisguehenneuc						
755434	1547124		White Bay						
4316150	1547124		Baie Blanche						
755435	1547125		Bezold-Dom						
4316151	1547125		Mont Blanc						
755436	1547128		Îlot Blakeney						
4316152	1547128		Île Blakeney						
755437	1547130		Rocher Oiseau						
755438	1547130		Bird Rock						
755439	1547130		Rocher Bird						
755440	1547130		Vogel Felsen						
4316153	1547130		Roche Bird						
755441	1547133		Shallop Harbour						
755442	1547133		Betsy Cove						
4316154	1547133		Anse Betsy						
755443	1547134		Bethell Island						
4316155	1547134		Île Bethell						
15549735	1547134	wkdt	Q34790265						
15670744	1547136	wkdt	Q31605652						
15960048	1547136		Mont Berlioz						
755444	1547137		Île Berland						
4316156	1547137		Îlot Berland						
15632614	1547137	wkdt	Q34793727						
755445	1547139		Sinistre Bay						
4316157	1547139		Baie de Bénodet						
755446	1547141		Pointe Jouault						
4316158	1547141		Pointe du Ben Edra						
755447	1547143		Îlot Bellouard						
4316159	1547143		Île Bellouard						
13935094	1547146	fr	Étang des Béliers						
755448	1547147		Île Guyot						
4316160	1547147		Île du Bélier						
15528563	1547147	wkdt	Q34791451						
15508518	1547148	wkdt	Q31605665						
15960049	1547148		Mont du Bel Air						
755449	1547149		Schön Wetter Hafen						
755450	1547149		Fine Weather Harbor						
4316161	1547149		Havre du Beau Temps						
15614297	1547152	wkdt	Q34793722						
15960050	1547152		Îlot Baudin						
755451	1547154		Kap Ruser						
4316162	1547154		Pointe Basse						
755452	1547155		Schulz Riff						
4316163	1547155		Récif Bas						
755453	1547157		Isthme du Tabac						
4316164	1547157		Isthme Bas						
755454	1547158		Niedrige Insel						
755455	1547158		Île Basse						
755456	1547158		Low Islet						
4316165	1547158		Îlot Bas						
15565961	1547158	wkdt	Q34793716						
15445238	1547162	wkdt	Q31605703						
15960051	1547162		Mont Balthazar						
755457	1547163		Balfour Rocks						
755458	1547163		Rochers Balfour						
4316166	1547163		Roches Balfour						
755459	1547164		Whalers Bay						
755460	1547164		Bay of Fucus Giganteus						
755461	1547164		Baie des Baleiniers						
4316167	1547164		Golfe des Baleiniers						
755462	1547165		Black Fish Bight						
4316168	1547165		Anse des Baleines Noires						
755463	1547166		Whale Bay						
4316169	1547166		Baie de la Baleine						
755464	1547167		Mont Bayley						
4316170	1547167		Mont Bailey						
15474509	1547167	wkdt	Q31605717						
755465	1547168		Baie Bayley						
4316171	1547168		Baie Bailey						
13935095	1547170	fr	Pointe de la Baignade						
755466	1547177		Quatrième Lac						
755467	1547177		4ème Lac						
4316173	1547177		Lac Aval						
755468	1547178		Carola Insel						
755469	1547178		Elizabeth Island						
4316174	1547178		Île Australia						
11292521	1547178	link	https://en.wikipedia.org/wiki/%C3%8Ele_Australia						
755470	1547179		Rocher de l'Austral						
4316175	1547179		Roche de l'Austral						
755471	1547181		Anse de l'Aurore Australe						
4316176	1547181	fr	Baie de l'Aurore Australe						
755472	1547184		Audierne Bay						
4316177	1547184		Baie d'Audierne						
755473	1547185		Mount Aubert de la Rue						
4316178	1547185		Mont Aubert de la Rue						
15763179	1547185	wkdt	Q31605755						
755474	1547186		Cap de la Caverne						
755475	1547186		Cape Aubert						
4316179	1547186		Cap Aubert						
15461826	1547186	wkdt	Q34826480						
15624151	1547188	wkdt	Q31605768						
15960052	1547188		Mont Athos						
755476	1547191		Successful Harbour						
755477	1547191		Astronomer Harbor						
4316180	1547191		Baie des Astronomes						
755478	1547192		Lac Dasté						
4316181	1547192		Lac d'Asté						
755479	1547194		Kap Wommelsdorf						
4316182	1547194		Pointe de l'Armorique						
16138167	1547195	link	https://en.wikipedia.org/wiki/Lake_Armor						
16211938	1547195		Lac d'Armor						
15442097	1547196	wkdt	Q34817358						
15960053	1547196		Plateau Armengaud						
755480	1547197		Pointe Darmancou						
755481	1547197		Pointe Maunoir						
755482	1547197		Pointe Darmancourt						
4316183	1547197		Pointe d'Armencourt						
755483	1547199		Pointe du Portail						
755484	1547199		Torbogenspitze						
755485	1547199		La Pyramide						
755486	1547199		Arch Point						
4316185	1547199		Pointe de l'Arche						
755487	1547202		Arago Glacier						
4316186	1547202		Glacier Arago						
15516622	1547207	wkdt	Q31454583						
15960055	1547207		Cratère Antonelli						
755488	1547209		Îlot de l'Antarès						
755489	1547209		Long Island						
755490	1547209		Île Longue						
4316188	1547209		Île de l'Antarès						
755491	1547210		Antarctic Cove						
755492	1547210		Antarctique cove						
755493	1547210		Antarctic Bay						
4316190	1547210		Anse de l'Antarctic						
755494	1547211		Cap Anne						
4316191	1547211		Cap Ann						
15643241	1547211	wkdt	Q34826458						
755495	1547213		Cap Danières						
755496	1547213		Cape Cumberland						
4316192	1547213		Pointe d'Anières						
15633819	1547216	wkdt	Q34793700						
15960056	1547216		Îlot Anezin						
15443117	1547217	wkdt	Q31605823						
15960057	1547217		Monts Andrée Aubert de la Rüe						
15243027	1547218	wkdt	Q35423167						
15960058	1547218		Val André						
755497	1547220		Amsterdan						
755498	1547220		Nouvelle Amsterdam						
755499	1547220		Amsterdam						
755500	1547220		Amsterdam Island						
1995196	1547220	de	Amsterdam						
1995197	1547220	es	Islas Saint-Paul y Amsterdam						
1995198	1547220	fr	Îles Saint-Paul et Amsterdam						
1995199	1547220	fr	Île Amsterdam						
1995200	1547220	en	Île Amsterdam						
1995201	1547220	af	Amsterdameiland						
1995202	1547220	ja	アムステルダム島						
1995203	1547220	nl	Amsterdam						
1995204	1547220	ro	Insula Amsterdam						
1995205	1547220	ru	Амстердам						
1995206	1547220	sk	Nový Amsterdam						
1995207	1547220	sv	Amsterdam						
1995208	1547220	sv	Amsterdamön						
1995209	1547220	zh	阿姆斯特丹岛						
2298892	1547220	no	Amsterdamøya						
2935144	1547220	link	https://en.wikipedia.org/wiki/%C3%8Ele_Amsterdam						
3050577	1547220	link	https://ru.wikipedia.org/wiki/%D0%90%D0%BC%D1%81%D1%82%D0%B5%D1%80%D0%B4%D0%B0%D0%BC_%28%D0%BE%D1%81%D1%82%D1%80%D0%BE%D0%B2%29						
4316193	1547220		Île Amsterdam						
3059069	1547221		Saint-Paul-et-Amsterdam	1	1				
8234880	1547221	link	https://en.wikipedia.org/wiki/%C3%8Ele_Amsterdam						
755501	1547230		Presqu'île de l'Amiral Douglas						
4316194	1547230		Presqu'île Amiral Douglas						
13935096	1547231	fr	Mont Amery						
15485153	1547231	wkdt	Q31605837						
13935097	1547232	fr	Rivière des Américains						
11307544	1547233	link	https://en.wikipedia.org/wiki/%C3%8Ele_Altazin						
11392528	1547233		Île Altazin						
15580085	1547234	wkdt	Q35703140						
15960059	1547234		Plateau des Alouettes						
755502	1547238		Allen Rock						
4316196	1547238		Roche Allen						
755503	1547239		Cape Allaire						
755504	1547239		Kap Ahlefeld						
755505	1547239		Cap Ahlefeld						
4316197	1547239		Cap Allaire						
15645334	1547239	wkdt	Q34826445						
755506	1547243		Mont A. Grandidier						
4316198	1547243		Mont Alfred Grandidier						
15684444	1547243	wkdt	Q31605862						
755507	1547244		Aldrich Channel						
4316199	1547244		Canal Aldrich						
15549505	1547252	wkdt	Q34827568						
15960060	1547252		Cap des Aiguilles						
755508	1547253		Agnes Bay						
4316200	1547253		Port Agnès						
15495061	1547255	wkdt	Q31605874						
15960061	1547255		Mont des Agates						
755509	1547257		Africa Bay						
755510	1547257		Baie de l'Afrique						
4316201	1547257		Baie de l'African						
755511	1547260		Accessible Bay						
755512	1547260		Zugänglichen-Bai						
4316202	1547260		Baie Accessible						
755513	1547261		Le Vallon des Abris						
4316203	1547261		Vallon des Abris						
15601795	1547261	wkdt	Q35433025						
755514	1547264		Îlots Abbot						
755515	1547264		Île Abbot						
755516	1547264		Abbot Islet						
4316204	1547264		Îlots Abbott						
2299155	6620749	en	Dumont d'Urville Station (France)						
2299156	6620749	en	Dumont d'Urville Station	1	1				
2299157	6620749	no	Dumont d'Urville-stasjonen (Frankrike)						
2299158	6620749	no	Dumont d’Urville	1	1				
2313471	6620749		Dumont d'Urville, Base						
2313472	6620749		Dumont d'Urville /Fr./						
3036359	6620749	link	https://en.wikipedia.org/wiki/Dumont_d%27Urville_Station						
3059071	6690916		Îles Éparses	1	1				
8234884	6690916	link	https://en.wikipedia.org/wiki/Scattered_islands_in_the_Indian_Ocean						
8356366	6690916	fr	Îles Éparses or Îles éparses de l'océan indien						
3059070	6690917		Terre-Adélie	1	1				
8234883	6690917	link	https://en.wikipedia.org/wiki/Ad%C3%A9lie_Land						
13186100	11546207	fr	District des Îles Éparses						
13186101	11546207	fr	Îles Éparses						
7192185	11594686	link	https://en.wikipedia.org/wiki/Martin-de-Vivi%C3%A8s						
15222245	11594686	wkdt	Q1118318						
