<?xml version="1.0" encoding="UTF-8" standalone="no"?>
<svg
   xmlns:dc="http://purl.org/dc/elements/1.1/"
   xmlns:cc="http://creativecommons.org/ns#"
   xmlns:rdf="http://www.w3.org/1999/02/22-rdf-syntax-ns#"
   xmlns:svg="http://www.w3.org/2000/svg"
   xmlns="http://www.w3.org/2000/svg"
   xmlns:sodipodi="http://sodipodi.sourceforge.net/DTD/sodipodi-0.dtd"
   xmlns:inkscape="http://www.inkscape.org/namespaces/inkscape"
   height="96"
   viewBox="0 0 96 96.000001"
   width="96"
   version="1.1"
   id="svg16"
   sodipodi:docname="weather-1flake-symbolic.svg"
   inkscape:version="1.0.1 (0767f8302a, 2020-10-17)">
  <metadata
     id="metadata22">
    <rdf:RDF>
      <cc:Work
         rdf:about="">
        <dc:format>image/svg+xml</dc:format>
        <dc:type
           rdf:resource="http://purl.org/dc/dcmitype/StillImage" />
        <dc:title />
      </cc:Work>
    </rdf:RDF>
  </metadata>
  <defs
     id="defs20" />
  <sodipodi:namedview
     pagecolor="#ffffff"
     bordercolor="#666666"
     borderopacity="1"
     objecttolerance="10"
     gridtolerance="10"
     guidetolerance="10"
     inkscape:pageopacity="0"
     inkscape:pageshadow="2"
     inkscape:window-width="1848"
     inkscape:window-height="1016"
     id="namedview18"
     showgrid="false"
     inkscape:zoom="5.6568542"
     inkscape:cx="29.771135"
     inkscape:cy="62.735363"
     inkscape:window-x="72"
     inkscape:window-y="27"
     inkscape:window-maximized="1"
     inkscape:current-layer="svg16"
     inkscape:document-rotation="0" />
  <rect
     style="color:#000000;stroke-width:0.9998"
     transform="rotate(90)"
     height="96"
     width="96.001587"
     y="-95.960007"
     x="0.0348"
     fill="none"
     id="rect2" />
  <path
     style="color:#000000;text-indent:0;text-decoration:none;text-decoration-line:none;text-transform:none;stroke-width:0.9998;color-rendering:auto;image-rendering:auto;shape-rendering:auto"
     d="m 51.01,6.2613084 c -10.23,0 -18.92,6.3024776 -23.07,15.3038756 l -0.2773,0.603259 -0.6621,0.04881 c -9.44,0.689724 -16.92,8.84646 -16.92,18.772488 0,10.375848 8.127,18.89244 18.17,18.89244 h 22.75 21.21 c 7.532,0 13.62,-6.393441 13.62,-14.14434 0,-5.877648 -3.53,-10.805676 -8.537,-12.934824 l -0.6523,-0.277189 -0.03125,-0.706717 c -0.64,-14.164332 -11.78,-25.5597718 -25.6,-25.5597718 z m -2.637,3.9304276 h 2.715 0.002 c 11.71,4e-5 21.23,9.514192 21.23,21.221508 v 0.002 0.002 c -0.005,1.437425 -0.3113,2.842862 -0.6055,4.246301 5.55,0.01368 10.07,4.533186 10.07,10.085964 h -0.002 c -4e-5,5.558775 -4.532,10.085964 -10.09,10.085964 l -42.77,-0.02147 c -8.132,2.8e-4 -14.75,-6.614353 -14.75,-14.7441 -2.7e-4,-8.127747 6.616,-14.7441 14.75,-14.7441 h 0.002 0.0059 c 0.5376,0.003 1.068,0.09098 1.602,0.152239 2.078,-8.665532 9.098,-15.2439 17.85,-16.29348 z"
     fill="#808080"
     id="path4" />
  <g
     id="g37"
     transform="matrix(0.52,0,0,0.52,-500.45773,46.304442)">
    <path
       style="color:#000000;fill:#808080;stroke-width:2.66647"
       d="m 1053.1746,37.606171 3.4644,-0.61316 v 32.44441 h -3.4644 z"
       id="path12" />
    <rect
       style="color:#000000;fill:#808080;stroke-width:2.66641"
       transform="matrix(-0.50004273,-0.86600073,0.86603737,-0.49997927,0,0)"
       height="32.425575"
       width="3.4634442"
       y="870.79596"
       x="-575.11151"
       id="rect14" />
    <rect
       style="color:#000000;fill:#808080;stroke-width:2.66641"
       transform="matrix(0.50004273,-0.86600073,-0.86603737,-0.49997927,0,0)"
       height="32.425575"
       width="3.4634442"
       y="-956.51575"
       x="479.61993"
       id="rect16" />
  </g>
</svg>
