<?xml version="1.0" encoding="UTF-8" standalone="no"?>
<svg
   xmlns:dc="http://purl.org/dc/elements/1.1/"
   xmlns:cc="http://creativecommons.org/ns#"
   xmlns:rdf="http://www.w3.org/1999/02/22-rdf-syntax-ns#"
   xmlns:svg="http://www.w3.org/2000/svg"
   xmlns="http://www.w3.org/2000/svg"
   xmlns:xlink="http://www.w3.org/1999/xlink"
   xmlns:sodipodi="http://sodipodi.sourceforge.net/DTD/sodipodi-0.dtd"
   xmlns:inkscape="http://www.inkscape.org/namespaces/inkscape"
   style="enable-background:new"
   height="1024"
   viewBox="0 0 1024 1024"
   width="1024"
   version="1.1"
   id="svg81"
   sodipodi:docname="calculator-app-splash.svg"
   inkscape:version="0.92.5 (0.92.5+68)">
  <metadata
     id="metadata85">
    <rdf:RDF>
      <cc:Work
         rdf:about="">
        <dc:format>image/svg+xml</dc:format>
        <dc:type
           rdf:resource="http://purl.org/dc/dcmitype/StillImage" />
        <dc:title></dc:title>
      </cc:Work>
    </rdf:RDF>
  </metadata>
  <sodipodi:namedview
     pagecolor="#ffffff"
     bordercolor="#666666"
     borderopacity="1"
     objecttolerance="10"
     gridtolerance="10"
     guidetolerance="10"
     inkscape:pageopacity="0"
     inkscape:pageshadow="2"
     inkscape:window-width="1859"
     inkscape:window-height="1056"
     id="namedview83"
     showgrid="false"
     showguides="true"
     inkscape:guide-bbox="true"
     inkscape:zoom="1.0569367"
     inkscape:cx="481.05297"
     inkscape:cy="625.56983"
     inkscape:window-x="61"
     inkscape:window-y="24"
     inkscape:window-maximized="1"
     inkscape:current-layer="svg81">
    <sodipodi:guide
       position="301.99395,668.73131"
       orientation="0,1"
       id="guide4827"
       inkscape:locked="false" />
    <sodipodi:guide
       position="336.49537,355.44986"
       orientation="0,1"
       id="guide4829"
       inkscape:locked="false" />
    <sodipodi:guide
       position="0,0"
       orientation="0,1024"
       id="guide4831"
       inkscape:locked="false" />
    <sodipodi:guide
       position="1024,0"
       orientation="-1024,0"
       id="guide4833"
       inkscape:locked="false" />
    <sodipodi:guide
       position="1024,1024"
       orientation="0,-1024"
       id="guide4835"
       inkscape:locked="false" />
    <sodipodi:guide
       position="0,1024"
       orientation="1024,0"
       id="guide4837"
       inkscape:locked="false" />
    <sodipodi:guide
       position="355.23689,340.54184"
       orientation="1,0"
       id="guide4839"
       inkscape:locked="false" />
    <sodipodi:guide
       position="668.51834,340.54184"
       orientation="1,0"
       id="guide4841"
       inkscape:locked="false" />
  </sodipodi:namedview>
  <defs
     id="defs39">
    <linearGradient
       id="b">
      <stop
         style="stop-color:#e7b108"
         offset="0"
         id="stop2" />
      <stop
         style="stop-opacity:.043"
         offset="1"
         id="stop4" />
    </linearGradient>
    <linearGradient
       id="e"
       y2="573.3"
       gradientUnits="userSpaceOnUse"
       y1="305.9"
       gradientTransform="matrix(.7487 0 0 .7487 329.7 -182.8)"
       x2="317"
       x1="317">
      <stop
         style="stop-color:#fff"
         offset="0"
         id="stop7" />
      <stop
         style="stop-color:#fff;stop-opacity:0"
         offset="1"
         id="stop9" />
    </linearGradient>
    <linearGradient
       id="g"
       y2="459.8"
       gradientUnits="userSpaceOnUse"
       x2="460.6"
       gradientTransform="matrix(1.033 0 0 1.033 247.6 -266.5)"
       y1="58.24"
       x1="58.3">
      <stop
         style="stop-opacity:0"
         offset="0"
         id="stop12" />
      <stop
         style="stop-opacity:.3841"
         offset=".5048"
         id="stop14" />
      <stop
         style="stop-opacity:0"
         offset="1"
         id="stop16" />
    </linearGradient>
    <clipPath
       id="i"
       clipPathUnits="userSpaceOnUse">
      <path
         style="color:#000000;enable-background:accumulate;fill:#fac82e"
         d="m545.4 104.4-23.5 40.6h-46.9v46.9l-40.6 23.5 23.5 40.6-23.45 40.62 70.35 40.62 40.62 70.35 40.6-23.5 40.6 23.5 40.6-70.4 70.4-40.6-23.5-40.6 23.5-40.6-70.4-40.6-40.6-70.4-40.6 23.5z"
         id="path19" />
    </clipPath>
    <clipPath
       id="h"
       clipPathUnits="userSpaceOnUse">
      <path
         style="color:#000000;enable-background:accumulate;fill:#fac82e"
         d="m215.4 104.4-23.5 40.6h-46.9v46.9l-40.6 23.5 23.5 40.6-23.45 40.62 70.35 40.62 40.62 70.35 40.6-23.5 40.6 23.5 40.6-70.4 70.4-40.6-23.5-40.6 23.5-40.6-70.4-40.6-40.6-70.4-40.6 23.5z"
         id="path22" />
    </clipPath>
    <linearGradient
       id="f"
       y2="409.6"
       gradientUnits="userSpaceOnUse"
       x2="407.6"
       gradientTransform="translate(256,-258)"
       y1="106.4"
       x1="104.4">
      <stop
         style="stop-opacity:0"
         offset="0"
         id="stop25" />
      <stop
         offset=".5048"
         id="stop27" />
      <stop
         style="stop-opacity:0"
         offset="1"
         id="stop29" />
    </linearGradient>
    <radialGradient
       id="a"
       xlink:href="#b"
       gradientUnits="userSpaceOnUse"
       cy="316.5"
       cx="311"
       gradientTransform="matrix(.4380 .008265 -.01352 .7165 179.1 87.14)"
       r="86.01" />
    <radialGradient
       id="d"
       gradientUnits="userSpaceOnUse"
       cy="256"
       cx="586"
       gradientTransform="matrix(1.775 -.02177 .02358 1.922 -460.1 -223.4)"
       r="111">
      <stop
         style="stop-color:#e7b108"
         offset="0"
         id="stop33" />
      <stop
         style="stop-opacity:.8870"
         offset="1"
         id="stop35" />
    </radialGradient>
    <radialGradient
       id="c"
       xlink:href="#b"
       gradientUnits="userSpaceOnUse"
       cy="256"
       cx="586"
       gradientTransform="translate(0 .00001153)"
       r="111" />
    <linearGradient
       x1="319.9"
       y1="16"
       gradientTransform="matrix(1.021,0,0,1.17,-13.09,-43.62)"
       x2="319.9"
       gradientUnits="userSpaceOnUse"
       y2="496"
       id="b-3">
      <stop
         id="stop4774"
         offset="0"
         stop-opacity="0" />
      <stop
         id="stop4776"
         offset=".5048" />
      <stop
         id="stop4778"
         offset="1"
         stop-opacity="0" />
    </linearGradient>
    <linearGradient
       x1="384.1"
       y1="480"
       gradientTransform="matrix(1,0,0,-1.12,0,522.4)"
       x2="384.1"
       gradientUnits="userSpaceOnUse"
       y2="2.651"
       id="a-6">
      <stop
         id="stop4781"
         offset="0"
         stop-color="#48c5b6" />
      <stop
         id="stop4783"
         offset="1"
         stop-color="#62d3bb" />
    </linearGradient>
  </defs>
  <path
     style="fill:#f2f2f2"
     id="path4800"
     d="m 404,376 v 44 h -44 v 16 h 44 v 44 h 16 v -44 h 44 v -16 h -44 v -44 z"
     inkscape:connector-curvature="0" />
  <rect
     style="fill:#f2f2f2"
     id="rect4802"
     x="588"
     y="360"
     width="16"
     height="104"
     transform="matrix(0,1,1,0,0,0)" />
  <path
     style="fill:#f2f2f2"
     id="path4804"
     d="m 560,480 v 16 h 104 v -16 z"
     inkscape:connector-curvature="0" />
  <path
     style="fill:#f2f2f2"
     id="path4806"
     d="m 560,528 v 16 h 104 v -16 z"
     inkscape:connector-curvature="0" />
</svg>
