201399	289656		Dohat as Salwa						
201400	289656		Baḩr as Salwá						
201401	289656		Dawḩat as Salwah						
201402	289656		Dawḩat as Salwá						
201403	289656		Salwa Sea						
201404	289656		Dawḩat Salwah						
1846585	289656	ar	دَوْحَة سَلْوَى						
4469048	289656		Dawḩat Salwá						
13396324	289656		Khalīj Salwá						
13396325	289656	ar	خليج سلوى						
13914165	290064		Madīnat Ḩamad						
13914166	290064	ar	مَدِينَة حَمَد						
202063	290065		Ras Zuwaiyid						
1846988	290065	ar	رَأْس زُوَيِّد						
4469447	290065		Ra’s Zuwayyid						
202064	290066		Dawḩat Fakākah						
202065	290066		Zimma Bay						
202066	290066		Zimna Bay						
1846989	290066	ar	دَوْحَة اَلزِّمَّة						
4469448	290066		Dawḩat az Zimmah						
1846990	290067	ar	رَأْس اَلزَّلاَّق						
4469449	290067		Ra’s az Zallāq						
1846991	290068	ar	عَيْن يُوسُف						
4469450	290068	ar	‘Ayn Yūsuf						
1846992	290069	ar	جَزِيرَة يَعْصُوف						
4469451	290069		Jazīrat Ya‘şūf						
13521272	290070	link	https://en.wikipedia.org/wiki/Central_Region,_Bahrain						
13534744	290070		Al Minţaqah al Wusţá						
13534745	290070	ar	اَلْمِنْطَقَة اَلْوُسْطَى						
13534746	290070		Central Region						
1846994	290071	ar	جُزُر اَلْوُكُور						
4469455	290071		Juzur al Wukūr						
4469456	290072		West Spit						
202068	290073		Wadiyah						
1846995	290073	ar	وَادِيَان						
4469457	290073	ar	Wādiyān						
202069	290074		Umm Ijrā’ī						
202070	290074		Ain Umm Ijraiyi						
1846996	290074	ar	عَيْن أُمّ مَجْرَى						
4469458	290074		‘Ayn Umm Majrá						
1846997	290075	ar	أُمّ خَرُورَة						
4469459	290075		Umm Kharūrah						
1846998	290076	ar	أُمّ جِدْر اَلصُّمَّان						
4469460	290076		Umm Jidr aş Şummān						
202071	290077		Umm Yādar						
1846999	290077	ar	عَيْن أُمّ جِدْر						
4469461	290077	ar	‘Ayn Umm Jidr						
1847000	290078	ar	أُمّ جِدْر						
4469462	290078		Umm Jidr						
202072	290079		Umm Ghuwaifa						
1847001	290079	ar	بِئْر أُمّ غُوَيْفَة						
4469463	290079		Bi’r Umm Ghuwayfah						
202073	290080		Umm as Suwālī						
1847002	290080	ar	كَوْكَب أُمّ اَلسَّوَالِي						
4469464	290080		Kawkab Umm as Sawālī						
202074	290081		‘Ayn Umm ash Sh‘ūm						
1847003	290081	ar	عَيْن أُمّ اَلشَّعُوم						
4469465	290081		‘Ayn Umm ash Sha‘ūm						
202075	290082		Umm ash Sholum						
202076	290082		Umm ash Shalūm						
1847004	290082	ar	أُمّ اَلشَّعُوم						
4469466	290082		Umm ash Sha‘ūm						
202077	290083		Umm ash Shahin						
202078	290083		Umm Shajar						
202079	290083		Umm al-Shadjar						
202080	290083		Umm ash Shanin						
202081	290083		Um el Shajar						
202082	290083		Umm ash-Shagar						
1847005	290083	ar	جَزِيرَة أُمّ اَلشَّجَر						
4469467	290083		Jazīrat Umm ash Shajar						
202083	290084		Um el Shajar						
202084	290084		Umm ash Shanin						
202085	290084		Umm ash Shahin						
1847006	290084	ar	أُمّ اَلشَّجَر						
4469468	290084		Umm ash Shajar						
202086	290085		Umm Na’san						
202087	290085		Um Nasan Island						
202088	290085		Umm Na’asān						
202089	290085		Umm Nasam Island						
202090	290085		Jazīrat Umm Na‘sān						
202091	290085		Al-Na‘sān						
202092	290085		Umm Nasan Island						
202093	290085		Umm an-Nassan						
1847007	290085	ar	أُمّ اَلنَّعْسَان						
4469469	290085		Umm an Na‘sān						
7133775	290085	link	https://en.wikipedia.org/wiki/Umm_an_Nasan						
16650704	290085		Umm an Nasan Island						
202094	290086		Ras Umm al Hassam						
1847008	290086	ar	رَأْس أُمّ اَلْحَصَّم						
4469470	290086		Ra’s Umm al Ḩaşşam						
202095	290087		Umm al-Hassam						
1847009	290087	ar	أُمّ اَلْحَصَّم						
4469471	290087		Umm al Ḩaşşam						
7076924	290087	link	https://en.wikipedia.org/wiki/Umm_Al_Hassam						
13729135	290087	unlc	BHUAH						
1847010	290088	ar	نَخْل أُمّ عَبْد اَللَّٰه						
4469472	290088		Nakhl Umm ‘Abd Allāh						
1847011	290089	ar	أُمّ عَبْد اَللَّٰه						
4469473	290089	ar	Umm ‘Abd Allāh						
202096	290090		Ras Tubil						
1847012	290090	ar	رَأْس تُوبْلِي						
4469474	290090		Ra’s Tūblī						
1847013	290091	ar	تُوبْلِي						
4469475	290091	ar	Tūblī						
6909042	290091	link	https://en.wikipedia.org/wiki/Tubli						
13729134	290091	unlc	BHTUB						
202097	290092		Thalib Shoal						
1847014	290092	ar	ثَلْب						
4469476	290092		Thalb						
1847015	290093	ar	طَشَّان						
4469477	290093		Ţashshān						
202098	290094		Swaifera						
202099	290094		Saafra Race Course						
1847016	290094	ar	صُوَيْفِرَة						
4469478	290094		Şuwayfirah						
202100	290095		Little Sand Island						
202101	290095		Sowad Shamaliya						
202102	290095		Sowad Shamiliya Island						
1847017	290095	ar	سُوَاد اَلشَّمَالِيَّة						
4469479	290095		Suwād ash Shamālīyah						
11850721	290095		Jazīrat Sawād						
11850722	290095	ar	جَزِيرَة سَوَاد						
202103	290096		Big Sand Island						
202104	290096		Sowad South Island						
202105	290096		Jazīrat Suwād						
1847018	290096	ar	سُوَاد اَلْجَنُوبِيَّة						
4469480	290096		Suwād al Janūbīyah						
14931525	290096	wkdt	Q20917187						
202106	290097		Sūk al-Kh-mīs						
1847019	290097	ar	سُوق اَلْخَمِيس						
4469481	290097		Sūq al Khamīs						
1847020	290098	ar	عَيْن اَلصُّمَّان						
4469482	290098		‘Ayn aş Şummān						
1847021	290099	ar	عَيْن اَلسُّجُور						
4469483	290099		‘Ayn as Sujūr						
202107	290100		Jazīrat Sahailah						
1847022	290100	ar	جَزِيرَة سُهَيْلَة						
4469484	290100		Jazīrat Suhaylah						
202108	290101		Sufala						
1847023	290101	ar	سُفَالَة						
4469485	290101		Sufālah						
8087361	290101	link	https://en.wikipedia.org/wiki/Sufala						
15427933	290101	wkdt	Q7634453						
202109	290102		Port of Sitrah						
202110	290102		Sitra Terminal						
202111	290102		Sitrah Anchorage						
202112	290102		Port of Sitra						
202113	290102		Sitra						
202114	290102		Sitra Oil Loading Terminal						
1847024	290102	ar	سِتْرَة						
4469486	290102		Sitrah						
6998198	290102	en	Sitra Terminal						
6998199	290102	en	Port of Sitrah						
202115	290103		Jazīrat Sitrah						
202116	290103		Sitra						
202117	290103		Jazīrat as Sitra						
202118	290103		As Sitra						
202119	290103		Sitra Island						
1847025	290103	ar	سِتْرَة						
4469487	290103		Sitrah						
16650703	290103	link	https://en.wikipedia.org/wiki/Sitra						
202120	290104		Sitra						
2922522	290104	link	https://en.wikipedia.org/wiki/Sitra						
3037851	290104	ru	Ситра						
4469488	290104		Sitrah						
4469489	290104	ar	سِتْرَة						
11643256	290104	ar	سترة						
11643257	290104	fa	ستره						
11643258	290104	he	סיטרה						
11643259	290104	ur	سترہ						
13729132	290104	unlc	BHSIT						
15569682	290104	wkdt	Q21052927						
13914167	290105		Sitrah						
13914168	290105	ar	سِتْرَة						
13914169	290105		Sitra						
1847028	290106	ar	حَيْر شُتَيَا						
5827082	290106		Ḩayr Shutayā						
202122	290107		Ras Sharaiba						
1847029	290107	ar	رَأْس اَلشُّرَيْبَة						
4469493	290107		Ra’s ash Shuraybah						
202123	290108		Ain Shul						
1847030	290108	ar	عَيْن اَلشُّول						
4469494	290108		‘Ayn ash Shūl						
1847031	290109	ar	قَلْعَة شَيْخ خَالِد						
4469495	290109		Qal‘at Shaykh Khālid						
202124	290110		Jazirat Ashikh						
202125	290110		Jazirat Ashaikh						
202126	290110		Jazirat Mashaikh						
1847032	290110	ar	جَزِيرَة اَلشَّيْخ						
4469496	290110		Jazīrat ash Shaykh						
202127	290111		Al Qar‘ah ash Shamālīyah						
202128	290111		Al Qa‘rah ash Shimālīyah						
1847033	290111	ar	اَلْقَارَة اَلشَّمَالِيَّة						
4469497	290111		Al Qārah ash Shamālīyah						
13914170	290112		Al Minţaqah ash Shamālīyah						
13914171	290112	ar	اَلْمِنْطَقَة اَلشَّمَالِيَّة						
13914172	290112		Northern Region						
202130	290113		Shaharakkan						
1847035	290113	ar	شَهْرَكَّان						
4469501	290113		Shahrakkān						
202131	290114		Ra’s ash Shābb						
1847036	290114	ar	رَأْس اَلشَّاب						
5827083	290114		Ra’s ash Shāb						
202132	290115		Saiyid						
1847037	290115	ar	عَيْن اَلسَّيِّد						
4469502	290115		‘Ayn as Sayyid						
202133	290116		Saiyid						
1847038	290116	ar	عَيْن سَيِّد						
4469503	290116		‘Ayn Sayyid						
202134	290117		As Sāja						
202135	290117		Jazīrat as Saja						
202136	290117		Jazirat as Saya						
202137	290117		Jazīrat aş Sāyah						
202138	290117		Saya						
1847039	290117	ar	جَزِيرَة اَلسَّايَة						
4469504	290117		Jazīrat as Sāyah						
1847040	290118	ar	سَار						
4469505	290118	ar	Sār						
1847041	290119	ar	رَأْس سَنَد						
4469506	290119		Ra’s Sanad						
1847042	290120	ar	سَنَد						
2922523	290120	link	https://en.wikipedia.org/wiki/Sanad%2C_Bahrain						
4469507	290120		Sanad						
13729131	290120	unlc	BHSAN						
15352189	290120	wkdt	Q4166429						
202139	290121		As Sanābīs						
1847043	290121	ar	سَنَابِس						
4469508	290121		Sanābis						
8094936	290121	link	https://en.wikipedia.org/wiki/Sanabis						
1847044	290122	ar	كَوْكَب سَمَاهِيج						
4469509	290122		Kawkab Samāhīj						
202140	290123		Simahij						
202141	290123		Samāhīdj						
1847045	290123	ar	سَمَاهِيج						
4469510	290123		Samāhīj						
1847046	290124	ar	دَوْحَة سَلْوَى						
4469511	290124		Dawḩat Salwá						
1847047	290125	ar	ضِلْع سَلْمَان بِن دُعَيْج						
4469512	290125		Ḑil‘ Salmān Bin Du‘ayj						
202142	290126		Mina Sulman						
1847048	290126	ar	مِينَاء سَلْمَان						
4469513	290126		Mīnā’ Salmān						
13729127	290126	unlc	BHMIN						
202143	290127		Salambad						
1847049	290127	ar	سَلْمَابَاد						
4469514	290127		Salmābād						
7076084	290127	link	https://en.wikipedia.org/wiki/Salmabad						
1847050	290128	ar	كَوْكَب صَالِح						
4469515	290128		Kawkab Şāliḩ						
202144	290129		Ras Salbe						
202145	290129		Ras Salba						
1847051	290129	ar	رَأْس سَلْبَة						
4469516	290129		Ra’s Salbah						
202146	290130		Salba						
1847052	290130	ar	سَلْبَة						
4469517	290130		Salbah						
1847053	290131	ar	رَأْس اَلسَّلَى						
4469518	290131		Ra’s as Salá						
202147	290132		Sakhara						
202148	290132		Şakharāh						
1847054	290132	ar	صَخَارِي						
4469519	290132		Şakhārī						
202149	290133		Safiah						
202150	290133		Safrah						
1847055	290133	ar	صَافِرَة						
4469520	290133		Şāfirah						
1847056	290134	ar	عَيْن اَلصَّفَاحِيَّة						
4469521	290134		‘Ayn aş Şafāḩīyah						
1847057	290135	ar	بَنْدَر صَدَد						
4469522	290135		Bandar Şadad						
1847058	290136	ar	صَدَد						
4469523	290136		Şadad						
1847059	290137	ar	فَشْت رُسْتَن						
4469524	290137		Fasht Rustan						
1847060	290138	ar	رَأْس اَلرُّمَّان						
4469525	290138		Ra’s ar Rummān						
7132736	290138	link	https://en.wikipedia.org/wiki/Ras_Rumman						
202151	290139		Ḑil‘ Rafah						
1847061	290139	ar	ضِلْع اَلرِّفَاع						
4469526	290139		Ḑil‘ ar Rifā‘						
1847062	290140	ar	رَأْس رَيَّا						
4469527	290140		Ra’s Rayyā						
1847063	290141	ar	كَوْكَب رَيَّا						
4469528	290141		Kawkab Rayyā						
202152	290142		Raiya						
1847064	290142	ar	رَيَّا						
4469529	290142		Rayyā						
1847065	290143	ar	رَوْضَة اَلصَّخِير						
4469530	290143		Rawḑat aş Şakhīr						
202153	290144		Ain						
202154	290144		Ras al Ain						
1847066	290144	ar	رَأْس اَلْعَيْن						
4469531	290144		Ra’s al ‘Ayn						
1847067	290145	ar	عَيْن اَلرَّحَى						
4469532	290145		‘Ayn ar Raḩá						
202155	290146		Radm al Kawarī						
202156	290146		Radham al-Qawari						
1847068	290146	ar	رَدْم اَلْقَوَارِي						
4469533	290146		Radm al Qawārī						
202157	290147		Jazīrat Rubādh						
202158	290147		Ar Rabādh						
202159	290147		Jazīrat Rubāz̧						
202160	290147		Djezira Rubadh						
1847069	290147	ar	رَبَض اَلشَّرْقِيَّة						
4469534	290147		Rabaḑ ash Sharqīyah						
1847070	290148	ar	رَبَض اَلْغَرْبِيَّة						
4469535	290148		Rabaḑ al Gharbīyah						
202161	290149		Ras al Qarain						
1847071	290149	ar	رَأْس اَلْقُرَيْن						
4469536	290149		Ra’s al Qurayn						
202162	290150		Kalaia Rock						
4469537	290150		Qulay‘ah Rock						
1847072	290151	ar	قَصَّار اَلْقُلَيْعَة						
4469538	290151		Qaşşār al Qulay‘ah						
202163	290152		Khor al Qalaia						
202164	290152		Kaliya						
202165	290152		Khor Kaliya						
202166	290152		Khawra al-Kulay‘a						
202167	290152		Khor-al-Qala’ah						
1847073	290152	ar	خَوْر اَلْقُلَيْعَة						
4469539	290152		Khawr al Qulay‘ah						
202168	290153		Dohat al Qadhaibīyah						
202169	290153		Qudhaibiya Bay						
1847074	290153	ar	دَوْحَة اَلْقُضَيْبِيَّة						
4469540	290153		Dawḩat al Quḑaybīyah						
202170	290154		Kubait						
1847075	290154	ar	قُبَيْط						
4469541	290154		Qubayţ						
1847076	290155	ar	عَيْن قَصَّارِي						
4469542	290155		‘Ayn Qaşşārī						
202171	290156		Arad Fort						
1847077	290156	ar	قَلْعَة عَرَاد						
4469543	290156		Qal‘at ‘Arād						
7180454	290156	link	https://en.wikipedia.org/wiki/Arad_Fort						
202172	290157		Qal’at al Farangi						
202173	290157		Qalat Al-Bahrain						
202174	290157		Fort of Bahrain						
1847078	290157	ar	قَلْعَة اَلْعَجَاج						
4469544	290157		Qal‘at al ‘Ajāj						
202175	290158		Abu Mahir						
202176	290158	en	Abu Mahir Fort						
202177	290158		Abu Mahur						
202178	290158		Abu Māhur Fort						
1847079	290158	ar	قَلْعَة أَبُو مَاهِر						
4469545	290158		Qal‘at Abū Māhir						
13333398	290158	en	Muharraq Fort						
13333399	290158	en	Bu Maher Fort						
202179	290159		Ras Galai						
1847080	290159	ar	رَأْس قَلاَلِي						
4469546	290159		Ra’s Qalālī						
202180	290160		Galali						
202181	290160		Kalālī						
202182	290160		Qalānī						
1847081	290160	ar	قَلاَلِي						
4469547	290160		Qalālī						
7066305	290160	link	https://en.wikipedia.org/wiki/Galali						
13729129	290160	unlc	BHQAL						
15283434	290160	wkdt	Q5517918						
202183	290161		Ras al Qala’a						
1847082	290161	ar	رَأْس اَلْقَلْعَة						
4469548	290161		Ra’s al Qal‘ah						
202184	290162		Outer Harbour						
4469549	290162		Outer Anchorage						
1847083	290163	ar	نُور جُرُفْت						
4469550	290163	ar	Nūr Juruft						
1847084	290164	ar	قَصَّار نُون						
4469551	290164		Qaşşār Nūn						
1847085	290165	ar	حَالَة نُون						
4469552	290165		Ḩālat Nūn						
202185	290166		Ra’s al Niqāh						
1847086	290166	ar	رَأْس اَلنِّقَاه						
4469553	290166		Ra’s an Niqāh						
202186	290167		Ras Noma						
202187	290167		Rās Nomah						
202188	290167		Ra’s Nūmah						
1847087	290167	ar	رَأْس نَوْمَة						
4469554	290167		Ra’s Nawmah						
1847088	290168	ar	بَنْدَر نَخْلَة						
4469555	290168		Bandar Nakhlah						
202189	290169		Al-Nabīh Şāliḩ						
202190	290169		Nebbi Salih						
202191	290169		Nabih Salih						
202192	290169		An Nabī Şāliḩ						
202193	290169		Djezire Nebi Sali						
202194	290169		Nebi Saleh						
202195	290169		An Nabīh Sāliḩ						
202196	290169		Nabbi Salih Island						
202197	290169		Nabi Salib Island						
202198	290169		Djezire Nabi Sali						
1847089	290169	ar	جَزِيرَة اَلنَّبِي صَالِح						
4469556	290169		Jazīrat an Nabī Şāliḩ						
7198071	290169	link	https://en.wikipedia.org/wiki/Nabih_Saleh						
202199	290170		Muhazwara Island						
202200	290170		Mahazwarat Island						
4469557	290170		Muḩazwarah Island						
202201	290171		‘Arad						
202202	290171		Al-Muḩarrak						
202203	290171		Muharraq Island						
202204	290171		Al Muḩarraq						
1847090	290171	ar	جَزِيرَة اَلْمُحَرَّق						
2922524	290171	link	https://en.wikipedia.org/wiki/Muharraq_Island						
4469558	290171		Jazīrat al Muḩarraq						
16650701	290171	en	Muharraq Island						
16650702	290171		Moharek				1		
202205	290172		Dohat 'Arād						
202206	290172		Bay of Arad						
202207	290172		Dawḩat `Arād						
202208	290172		Muharraq Bay						
1847091	290172	ar	دَوْحَة اَلْمُحَرَّق						
1847092	290173	ar	جَزِيرَة مَشْتَان						
4469559	290173		Jazīrat Mashtān						
1847093	290174	ar	مَرْوَزَان						
4469560	290174		Marwazān						
1847094	290175	ar	مَرْوَدِي						
4469561	290175		Marwadī						
202209	290176		Markūbān						
1847095	290176	ar	مَرْقُوبَان						
4469562	290176		Marqūbān						
8087860	290176	link	https://en.wikipedia.org/wiki/Marquban						
202210	290177		Khawr Lupin						
202211	290177		Khor Magta Tubli						
202212	290177		Khor Makta’a Tubil						
202213	290177		Khor Maqta Tubli						
1847096	290177	ar	خَوْر مَقْطَع تُوبْلِي						
4469563	290177		Khawr Maqţa‘ Tūblī						
202214	290178		Makaba						
1847097	290178	ar	مَقَابَا						
4469564	290178		Maqābā						
1847098	290179	ar	مَنِي						
4469565	290179		Manī						
1847099	290180	ar	مِينَاء اَلْمَنَامَة						
4469566	290180		Mīnā’ al Manāmah						
16710091	290180	unlc	BHBAH						
202215	290181		Manāmah Bay						
202216	290181		Manama Bay						
1847100	290181	ar	دَوْحَة اَلْمَنَامَة						
4469567	290181		Dawḩat al Manāmah						
202217	290182		Ra’s al Maţallah						
202218	290182		Ras al Mattala						
202219	290182		Ra’s al Muţallah						
202220	290182		Ra’s al Mumaţţalah						
202221	290182		Ra’s al M’ţţalah						
202222	290182		Ras al Muttala						
1847101	290182	ar	رَأْس اَلْمَمْطَلَة						
4469568	290182		Ra’s al Mamţalah						
13450170	290182	ar	رأس المطلة						
202223	290183		Mimlahat al Muttala						
202224	290183		Mamlaḩat al Maţallah						
202225	290183		Mamlaḩat al M’ţţalah						
202226	290183		Mamlaḩat Mumaţţalah						
202227	290183		Mimlahat al Mattala						
202228	290183		Mamlaḩat al Muţallah						
1847102	290183	ar	مَمْلَحَة اَلْمَمْطَلَة						
4469569	290183		Mamlaḩat al Mamţalah						
13450171	290183	ar	مملحة المطلة						
202229	290184		Dawḩat al Mutallah						
202230	290184		Mattala Bay						
202231	290184		Muttala Bay						
202232	290184		Dawḩat Mumaţţalah						
202233	290184		Dawḩat al M’ţţalah						
202234	290184		Dwaḩat al Mamţalah						
202235	290184		Matallah Bay						
1847103	290184	ar	دَوْحَة اَلْمَمْطَلَة						
4469570	290184		Dawḩat al Mamţalah						
202236	290185		Muhazza						
1847104	290185	ar	عَيْن اَلْمَهَزَّة						
4469571	290185		‘Ayn al Mahazzah						
202237	290186		Muhazza						
1847105	290186	ar	مَهَزَّة						
4469572	290186		Mahazzah						
202238	290187		Medinat Isa						
202239	290187		Isa Town						
202240	290187		Isa						
1847106	290187	ar	مَدِينَة عِيسَى						
2922525	290187	link	https://en.wikipedia.org/wiki/Isa_Town						
4469573	290187		Madīnat ‘Īsá						
15327794	290187	wkdt	Q1017673						
13914173	290188		Madīnat ‘Īsá						
13914174	290188	ar	مَدِينَة عِيسَى						
13914175	290188		Isa Town						
1847108	290189	ar	جَبَل لُغَيْبِرَات						
4469577	290189		Jabal Lughaybirāt						
1847109	290190	ar	لِيَا						
4469578	290190	ar	Liyā						
202242	290191		Nakhal Lazi						
202243	290191		Nakhal Lozi						
1847110	290191	ar	نَخْل لَوْزِي						
4469579	290191		Nakhl Lawzī						
1847111	290192	ar	عَيْن خُوَيْص						
4469580	290192		‘Ayn Khuwayş						
202244	290193		Huwais						
202245	290193		Khuwais						
1847112	290193	ar	خُوَيْص						
4469581	290193		Khuwayş						
202246	290194		Khusaifa						
202247	290194		Ras Khasaifa Spit						
202248	290194		Ra’s Khuşayfah Spit						
1847113	290194	ar	رَأْس خُصَيْفَة						
4469582	290194		Ra’s Khuşayfah						
202249	290195		Jazīrat Khuşayfah						
202250	290195		Khasaifa Island						
202251	290195		Jazīrat Khasaifa						
1847114	290195	ar	قَصَّار خُصَيْفَة						
4469583	290195		Qaşşār Khuşayfah						
6998201	290195	en	Khasaifa Island						
16186930	290195	link	https://en.wikipedia.org/wiki/Qassar_Khusayfah						
202252	290196		Khor Fasht						
1847115	290196	ar	خَوْر فَشْت						
4469584	290196		Khawr Fasht						
202253	290197		Khadhra						
1847116	290197	ar	عَيْن اَلْخَضْرَاء						
4469585	290197		‘Ayn al Khaḑrā’						
202254	290198		Kawarah						
1847117	290198	ar	كَوْرَة						
4469586	290198		Kawrah						
1847118	290199	ar	كَوْكَب كَسَّر						
4469587	290199		Kawkab Kassar						
1847119	290200	ar	بَنْدَر كَرْزَكَّان						
4469588	290200		Bandar Karzakkān						
202255	290201		Karrzakkān						
1847120	290201	ar	كَرْزَكَّان						
4469589	290201		Karzakkān						
1847121	290202	ar	عَيْن كَرَّانَة						
4469590	290202		‘Ayn Karrānah						
202256	290203		Karrāmah						
202257	290203		Karānah						
202258	290203		Karrama						
1847122	290203	ar	كَرَّانَة						
4469591	290203		Karrānah						
1847123	290204	ar	كَرْبَابَاد						
4469592	290204		Karbābād						
8079117	290204	link	https://en.wikipedia.org/wiki/Karbabad						
202259	290205		Kaflar						
1847124	290205	ar	كَفْلاَن						
4469593	290205		Kaflān						
202260	290206		Khor Lupin						
202261	290206		Khor al Hab						
202262	290206		Khawr Maqta ‘Tūblī						
202263	290206		Khawr al Kabb						
1847125	290206	ar	خَوْر اَلْكَاب						
4469594	290206		Khawr al Kāb						
202265	290208		Jazaiyra						
202266	290208		Jazaiyira						
202267	290208		Juzayirah						
1847127	290208	ar	جُزَيِّرَة						
4469598	290208		Juzayyirah						
202268	290209		Ra’s al Jazā’ir						
202269	290209		Ras Jasaira						
1847128	290209	ar	رَأْس اَلْجُسَيْرَة						
4469599	290209		Ra’s al Jusayrah						
202270	290210		Jasaira						
202271	290210		Jasairah						
1847129	290210	ar	جُسَيْرَة						
4469600	290210		Jusayrah						
202272	290211		Jardi						
202273	290211		Jazīrat Jurdī						
202274	290211		Jurdi Rock						
1847130	290211	ar	قَصَّار جُرْدِي						
4469601	290211		Qaşşār Jurdī						
202275	290212		Jurdah						
1847131	290212	ar	جُرْدَاب						
4469602	290212	ar	Jurdāb						
8089946	290212	link	https://en.wikipedia.org/wiki/Jurdab						
202276	290213		Ra’s al Jasrah						
202277	290213		Ra’s Qazqaz						
202278	290213		Ras al Jufair						
202279	290213		Ras al Jasra						
1847132	290213	ar	رَأْس اَلْجُفَيْر						
4469603	290213		Ra’s al Jufayr						
202280	290214		Jubailāt						
1847133	290214	ar	جُبَيْلاَت						
4469604	290214		Jubaylāt						
202281	290215		Judd Ḩafş						
202282	290215		Jadd Hafs						
202283	290215		Jid Hafs						
202284	290215		Djidd Ḥafṣ						
1847134	290215	ar	جِدّ حَفْص						
4469605	290215		Jidd Ḩafş						
7509246	290215	link	https://en.wikipedia.org/wiki/Jidhafs						
16933725	290215	unlc	BHJDF						
13914176	290216		Jidd Ḩafş						
13914177	290216	ar	جِدّ حَفْص						
13914178	290216		Jidhafs						
202286	290217		Judd Ali						
1847136	290217	ar	جِدّ عَلِي						
4469609	290217	ar	Jidd ‘Alī						
13729125	290217	unlc	BHJAL						
1847137	290218	ar	جِدّ اَلْحَاجّ						
4469610	290218		Jidd al Ḩājj						
202287	290219		Jeddah						
202288	290219		Jida Island						
202289	290219		Jazīrat Jidi						
202290	290219		Djidā						
202291	290219		Cliff Island						
1847138	290219	ar	جِدَّة						
4469611	290219		Jiddah						
202292	290220		Ras al Jazayir						
1847139	290220	ar	رَأْس اَلْجَزَائِر						
4469612	290220		Ra’s al Jazā’ir						
202293	290221		Djaww						
202294	290221		Jaw						
202295	290221		Jau						
1847140	290221	ar	جَوّ						
2922527	290221	link	https://en.wikipedia.org/wiki/Jaww						
4469613	290221		Jaww						
15774999	290221	wkdt	Q6166248						
202296	290222		Ras Jasra						
1847141	290222	ar	رَأْس اَلْجَسْرَة						
4469614	290222		Ra’s al Jasrah						
202297	290223		Bandar Jasra						
1847142	290223	ar	بَنْدَر اَلْجَسْرَة						
4469615	290223		Bandar al Jasrah						
1847143	290224	ar	فَشْت اَلْجَارِم						
4469616	290224		Fasht al Jārim						
202298	290225		Al Qarah Janūbīyah						
202299	290225		Al Qar‘ah al Janūbīyah						
1847144	290225	ar	اَلْقَارَة اَلْجَنُوبِيَّة						
4469617	290225		Al Qārah al Janūbīyah						
202300	290226		Djannusān						
1847145	290226	ar	جَنُّوسَان						
4469618	290226		Jannūsān						
8100733	290226	link	https://en.wikipedia.org/wiki/Jannusan						
1847147	290228	ar	عَيْن جَمَالَة						
4469620	290228		‘Ayn Jamālah						
202306	290229		Jumaylāt						
202307	290229		Jamala						
1847148	290229	ar	جَمَالَة						
4469621	290229		Jamālah						
202308	290230		Ra’s Jamal						
202309	290230		Hadd al Yamal						
202310	290230		Ra’s al Yaman						
1847149	290230	ar	حَدّ اَلْجَمَل						
4469622	290230		Ḩadd al Jamal						
1847150	290231	ar	جَادَم						
4469623	290231		Jādam						
202311	290232		Yabberi Rock						
1847151	290232	ar	جَبَّارِي						
4469624	290232		Jabbārī						
202312	290233		Jebal						
1847152	290233	ar	جَبَل عَمْپ						
4469625	290233		Jabal Camp						
202313	290234		Jabalat Habshi						
1847153	290234	ar	جَبَلَة حَبَشِي						
4469626	290234		Jabalat Ḩabashī						
1847154	290235	ar	قَصَّار عِيسَى بِن سَيْف اَلْبِنَالِي						
4469627	290235		Qaşşār ‘Īsá Bin Sayf al Binālī						
202314	290236		Inner Harbour						
4469628	290236		Inner Anchorage						
1847155	290237	ar	قَرْن إِبْرَاهِيم						
4469629	290237		Qarn Ibrāhīm						
202315	290238		Ain al Hanaini						
1847156	290238	ar	عَيْن اَلْحُنَيْنِي						
4469630	290238		‘Ayn al Ḩunaynī						
1847157	290239	ar	حِلَّة اَلسُّوق						
4469631	290239		Ḩillat as Sūq						
202316	290240		Almaqsha,						
202317	290240		Almaqsha						
1847158	290240	ar	المقشع						
4469632	290240		Almaqsha'						
202318	290241		Rās Sa’sa’ah						
202319	290241		Ras Haiyan						
1847159	290241	ar	رَأْس حَيَّان						
4469633	290241		Ra’s Ḩayyān						
202320	290242		Horat Unqa						
1847160	290242	ar	حَوْرَة عِنْقَا						
4469634	290242		Ḩawrat ‘Inqā						
202322	290243		Hawar Island						
202323	290243		Djezira Hawar						
202324	290243		Howar						
1847161	290243	ar	جَزِيرَة حَوَار						
4469635	290243		Jazīrat Ḩawār						
5645146	290243	link	https://en.wikipedia.org/wiki/Hawar						
11850723	290243		Hawār I						
202325	290244		Harta						
1847162	290244	ar	عَيْن هَرْتَة						
4469636	290244		‘Ayn Hartah						
1847163	290245	ar	هَرْبَدِيَّة						
4469637	290245		Harbadīyah						
202326	290246		Hamala Camp						
1847164	290246	ar	هَمَلَة عَمْپ						
4469638	290246		Hamalah Camp						
202327	290247		Hamad Town						
1847165	290247	ar	مَدِينَة حَمَد						
2922528	290247	link	https://en.wikipedia.org/wiki/Hamad_Town						
4469639	290247		Madīnat Ḩamad						
13729128	290247	unlc	BHMTH						
13729133	290247	unlc	BHTOW						
15772843	290247	wkdt	Q2088687						
202328	290248		Ras Hala Umm al Baidh						
202329	290248		Ras Halat Umm al Baidh						
1847166	290248	ar	رَأْس حَالَة أُمّ اَلْبَيْض						
4469640	290248		Ra’s Ḩālat Umm al Bayḑ						
202330	290249		Halat Umm al Baidh						
202331	290249		Um al-Baidh						
202332	290249		Halat As-Saud						
1847167	290249	ar	حَالَة أُمّ اَلْبَيْض						
4469641	290249		Ḩālat Umm al Bayḑ						
202333	290250		Hālat al-Salaṭa						
202334	290250		Halat As Suluta						
1847168	290250	ar	حَالَة اَلسُّلْطَة						
4469642	290250		Ḩālat as Sulţah						
202335	290251		Ḥālat Nu‘aym						
202336	290251		Naim						
202337	290251		Halat al Naim						
1847169	290251	ar	حَالَة اَلنَّعِيم						
4469643	290251		Ḩālat an Na‘īm						
202338	290252		Halat-at-Khulaifat						
202339	290252		Khulaffat						
202340	290252		Hālat-al-Khalaifāt						
202341	290252		Halat						
1847170	290252	ar	حَالَة اَلْخُلَيْفَات						
4469644	290252		Ḩālat al Khulayfāt						
202342	290253		Abū Māhir						
202343	290253		Halat Abu Māhur						
1847171	290253	ar	حَالَة أَبُو مَاهِر						
4469645	290253		Ḩālat Abū Māhir						
202344	290254		Ḩālāt						
1847172	290254	ar	حَالَة						
4469646	290254		Ḩālah						
202345	290255		Ḩālāt						
1847173	290255	ar	حَالَة						
4469647	290255		Ḩālah						
202346	290256		Ain al Halkim						
202347	290256		Ain el Hakim						
1847174	290256	ar	عَيْن اَلْحَكِيم						
4469648	290256		‘Ayn al Ḩakīm						
202348	290257		Fasht al Hadba						
1847175	290257	ar	فَشْت اَلْهَدْبَة						
4469649	290257		Fasht al Hadbah						
13521270	290258	link	https://en.wikipedia.org/wiki/Western_Region,_Bahrain						
13534747	290258		Al Minţaqah al Gharbīyah						
13534748	290258	ar	اَلْمِنْطَقَة اَلْغَرْبِيَّة						
13534749	290258		Western Region						
202350	290259		Farsiyah Bay						
1847177	290259	ar	دَوْحَة اَلْفَارِسِيَّة						
4469653	290259		Dawḩat al Fārisīyah						
1847178	290260	ar	دُمِسْتَان						
4469654	290260	ar	Dumistān						
11306952	290260	link	https://en.wikipedia.org/wiki/Dumistan						
202351	290261		Jabal ad Dukhkhān						
1847179	290261	ar	جَبَل اَلدُّخَان						
4469655	290261		Jabal ad Dukhān						
6895631	290261	link	https://en.wikipedia.org/wiki/Mountain_of_Smoke						
1847180	290262	ar	رَأْس دُوبَاس						
4469656	290262		Ra’s Dūbās						
202352	290263		Kassār Dīwān						
1847181	290263	ar	قَصَّار دِيوَان						
4469657	290263		Qaşşār Dīwān						
202353	290264		Fasht ad Dubal						
1847182	290264	ar	فَشْت اَلدِّيبَل						
4469658	290264		Fasht ad Dībal						
1847183	290265	ar	قُرَيْن اَلذِّرْبَان						
4469659	290265		Qurayn adh Dhirbān						
202354	290266		Ḩadd adh Dhi’b						
1847184	290266	ar	حَدّ الدِّيب						
4469660	290266		Ḩadd ad Dīb						
202355	290267		Ra’s ad Darr						
1847185	290267	ar	رَأْس اَلدَّيْر						
4469661	290267		Ra’s ad Dayr						
202356	290268		Ra’s Zurawen						
1847186	290268	ar	رَأْس دَوَارِن						
4469662	290268		Ra’s Dawārin						
202357	290269		Dār Kulaib						
202358	290269		Dar Chulaib						
1847187	290269	ar	دَار كُلَيْب						
4469663	290269		Dār Kulayb						
8095513	290269	link	https://en.wikipedia.org/wiki/Dar_Kulaib						
202359	290270		Bandar ad Dā						
1847188	290270	ar	بَنْدَر اَلدَّار						
4469664	290270		Bandar ad Dār						
1847189	290271	ar	فَشْت بُو ثَوْر						
4469665	290271		Fasht Bū Thawr						
202360	290272		Ras Busaitin						
1847190	290272	ar	رَأْس اَلْبُسَيْتِين						
4469666	290272		Ra’s al Busaytīn						
202361	290273		Busdad Island						
1847191	290273	ar	جُزُر بُو سَدَاد						
4469667	290273		Juzur Bū Sadād						
1847192	290274	ar	بُورِي						
4469668	290274	ar	Būrī						
202362	290275		Bū Quwwah						
202363	290275		Bukuwa						
1847193	290275	ar	بُو قُووَة						
4469669	290275		Bū Qūwah						
8099368	290275	link	https://en.wikipedia.org/wiki/Bu_Quwah						
202364	290276		Kala’at al Bakaishi						
1847194	290276	ar	قَلْعَة اَلْبُقَيْشِي						
4469670	290276		Qal‘at al Buqayshī						
1847195	290277	ar	نَخْل بُدَيِّعَة غَزَال						
4469671	290277		Nakhl Budayyi‘at Ghazāl						
202365	290278		Ras Budaia						
202366	290278		Rās Budaiya’						
1847196	290278	ar	رَأْس اَلْبُدَيِّع						
4469672	290278		Ra’s al Budayyi‘						
202367	290279		Budaia Bay						
1847197	290279	ar	دَوْحَة اَلْبُدَيِّع						
4469673	290279		Dawḩat al Budayyi‘						
202368	290280		Bu Ashira						
1847198	290280	ar	بُو عَشِيرَة						
4469674	290280		Bū ‘Ashīrah						
7058139	290280	link	https://en.wikipedia.org/wiki/Bu_Ashira						
202369	290281		Ras an Nannas						
1847199	290281	ar	رَأْس بِن أَنَس						
4469675	290281		Ra’s Bin Anas						
202370	290282		Bilād al-Kadīm						
1847200	290282	ar	بِلاَد اَلْقَدِيم						
4469676	290282		Bilād al Qadīm						
1847201	290283	ar	فَشْت بَرْطُفِي						
4469677	290283		Fasht Barţufī						
202371	290284		Ras al Bar						
202372	290284		Ra’s Ḩadd al Baḩrayn						
1847202	290284	ar	رَأْس اَلْبَرّ						
4469678	290284		Ra’s al Barr						
202373	290285		Barbura						
1847203	290285	ar	بَرْبُورَة						
4469679	290285		Barbūrah						
1847204	290286	ar	بَارْبَار						
4469680	290286	ar	Bārbār						
6900284	290286	link	https://en.wikipedia.org/wiki/Barbar%2C_Bahrain						
202374	290287		Jamra						
202375	290287		Jamrah						
1847205	290287	ar	بَنِي جَمْرَة						
4469681	290287		Banī Jamrah						
6905697	290287	link	https://en.wikipedia.org/wiki/Bani_Jamra						
202376	290288	en	Bahrain International Airport						
1847206	290288	ar	مَطَار اَلْبَحْرَيْن اَلدَّوْلِي						
1886662	290288	icao	OBBI						
1889359	290288	iata	BAH						
2922529	290288	link	https://en.wikipedia.org/wiki/Bahrain_International_Airport						
5892743	290288		Maţār al Baḩrayn ad Dawlī						
8513132	290288	fr	Aéroport international de Bahrain						
8513133	290288	wuu	巴林国际机场						
8513134	290288	ru	Международный аэропорт Бахрейн						
8513135	290288	ja	バーレーン国際空港						
8513136	290288	ko	바레인 국제공항						
11334712	290288	de	Flughafen Bahrain						
11334713	290288	es	Aeropuerto Internacional de Baréin						
11334714	290288	fr	Aéroport international de Bahreïn						
11334715	290288	it	Aeroporto Internazionale del Bahrein						
11334716	290288	nl	Internationale luchthaven van Bahrein						
11334717	290288	ar	مطار البحرين الدولي						
11334718	290288	ca	Aeroport Internacional de Bahrain						
11334719	290288	el	Διεθνές Αεροδρόμιο του Μπαχρέιν						
11334720	290288	eu	Bahraingo nazioarteko aireportua						
11334721	290288	fa	فرودگاه بین‌المللی بحرین						
11334722	290288	fi	Bahrainin kansainvälinen lentoasema						
11334723	290288	hi	बहरीन अन्तर्राष्ट्रीय विमानक्षेत्र						
11334724	290288	hr	Zračna luka Bahrein						
11334725	290288	hu	Bahreini nemzetközi repülőtér						
11334726	290288	id	Bandar Udara Internasional Bahrain						
11334727	290288	lt	Bahreino tarptautinis oro uostas						
11334728	290288	mr	बहरैन आंतरराष्ट्रीय विमानतळ						
11334729	290288	ms	Lapangan Terbang Antarabangsa Bahrain						
11334730	290288	tg	Фурудгоҳи Байн‌алмиллалии Баҳрайн						
11334731	290288	th	ท่าอากาศยานนานาชาติบาห์เรน						
11334732	290288	vi	Sân bay quốc tế Bahrain						
11334733	290288	pl	Port lotniczy Bahrajn						
11334734	290288	pt	Aeroporto Internacional do Bahrain						
11334735	290288	ru	Бахрейн						
11334736	290288	zh	巴林国际机场						
13729122	290288	unlc	BHBAH						
15798781	290288	wkdt	Q637639						
202377	290289		Jazā’ir al Baḩrayn						
202378	290289		Tylos						
202379	290289		Bahrein Islands						
202380	290289		Tyros						
1627117	290289	ca	Illes de Bahrain						
1847207	290289	ar	جَزَائِر اَلْبَحْرَيْن						
4469682	290289	en	Bahrain Islands						
1847208	290290	ar	حَدّ اَلْبَحْرَيْن						
4469683	290290		Ḩadd al Baḩrayn						
202381	290291		Dawlat al Baḩrayn						
202382	290291		Al Baḩrayn						
202383	290291		Shekdom of Bahrain						
202385	290291		Bahrein						
1559345	290291	af	Bahrein	1					
1559346	290291	am	ባህሬን	1					
1559347	290291	ar	البحرين	1					
1559348	290291	bg	Бахрейн	1					
1559349	290291	ca	Bahrain	1					
1559350	290291	cs	Bahrajn	1					
1559351	290291	cy	Bahrain	1					
1559352	290291	da	Bahrain	1					
1559353	290291	de	Bahrain	1					
1559354	290291	dz	བཧ་རེན						
1559355	290291	el	Μπαχρέιν	1					
1559356	290291	en	Bahrain	1					
1559357	290291	eo	Barejno	1					
1559359	290291	et	Bahrein	1					
1559360	290291	fa	بحرین	1					
1559361	290291	fi	Bahrain	1					
1559362	290291	fr	Bahreïn	1					
1559363	290291	ga	Bairéin	1					
1559364	290291	he	בחרין						
1559365	290291	hi	बाहरेन	1					
1559366	290291	hr	Bahrein	1					
1559367	290291	hu	Bahrain						
1559368	290291	hy	Բահրեյն	1					
1559369	290291	id	Bahrain	1					
1559370	290291	is	Barein	1					
1559371	290291	it	Bahrein	1					
1559372	290291	ja	バーレーン	1					
1559373	290291	ka	ბაჰრეინი	1					
1559374	290291	km	បារ៉ែន	1					
1559375	290291	ko	바레인	1					
1559376	290291	lo	ບາເລນ						
1559377	290291	lt	Bahreinas	1					
1559378	290291	lv	Bahreina	1					
1559379	290291	mk	Бахреин	1					
1559380	290291	ms	Bahrain	1					
1559381	290291	mt	Baħrajn						
1559382	290291	nb	Bahrain	1					
1559383	290291	nl	Bahrein	1					
1559384	290291	nn	Bahrain						
1559385	290291	pl	Bahrajn	1					
1559386	290291	pt	Bahrain	1					
1559387	290291	ro	Bahrain	1					
1559388	290291	ru	Бахрейн	1					
1559389	290291	sk	Bahrajn	1					
1559390	290291	sl	Bahrajn	1					
1559391	290291	so	Baxreyn	1					
1559392	290291	sq	Bahrein						
1559393	290291	sr	Бахреин	1					
1559394	290291	sv	Bahrain	1					
1559395	290291	ta	பஹ்ரைன்	1					
1559396	290291	th	บาห์เรน	1					
1559397	290291	tr	Bahreyn	1					
1559398	290291	uk	Бахрейн	1					
1559399	290291	vi	Ba-ren						
1559400	290291	zh	巴林	1					
1618403	290291	es	Bahréin	1	1				
1618404	290291	an	Bahrein						
1618405	290291	ast	Bahrein						
1618406	290291	bn	বাহরাইন	1					
1618407	290291	bs	Bahrein	1					
1618408	290291	eu	Bahrain	1					
1618409	290291	frp	fd						
1618410	290291	fy	Bachrein						
1618411	290291	gd	Bachrain	1					
1618412	290291	gl	Bahrain - البحرين						
1618413	290291	he	בחריין	1					
1618414	290291	hi	बहरीन	1					
1618415	290291	hu	Bahrein	1					
1618416	290291	ia	Bahrein						
1618417	290291	io	Bahrain						
1618418	290291	it	Bahrain	1	1				
1618419	290291	ks	बहरैन						
1618420	290291	ku	Behreyn	1					
1618421	290291	kw	Bahreyn						
1618422	290291	li	Bahrein						
1618423	290291	ml	ബഹ്റൈൻ						
1618424	290291	na	Bahrain						
1618425	290291	nds	Bahrain						
1618426	290291	no	Bahrain	1					
1618427	290291	oc	Bahrayn						
1618428	290291	os	Бахрейн						
1618429	290291	pam	Barein						
1618430	290291	ps	بحرین						
1618431	290291	pt	Bahrein						
1618432	290291	sa	बहरैन						
1618433	290291	scn	Bahrain						
1618434	290291	se	Bahrain	1					
1618435	290291	hbs	Bahrein						
1618436	290291	sq	Bahraini						
1618437	290291	tg	Баҳрайн	1					
1618438	290291	th	ประเทศบาห์เรน						
1618439	290291	tl	Barein						
1618440	290291	udm	Бахрейн						
1632756	290291	la	Baharina						
1632757	290291	ug	بەھرېيىن						
1847209	290291	ar	دَوْلَة اَلْبَحْرَيْن						
1894061	290291	arc	ܒܚܪܝܢ						
1894062	290291	ilo	Bahrayn						
1894063	290291	mk	Бахрaин						
1894064	290291	oc	Barein						
1894065	290291	vi	Bahrain	1					
1975415	290291	be	Бахрэйн	1					
1975416	290291	frp	Bahreyin						
1975417	290291	hsb	Bahrain						
1975418	290291	ilo	Bahrain						
1975419	290291	qu	Bahrayn						
1975420	290291	sw	Bahrain						
1975421	290291	ta	பகுரைன்						
1975422	290291	vo	Bahruäns						
1975423	290291	war	Barein						
2420268	290291	bn	বাহারিন	1					
2420269	290291	bo	བྷཱ་རེན།	1					
2420270	290291	ml	ബഹ്റൈന്‍	1					
2420271	290291	nb	Bahrein	1					
2920025	290291	link	https://en.wikipedia.org/wiki/Bahrain						
3047551	290291	link	https://ru.wikipedia.org/wiki/%D0%91%D0%B0%D1%85%D1%80%D0%B5%D0%B9%D0%BD						
4469684	290291	en	Kingdom of Bahrain						
4469685	290291		Mamlakat al Baḩrayn						
4469686	290291	ar	مملكة البحرين						
4469687	290291		State of Bahrain						
6141020	290291		دَوْلَة اَلْبَحْرَيْن						
7085179	290291	ak	Baren	1					
7085180	290291	az	Bahreyn	1					
7085181	290291	bm	Bareyini	1					
7085182	290291	br	Bahrein	1					
7085183	290291	ee	Bahrain nutome	1					
7085184	290291	ff	Bahreyn	1					
7085185	290291	fo	Bahrain	1					
7085186	290291	gl	Bahrein	1					
7085187	290291	gu	બેહરીન	1					
7085188	290291	ha	Baharan	1					
7085189	290291	ki	Bahareni	1					
7085190	290291	kk	Бахрейн	1					
7085191	290291	kl	Bahrain	1					
7085192	290291	kn	ಬಹರೈನ್	1					
7085193	290291	ku	بەحرەین	1					
7085194	290291	lg	Baareeni	1					
7085195	290291	ln	Bahrɛnɛ	1					
7085196	290291	lu	Bahrene	1					
7085197	290291	mg	Bahrain	1					
7085198	290291	mr	बहारीन	1					
7085199	290291	my	ဘာရိန်း	1					
7085200	290291	nd	Bhahareni	1					
7085201	290291	ne	बाह्रेन	1					
7085202	290291	oc	Bahrain	1					
7085203	290291	or	ବାହାରିନ୍	1					
7085204	290291	rm	Bahrain	1					
7085205	290291	rn	Bahareyini	1					
7085206	290291	sg	Bahrâina	1					
7085207	290291	si	බහරේන්	1					
7085208	290291	sn	Bahareni	1					
7085209	290291	sw	Bahareni	1					
7085210	290291	te	బహరేన్	1					
7085211	290291	ti	ባህሬን	1					
7085212	290291	to	Paleini	1					
7085213	290291	ur	بحرین	1					
7085214	290291	yo	Orílẹ́ède Báránì	1					
7085215	290291	zu	i-Bahrain	1					
7948668	290291	iata	BAH						
16710819	290291	unlc	BHBAH						
16925675	290291	zh-Hant	巴林	1					
16926607	290291	as	বাহৰেইন	1					
16926608	290291	az	Bəhreyn	1					
16926609	290291	ce	Бахрейн	1					
16926610	290291	dz	བྷ་རེན	1					
16926611	290291	es	Baréin	1					
16926612	290291	fo	Barein	1					
16926613	290291	fy	Bahrein	1					
16926614	290291	gl	Bahrain	1					
16926615	290291	ig	Bahrain	1					
16926616	290291	jv	Bahrain	1					
16926617	290291	kn	ಬಹ್ರೇನ್	1					
16926618	290291	ks	بحریٖن	1					
16926619	290291	ky	Бахрейн	1					
16926620	290291	lb	Bahrain	1					
16926621	290291	lo	ບາເຣນ	1					
16926622	290291	ml	ബഹ്റിൻ	1					
16926623	290291	mn	Бахрейн	1					
16926624	290291	mt	il-Bahrain	1					
16926625	290291	ne	बहराइन	1					
16926626	290291	pa	ਬਹਿਰੀਨ	1					
16926627	290291	ps	بحرين	1					
16926628	290291	pt	Barein	1					
16926629	290291	qu	Baréin	1					
16926630	290291	sd	بحرين	1					
16926631	290291	sq	Bahrejn	1					
16926632	290291	te	బహ్రెయిన్	1					
16926633	290291	ti	ባሕሬን	1					
16926634	290291	tk	Bahreýn	1					
16926635	290291	tt	Бәхрәйн	1					
16926636	290291	ug	بەھرەين	1					
16926637	290291	uz	Bahrayn	1					
16926638	290291	wo	Bahreyin	1					
16926639	290291	yo	Báránì	1					
202386	290292		Khalīj al Baḩrayn						
202387	290292		Gulf of Bahrein						
202388	290292		Gulf of Baḩrayn						
1847210	290292	ar	خَلِيج اَلْبَحْرَيْن						
4469688	290292	en	Gulf of Bahrain						
6998203	290292	en	Gulf of Bahrein						
8246281	290292		Khalīj al Baḥrayn						
8246282	290292		Gulf of Baḥrayn						
8675257	290292	link	https://en.wikipedia.org/wiki/Gulf_of_Bahrain						
11612795	290292	es	Golfo de Baréin						
11612796	290292	fr	Golfe de Bahreïn						
11612797	290292	it	Golfo del Bahrein						
11612798	290292	nl	Golf van Bahrein						
11612799	290292	ar	خليج البحرين						
11612800	290292	cs	Bahrajnský záliv						
11612801	290292	fa	خلیج بحرین						
11612802	290292	he	מפרץ בחריין						
11612803	290292	hr	Bahreinski zaljev						
11612804	290292	lt	Bahreino įlanka						
11612805	290292	nn	Bahrainbukta						
11612806	290292	hbs	Bahreinski zaljev						
11612807	290292	sk	Bahrajnský záliv						
11612808	290292	su	Teluk Bahrain						
11612809	290292	ur	خلیج بحرین						
11612810	290292	pl	Zatoka Bahrajnu						
11612811	290292	pt	Golfo do Bahrain						
202390	290293		Khor al Bab						
1847211	290293	ar	خَوْر اَلْبَاب						
4469689	290293		Khawr al Bāb						
202391	290294		Zinj						
1847212	290294	ar	اَلزِّنْج						
2922530	290294	link	https://en.wikipedia.org/wiki/Zinj%2C_Bahrain						
4469690	290294		Az Zinj						
202392	290295		Zimmah						
202393	290295		Zimma						
1847213	290295	ar	اَلزِّمَّة						
4469691	290295		Az Zimmah						
202394	290296		Al-Zallāk						
202395	290296		Zellaq						
202396	290296		Zelzaq						
202397	290296		Zallaq						
1847214	290296	ar	اَلزَّلاَّق						
2922531	290296	link	https://en.wikipedia.org/wiki/Zallaq						
4469692	290296		Az Zallāq						
14996156	290296	wkdt	Q4117781						
202398	290297		Umm ash-Shujaira						
202399	290297		Uum ash Shiyaira						
202400	290297		Umm Shiyara						
202401	290297		El Azil						
202402	290297		Umm ash Shiyaira						
202403	290297		Jazīrat Umm ash Shujayrah						
1847215	290297	ar	جَزِيرَة اَلْعَزْل						
4469693	290297		Jazīrat al ‘Azl						
202404	290298		Ain al-Dar						
202405	290298		‘An ad Dār						
202406	290298		’Ain-ad-Dār						
1847216	290298	ar	عَيْن اَلدَّار						
4469694	290298		‘Ayn ad Dār						
278	290299		Oil City						
202407	290299		Al ‘Awālī						
202408	290299		Bapco						
202409	290299		Al Chirabia						
202410	290299		Kirabad						
202411	290299		Al Ghiraibat						
1847217	290299	ar	عَوَالِي						
4469695	290299	ar	‘Awālī						
202412	290300		Salá						
1847218	290300	ar	اَلسُّهَيْلَة						
4469696	290300		As Suhaylah						
202413	290301		Sājah						
1847219	290301	ar	اَلسَّايَة						
4469697	290301		As Sāyah						
1847220	290302	ar	اَلصَّالِحِيَّة						
4469698	290302		Aş Şāliḩīyah						
202414	290303		Sakhir						
1847221	290303	ar	اَلصَّخِير						
4469699	290303		Aş Şakhīr						
202415	290304		Al ‘Askar						
1847222	290304	ar	عَسْكَر						
4469700	290304		‘Askar						
202416	290305		Ain Sharaiba						
202417	290305		Sharaibah						
1847223	290305	ar	اَلشُّرَيْبَة						
4469701	290305		Ash Shuraybah						
202418	290306		Al-Shākhūra						
202419	290306		Shakhurq						
202420	290306		Shakhura						
202421	290306		Shākhūrah						
1847224	290306	ar	اَلشَّاخُورَة						
4469702	290306		Ash Shākhūrah						
8085313	290306	link	https://en.wikipedia.org/wiki/Shakhura						
14956512	290306	wkdt	Q6408267						
1847225	290307	ar	اَلشَّبَك						
4469703	290307		Ash Shabak						
202422	290308		Ruq‘ah						
202423	290308		Ruka’a						
202424	290308		Ruqa’ah						
1847226	290308	ar	اَلرُّقْعَة						
4469704	290308		Ar Ruq‘ah						
202425	290309		Al-Rumaythā’						
202426	290309		Rumaitha						
202427	290309		Rumayz̧ah						
202428	290309		Rumaithah						
202429	290309		Rumaidha						
202430	290309		Rumaidhah						
202431	290309		Ar Rumaythā						
1847227	290309	ar	اَلرُّمَيْثَة						
4469705	290309		Ar Rumaythah						
13450172	290309	ar	الرميثا						
202432	290310		Ar Rumamin						
1847228	290310	ar	اَلرُّمَانُوم						
4469706	290310	ar	Ar Rumānūm						
202433	290311		Rifa’ Ash Sharqi						
202434	290311		Al-Rifā‘ al-Shārki						
202435	290311		Rifa‘a Ash Sharqi						
1847229	290311	ar	اَلرِّفَاع اَلشَّرْقِي						
4469707	290311		Ar Rifā‘ ash Sharqī						
202436	290312		Rifa’a Ash Shamal						
202437	290312		Rifā‘ ash Shamāl						
202438	290312		Al-Rifā‘ al-Shamālī						
202439	290312		North Rifā‘						
1847230	290312	ar	اَلرِّفَاع اَلشَّمَالِي						
4469708	290312		Ar Rifā‘ ash Shamālī						
202440	290313		West Rifā’ Camp						
202441	290313		Ar Rifā’ Camp						
202442	290313		Rifa’a Camp						
1847231	290313	ar	اَلرِّفَاع اَلْغَرْبِي عَمْپ						
4469709	290313		Ar Rifā‘ al Gharbī Camp						
13521269	290314	link	https://en.wikipedia.org/wiki/Rifa_and_Southern_Region,_Bahrain						
202444	290315		Al-Rifā‘ al Gharbī						
202445	290315		Rifaa Al Gharbi						
202446	290315		West Rifā‘						
202447	290315		Rifā‘ al Qiblī						
202448	290315		Rifā‘ al Gharbī						
1847233	290315	ar	اَلرِّفَاع اَلْغَرْبِي						
4469713	290315		Ar Rifā‘ al Gharbī						
202449	290316		Sār						
1847234	290316	ar	عَرَاد						
4469714	290316	ar	‘Arād						
202452	290319		Nuwaydirāt						
202453	290319		Nuwaidrat						
202454	290319		Nuwaidirat						
1847236	290319	ar	اَلنُّوَيْدِرَات						
4469715	290319		An Nuwaydirāt						
7051050	290319	link	https://en.wikipedia.org/wiki/Nuwaidrat						
15254266	290319	wkdt	Q3299616						
202455	290320		Na’aijā						
1847237	290320	ar	اَلنُّعَيْجَات						
4469716	290320		An Nu‘ayjāt						
1847238	290321	ar	اَلنَّاصِرِيَّة						
4469717	290321		An Nāşirīyah						
202456	290322		Wasmiya						
202457	290322		Wasmīyah						
1847239	290322	ar	اَلْوَسْمِيَّة						
4469718	290322		Al Wasmīyah						
202458	290323		Kuriya						
202459	290323		Qurayyah						
202460	290323		Quraiyah						
202461	290323		Kuraiya						
1847240	290323	ar	اَلْقُرَيَّة						
4469719	290323		Al Qurayyah						
202462	290324		Kariya						
202463	290324		Qarya						
202464	290324		Qariya						
202465	290324		Qurayyah						
202466	290324		Qaryah						
202467	290324		Quryah						
1847241	290324	ar	اَلْقَرْيَة						
4469720	290324		Al Qaryah						
202468	290325		Kuriya						
1847242	290325	ar	اَلْقَرْيَة						
4469721	290325		Al Qaryah						
202469	290326		Manāmah Fort						
202470	290326		Manama Fort						
202471	290326		Qal’at-ad-Dīwān						
1847243	290326	ar	اَلْقَلْعَة						
4469722	290326		Al Qal‘ah						
202472	290327		Qadam						
1847244	290327	ar	اَلْقَدَم						
4469723	290327		Al Qadam						
8694937	290327	link	https://en.wikipedia.org/wiki/Al_Qadam						
15268537	290327	wkdt	Q4704626						
202473	290328		Muwailaha						
202474	290328		Muwailghah						
1847245	290328	ar	اَلْمُوَيْلِغَة						
4469724	290328		Al Muwaylighah						
1847246	290329	ar	اَلْمُعْتَرِض						
4469725	290329		Al Mu‘tariḑ						
202475	290330		Musalla						
1847247	290330	ar	اَلْمُصَلَّى						
4469726	290330		Al Muşallá						
8681575	290330	link	https://en.wikipedia.org/wiki/Al_Musalla						
202476	290331		Magsha						
202477	290331		Muqshā’						
1847248	290331	ar	مقشع اليمن						
4469727	290331	ar	Mugsha						
202478	290332		Muharrak						
202479	290332		Muhurraq						
202480	290332		Muharraq Town						
202481	290332		Moharek						
202482	290332		Muharraq						
202483	290332		Al-Muḥarrak						
1847249	290332	ar	اَلْمُحَرَّق						
1926594	290332	pl	Al Muharrak						
1926595	290332	de	Muharraq						
1926596	290332	en	Al Muharraq						
1926597	290332	ar	محرق						
1926598	290332	da	Al-Muharraq						
1926599	290332	pt	Al Muharraq						
3037852	290332	ru	Аль-Мухаррак						
4469728	290332		Al Muḩarraq						
8331108	290332	link	https://en.wikipedia.org/wiki/Al_Muharraq						
13729123	290332	unlc	BHGBQ						
16360374	290332	de	al-Muharraq						
202484	290333	en	Muharraq						
1847250	290333	ar	اَلْمُحَرَّق						
2185739	290333		Al Muḩarraq	1	1				
2299402	290333	no	Muharraq						
3332252	290333	link	https://en.wikipedia.org/wiki/Muharraq_Governorate						
9393337	290333	es	Muharraq						
9393338	290333	fr	Gouvernorat de Muharraq						
9393339	290333	it	Governatorato di Muharraq						
9393340	290333	ar	محافظة المحرق						
9393341	290333	bg	Мухарак						
9393342	290333	eo	Gubernio Muharrako						
9393343	290333	fa	استان محرق						
9393344	290333	hu	Muharrak kormányzóság						
9393345	290333	id	Kegubernuran Al Muharraq						
9393346	290333	ko	무하라크 주						
9393347	290333	ms	Pentadbiran Al Muharraq						
9393348	290333	no	Muharraq guvernement						
9393349	290333	su	Kagubernuran Muharraq						
9393350	290333	pt	Província de Muharraq						
9393351	290333	zh	穆哈拉格省						
11376286	290333	ca	Governació dal-Muharraq						
11376287	290333	lt	Muharako muchafaza						
11376288	290333	ps	محافظه محرق						
11376289	290333	ur	محافظہ محرق						
11376290	290333	ru	Мухаррак						
11376291	290333	sv	Muharraqguvernementet						
202485	290334		Umm Sabaan Island						
202486	290334		Umm as Subban						
202487	290334		Jazīrat ar Rakā						
202488	290334		Umm aş Şabbān						
202489	290334		Umm-al-Ṣubbān						
202490	290334		Jazīrat ar Raqah						
202491	290334		Umm Saban						
202492	290334		Raka Island						
1847251	290334	ar	اَلْمُحَمَّدِيَّة						
4469729	290334		Al Muḩammadīyah						
7162832	290334	link	https://en.wikipedia.org/wiki/Umm_as_Sabaan						
1847252	290335	ar	اَلْمَرْخ						
4469730	290335		Al Markh						
202493	290336		Markh						
1847253	290336	ar	اَلْمَرْخ						
4469731	290336		Al Markh						
7076227	290336	link	https://en.wikipedia.org/wiki/Al_Markh						
1847254	290337	ar	اَلْمَقْطَع						
4469732	290337		Al Maqţa‘						
202494	290338		Al Manāmah Harbour						
202495	290338		Bahrayn Harbor						
202496	290338		Manāma Harbour						
202497	290338		Bahrain Harbour						
202498	290338		Bahrein Harbour						
1847255	290338	ar	مِينَاء اَلْمَنَامَة						
4469733	290338		Mīnā’ al Manāmah						
13521271	290339	link	https://en.wikipedia.org/wiki/Manama						
13534750	290339		Al Manāmah						
13534751	290339	ar	اَلْمَنَامَة						
13534752	290339		Manama						
202500	290340		Al Manāmah						
202501	290340		Manameh						
202502	290340		Menama						
202503	290340		Al Manāma						
1565794	290340	eo	Manamo						
1595589	290340	de	Manama						
1595590	290340	en	Manama						
1595591	290340	es	Manama						
1595592	290340	als	Manama						
1595593	290340	ang	Manama						
1595594	290340	ar	المنامة						
1595595	290340	bg	Манама						
1595596	290340	ca	Al-Manama						
1595597	290340	cs	Manáma						
1595598	290340	da	Manama						
1595599	290340	fi	Manama						
1595600	290340	fr	Manama						
1595601	290340	fy	Manama						
1595602	290340	he	מנאמה						
1595603	290340	hr	Manama						
1595604	290340	id	Al-Manamah						
1595605	290340	io	Al Manamah						
1595606	290340	it	Manama						
1595607	290340	ja	マナーマ						
1595608	290340	ko	마나마						
1595609	290340	la	Manama						
1595610	290340	lt	Manama						
1595611	290340	ms	Manama						
1595612	290340	nl	Manamah						
1595613	290340	no	Manama						
1595614	290340	os	Манамæ						
1595615	290340	pl	Manama						
1595616	290340	pt	Manama						
1595617	290340	ro	Manama						
1595618	290340	ru	Манама						
1595619	290340	scn	Manama						
1595620	290340	hbs	Manama						
1595621	290340	sk	Manáma						
1595622	290340	sr	Манама						
1595623	290340	sv	Manama						
1595624	290340	uk	Манама						
1595625	290340	zh-CN	麦纳麦						
1633387	290340	bs	Manama						
1633388	290340	tr	Manama						
1649566	290340	el	Μανάμα						
1847257	290340	ar	اَلْمَنَامَة						
1895754	290340	bn	মানামা						
1895755	290340	hy	Մանամա						
1895756	290340	tg	Манама						
1895757	290340	vo	Mänamä						
1981820	290340	am	ማናማ						
1981821	290340	frp	Manama						
2922532	290340	link	https://en.wikipedia.org/wiki/Manama						
3047553	290340	link	https://ru.wikipedia.org/wiki/%D0%9C%D0%B0%D0%BD%D0%B0%D0%BC%D0%B0						
8065838	290340	iata	WGF						
8290411	290340	th	มานามา						
8290412	290340	nah	Manamah						
8290413	290340	hu	Manáma						
8290414	290340	bo	མ་ན་མ།						
8290415	290340	be	Манама						
8290416	290340	mk	Манама						
8290417	290340	su	Al-Manamah						
8290418	290340	ur	منامہ						
8290419	290340	ta	மனாமா						
8290420	290340	mr	मनामा						
8290421	290340	mn	Манама						
8290422	290340	vep	Manam						
8290423	290340	arz	المنامه						
8290424	290340	ce	Манама						
8290425	290340	ace	Al-Manamah						
8290426	290340	ckb	مەنامە						
8290427	290340	pnb	منامہ						
8290428	290340	ka	მანამა						
8290429	290340	kk	Манама						
8290430	290340	pa	ਮਨਾਮਾ						
8290431	290340	lv	Manāma						
8290432	290340	et	Al-Manāmah						
8290433	290340	fa	منامه						
8290434	290340	or	ମାନାମା						
8290435	290340	zh	麦纳麦						
8703158	290340	diq	Mename						
8703159	290340	pih	Manaama						
8703160	290340	yue	麥納瑪						
11328474	290340	ky	Манама						
11328475	290340	ml	മനാമ						
13729121	290340	unlc	BHAMH						
202504	290341		Al Maţallah						
202505	290341		Al Mutallah						
202506	290341		Muţallah						
202507	290341		Al Mumaţţalah						
202508	290341		Al M’ţţalah						
202509	290341		Mattala						
1847258	290341	ar	اَلْمَمْطَلَة						
4469737	290341		Al Mamţalah						
202510	290342		Al-Mālikiyya						
202511	290342		Mālikīyah						
202512	290342		Malichiya						
1847259	290342	ar	اَلْمَالِكِيَّة						
4469738	290342		Al Mālikīyah						
202513	290343		Makhrūq						
202514	290343		Al Maḩrūq						
1847260	290343	ar	اَلْمَخْرُوق						
4469739	290343		Al Makhrūq						
202515	290344		Mahuz						
1847261	290344	ar	اَلْمَاحُوز						
4469740	290344	ar	Al Māḩūz						
202516	290345		Ma’amir						
1847262	290345	ar	اَلْمَعَامِير						
4469741	290345		Al Ma‘āmīr						
13729120	290345	unlc	BHAMA						
202517	290346		Al-Khāridjiyya						
202518	290346		Kharijiya						
202519	290346		Khārijīyah						
1847263	290346	ar	اَلْخَارِجِيَّة						
4469742	290346		Al Khārijīyah						
202520	290347		Al-Djufayr						
202521	290347		Jufair						
202522	290347		Jafair						
1847264	290347	ar	اَلْجُفَيْر						
4469743	290347		Al Jufayr						
202523	290348		Jabailat						
202524	290348		Jubailāt						
1847265	290348	ar	اَلْجُبَيْلاَت						
4469744	290348		Al Jubaylāt						
1847266	290349	ar	اَلْجِلْعَة						
4469745	290349		Al Jil‘ah						
202525	290350		Jazāir						
202526	290350		Jazayir						
1847267	290350	ar	اَلْجَزَائِر						
4469746	290350		Al Jazā’ir						
202527	290351		Al-Djasra						
202528	290351		Jesera						
202529	290351		Jasra						
202530	290351		Jasrah						
1847268	290351	ar	اَلْجَسْرَة						
4469747	290351		Al Jasrah						
8084794	290351	link	https://en.wikipedia.org/wiki/Jasra						
15480687	290351	wkdt	Q6164132						
202531	290352		Janābīyah						
202532	290352		Janabiya						
1847269	290352	ar	اَلْجَنَبِيَّة						
4469748	290352		Al Janabīyah						
8070745	290352	link	https://en.wikipedia.org/wiki/Janabiyah						
202533	290353		Al Jabalah						
202534	290353		Jabalah						
202535	290353		Jabala						
1847270	290353	ar	جَبَلَة اَلْبُرْهَامَة						
4469749	290353		Jabalat al Burhāmah						
1847271	290354	ar	عَالِي						
4469750	290354	ar	‘Ālī						
1847272	290355	ar	اَلْحُول						
4469751	290355	ar	Al Ḩūl						
202536	290356		Hujair						
202537	290356		Husair						
1847273	290356	ar	اَلْهُجَيْر						
4469752	290356		Al Hujayr						
202538	290357		El Hayiya Island						
4469753	290357		Al Hayiya Island						
202539	290358		Jabal al Hassay						
1847274	290358	ar	جَبَل اَلْحَسِي						
4469754	290358		Jabal al Ḩasī						
202540	290359		Hamalah						
202541	290359		Al-Hamla						
202542	290359		Hamala						
1847275	290359	ar	اَلْهَمَلَة						
4469755	290359		Al Hamalah						
16172054	290359	link	https://en.wikipedia.org/wiki/Hamala%2C_Bahrain						
202543	290360		Hajar						
1847276	290360	ar	اَلْحَجَر						
4469756	290360		Al Ḩajar						
13729119	290360	unlc	BHALA						
202544	290361		Ḩafīrah						
202545	290361		Hafira						
202546	290361		Hafina						
1847277	290361	ar	اَلْحَفِيرَة						
4469757	290361		Al Ḩafīrah						
202548	290363		Hidd						
202549	290363		Al Ḩidd						
202550	290363		Hadd						
1847279	290363	ar	اَلْحَدّ						
2922534	290363	link	https://en.wikipedia.org/wiki/Al_Hidd						
4469761	290363		Al Ḩadd						
13729118	290363	unlc	BHAHD						
202551	290364		Ghurayfah						
202552	290364	en	Ghuraifa	1					
202553	290364		Ghuraifah						
202554	290364		Gharaifa						
1847280	290364	ar	اَلْغُرَيْفَة						
4469762	290364		Al Ghurayfah						
7078534	290364	link	https://en.wikipedia.org/wiki/Ghuraifa						
15440851	290364	wkdt	Q12190722						
202555	290365		Al Ghaina						
1847281	290365	ar	اَلْغَيْنَة						
4469763	290365		Al Ghaynah						
202556	290366		Busaitin						
202557	290366		Basātīn						
1847282	290366	ar	اَلْبُسَيْتِين						
4469764	290366		Al Busaytīn						
1847283	290367	ar	اَلْبُهَيْر						
4469765	290367		Al Buhayr						
202558	290368		Badaiya‘a						
202559	290368		Al Buday‘						
202560	290368		Budaia						
202561	290368		Budaiya						
202562	290368		Budayya‘						
202563	290368		Buday‘ah						
1847284	290368	ar	اَلْبُدَيِّع						
4469766	290368		Al Budayyi‘						
8096497	290368	link	https://en.wikipedia.org/wiki/Budaiya						
15589467	290368	wkdt	Q2320810						
202564	290369		Bid‘ah						
1847285	290369	ar	اَلْبِدْعَة						
4469767	290369		Al Bid‘ah						
202565	290370		Baijawīyah						
1847286	290370	ar	اَلْبَجَوِيَّة						
4469768	290370		Al Bajawīyah						
202566	290371		Awali						
202567	290371		Bahrain						
202568	290371		Bahrein						
1847287	290371	ar	اَلْبَحْرَيْن						
4469769	290371		Al Baḩrayn						
202569	290372		Al Baḩrayn						
202570	290372		Awāl						
202571	290372		Al Baḩrain						
202572	290372		Bahrayn						
202574	290372		Bahrein						
202575	290372		Bahrain						
202576	290372		Bahrein Island						
1627116	290372	ca	Illa de Bahrain						
1847288	290372	ar	اَلْبَحْرَيْن						
4469770	290372	en	Bahrain Island						
7512782	290372	link	https://en.wikipedia.org/wiki/Bahrain_Island						
11657825	290372	es	Isla de Baréin						
11657826	290372	fr	Île de Bahreïn						
11657827	290372	ar	جزيرة البحرين						
11657828	290372	et	Bahreini saar						
11657829	290372	lt	Bahreino sala						
1847289	290373	ar	اَلأَوْبَيِذ						
4469771	290373		Al Awbayidh						
202577	290374		’Aqārīyah						
202578	290374		Akariya						
202579	290374		‘Akarīyah						
1847290	290374	ar	اَلْعَقَارِيَّة						
4469772	290374		Al ‘Aqārīyah						
202580	290375		‘Amur						
202581	290375		Amar						
1847291	290375	ar	اَلْعَمَر						
4469773	290375		Al ‘Amar						
13450173	290375		Al ‘Umar						
202582	290376		Ikur						
202583	290376		Al ‘Aqur						
202584	290376		’Aqur						
202585	290376		Al ‘Aqr						
202586	290376		Al ‘Akur						
1847292	290376	ar	اَلْعَكْر						
4469774	290376	ar	Al ‘Akr						
1847293	290377	ar	اَلْعَدْلِيَّة						
4469775	290377		Al ‘Adlīyah						
202587	290378		‘Adā’im						
1847294	290378	ar	اَلْعَدَائِم						
4469776	290378	ar	Al ‘Adā’im						
202588	290379		Kawkab ‘Aqr						
1847295	290379	ar	كَوْكَب اَلْعَكْر						
4469777	290379		Kawkab al ‘Akr						
202589	290380		Ras al Ykur						
202590	290380		Ra’s al ‘Aqr						
202591	290380		Ras al Ikur						
1847296	290380	ar	رَأْس اَلْعَكْر						
4469778	290380		Ra’s al ‘Akr						
202592	290381		Jabalat Ajīrah						
202593	290381		Ajīrah						
202594	290381		Ajaira Island						
1847297	290381	ar	جَزِيرَة عَجِيرَة						
4469779	290381		Jazīrat ‘Ajīrah						
202595	290382		Virgins’ Pool						
202596	290382		Adari Pool						
202597	290382		The Turquoise Pool						
202598	290382		‘Adārī						
202599	290382		Adori Spring						
1847298	290382	ar	عَيْن عَذَارِي						
4469780	290382	ar	‘Ayn ‘Adhārī						
6998204	290382	en	The Turquoise Pool						
202600	290383		Adhom						
1847299	290383	ar	فَشْت أَذَم						
4469781	290383		Fasht Adham						
202601	290384		Dār al Manādīl						
202602	290384		Dur						
1847300	290384	ar	اَلدُّور						
4469782	290384	ar	Ad Dūr						
202603	290385		Diraz						
1847301	290385	ar	اَلدِّرَاز						
2922535	290385	link	https://en.wikipedia.org/wiki/Diraz						
4469783	290385	ar	Ad Dirāz						
15718118	290385	wkdt	Q737172						
202604	290386		Dair-ar-Rāhib						
202605	290386		Dair						
202606	290386		Dayr ar Rāhib						
1847302	290386	ar	اَلدَّيْر						
4469784	290386		Ad Dayr						
202607	290387		Ḩayr al ‘Azālah						
202608	290387		Adala Bank						
202609	290387		‘Adālah						
202610	290387		Hayr al Adhalah						
202611	290387		Hair al Adhalah						
1847303	290387	ar	حَيْر اَلْعَدَالَة						
5827084	290387		Ḩayr al ‘Adālah						
202612	290388		Abu Zaidān						
1847304	290388	ar	عَيْن أَبُو زَيْدَان						
4469785	290388		‘Ayn Abū Zaydān						
1847305	290389	ar	رَأْس أَبُو صُبْح						
4469786	290389		Ra’s Abū Şubḩ						
202613	290390		Bu Shanin						
202614	290390		Jazīrat Abū Shāhīn						
1847306	290390	ar	قَصَّار أَبُو شَاهِين						
4469787	290390		Qaşşār Abū Shāhīn						
202615	290391		Abu Shaiban						
1847307	290391	ar	أَبُو صَيْدَان						
4469788	290391		Abū Şaydān						
202616	290392		Abu Saibi’						
1847308	290392	ar	أَبُو صَيْبِع						
4469789	290392		Abū Şaybi‘						
202617	290393		Abu Māhur						
1847309	290393	ar	أَبُو مَاهِر						
4469790	290393	ar	Abū Māhir						
1847310	290394	ar	رَأْس أَبُو جَرْجُور						
4469791	290394		Ra’s Abū Jarjūr						
1847311	290395	ar	أَبُو بَهَام						
4469792	290395		Abū Bahām						
8676172	290395	link	https://en.wikipedia.org/wiki/Abu_Baham						
202618	290396		Moj						
202619	290396		Ras Abul Moj						
1847312	290396	ar	رَأْس أَبُو اَلْمَوْج						
4469793	290396		Ra’s Abū al Mawj						
1847313	290397	ar	أَبُو اَلْعَوْسَج						
4469794	290397		Abū al ‘Awsaj						
1847314	290398	ar	عَيْن عَبْد اَللَّٰه						
4469795	290398	ar	‘Ayn ‘Abd Allāh						
267208	385036		Sahlat al Fūqīyah						
267209	385036		Sihlatal Fukiya						
1853673	385036	ar	اَلسَّهْلَة اَلْفَوْقِيَّة						
4714663	385036		As Sahlah al Fawqīyah						
267210	385037		Sahlat-as-Saghīrah						
267211	385037		Sahlat al Ḩadrīyah						
267212	385037		Sahlat al ‘Awdah						
267213	385037		Sihlatal Hadriya						
267214	385037		Sahlat-al-‘Audah						
1853674	385037	ar	اَلسَّهْلَة اَلْحَدْرِيَّة						
4714664	385037		As Sahlat al Ḩadrīyah						
267215	385038		Ar Rifa						
1853675	385038	ar	اَلرِّفَاع						
5804416	385038	link	https://en.wikipedia.org/wiki/Riffa						
8041336	385038		Riffa						
8415948	385038	ar	Ar Rifā‘						
13729130	385038	unlc	BHRIF						
14996205	385038	wkdt	Q1771398						
1853676	385039	ar	جَامِعَة اَلْخَلِيج اَلْعَرَبِي						
4714669	385039		Jāmi‘at al Khalīj al ‘Arabī						
1853679	385042	ar	اَلْقَلْعَة						
4714672	385042		Al Qal‘ah						
1853680	385043	ar	اَلْعَرِين						
4714675	385043	ar	Al ‘Arīn						
1856337	392735	ar	أَوَل						
2923383	392735	link	https://en.wikipedia.org/wiki/Awali						
4754575	392735		Awali						
13640229	392735	en	Sakhir Airbase						
13640230	392735		Awwal						
1856338	392751	ar	حَيْر اَلرُّقْعَة						
4754589	392751		Ḩayr ar Ruq‘ah						
1856339	392830	ar	البين الصغير						
4754694	392830		Al Bayn aş Şaghīrah						
13196350	392830		Al Baynah aş Şaghīrah						
13196351	392830	ar	البينة الصغيرة						
13196352	392830		Al Baynah Al Saghirah						
13196353	392830		Al Bayn aş Şaghīr						
4754695	392831		Qit‘at Jarādah						
8050174	392831		قطعة جرادة						
1859470	412518	ar	زَلاَقَة اَلسُّفُن						
4786163	412518		Zalāqat as Sufun						
1859471	412519	ar	ثَلِب						
4786166	412519		Thalib						
7194060	6942066	link	https://en.wikipedia.org/wiki/Qal%27at_al-Bahrain						
13333390	6942066	en	Bahrain Fort						
13333391	6942066	en	Fort of Bahrain						
13333392	6942066	en	Portugal Fort				1		
13333393	6942066	en	Portuguese Fort				1		
3075834	7090954		Muḩāfaz̧at al ‘Āşimah	1					
3332250	7090954	link	https://en.wikipedia.org/wiki/Capital_Governorate_(Bahrain)						
7756383	7090954	en	Capital			1			
8513263	7090954	en	Manama	1					
8513752	7090954	de	Manama	1					
11213825	7090954	ar	محافظة العاصمة						
11712567	7090954	fr	Manama						
3075837	7090972		al Muḩāfaz̧ah Al Janūbīyah						
3332251	7090972	link	https://en.wikipedia.org/wiki/Al_Jan%C5%ABb%C4%AByah_Governorate_%28Bahrain%29						
11213830	7090972	ar	المحافظة الجنوبية						
11213831	7090972	en	Southern Governorate						
11213832	7090972	link	https://en.wikipedia.org/wiki/Southern_Governorate						
11213833	7090972		al-Muhafazah al-Janobiyah						
15343225	7090972	wkdt	Q838532						
3075841	7090973		al Muḩāfaz̧ah Al Wusţá						
3332253	7090973	link	https://en.wikipedia.org/wiki/Central_Governorate_%28Bahrain%29						
11213826	7090973	ar	المحافظة الوسطى						
11213827	7090973	en	Central Governorate						
14863740	7090973	wkdt	Q856539						
3075838	7090974		al Muḩāfaz̧ah Ash Shamālīyah						
3332254	7090974	link	https://en.wikipedia.org/wiki/Northern_Governorate						
7756384	7090974	en	Northern			1			
9389570	7090974	es	Norte						
9389571	7090974	fr	Gouvernorat septentrional						
9389572	7090974	it	Governatorato Settentrionale						
9389573	7090974	nl	Noord						
9389575	7090974	ar	الشمالية						
9389576	7090974	bg	Северна провинция						
9389577	7090974	fa	شمالیه						
9389578	7090974	hu	Északi kormányzóság						
9389580	7090974	id	Kegubernuran Utara						
9389581	7090974	ko	북부 주						
9389582	7090974	no	Nordlige guvernement						
9389583	7090974	sco	Northren Govrenorate						
9389584	7090974	su	Kagubernuran Kalér						
9389586	7090974	tr	Kuzey Valiliği						
9389587	7090974	pt	Província do Norte						
9389588	7090974	zh	北方省						
11213828	7090974	ar	المحافظة الشمالية						
11213829	7090974		Al Muhafazah ash Shamaliyah						
11386079	7090974	lt	Šiaurės muchafaza						
11386080	7090974	ps	محافظه شماليه						
11386081	7090974	ur	محافظہ شمالیہ						
11386082	7090974	sv	Norra guvernementet						
5645147	7284881	link	https://en.wikipedia.org/wiki/Hawar_Islands						
7589136	7284881	de	Hawar-Inseln						
7589137	7284881	es	Islas Hawar						
7589138	7284881	fr	Îles Hawar						
7589139	7284881	nl	Hawar-eilanden						
7589140	7284881	tr	Hawar Adaları						
7589141	7284881	cs	Hawár						
7589142	7284881	ca	Illes Hawar						
7589143	7284881	ar	جزر حوار						
7589144	7284881	fa	جزایر حوار						
7589145	7284881	pl	Wyspy Hawar						
7589146	7284881	pt	Juzur Hawar						
5757410	8394007	link	https://en.wikipedia.org/wiki/Bahrain_International_Circuit						
9356247	8394007	es	Circuito Internacional de Baréin						
9356248	8394007	fr	Circuit international de Sakhir						
9356249	8394007	ar	حلبة البحرين الدولية						
9356251	8394007	bg	Сакхир						
9356252	8394007	ca	Circuit de Bahrain						
9356253	8394007	cs	Sakhir						
9356254	8394007	eu	Bahraingo Nazioarteko Zirkuitua						
9356255	8394007	gl	Circuíto Internacional de Bahrain						
9356257	8394007	id	Sirkuit Internasional Bahrain						
9356258	8394007	ja	バーレーン・インターナショナル・サーキット						
9356259	8394007	ko	바레인 인터내셔널 서킷						
9356260	8394007	lt	Trasa Sakhir						
9356261	8394007	lv	Bahreinas Starptautiskā trase						
9356263	8394007	ms	Litar Antarabangsa Bahrain						
9356264	8394007	tr	Bahreyn Uluslararası Pisti						
9356265	8394007	uk	Сахір						
9356266	8394007	pt	Circuito Internacional de Bahrein						
9356267	8394007	ru	Сахир						
9356268	8394007	zh	巴林国际赛道						
11380875	8394007	af	Bahrein Internasionale Renbaan						
15416624	8394007	wkdt	Q171332						
8689791	8643013	link	https://en.wikipedia.org/wiki/Seef						
15508202	8643013	wkdt	Q7445721						
16201680	11048875	link	https://en.wikipedia.org/wiki/Amwaj_Islands						
16650698	11048875		Juzur Amwaj						
16650699	11048875	ar	جزر أمواج‎						
16206035	11048876	link	https://en.wikipedia.org/wiki/A%27ali						
16933724	11048876	unlc	BHAAL						
15596086	11048877	wkdt	Q1135217						
16193175	11048877	link	https://en.wikipedia.org/wiki/Abu_Saiba						
13729117	11048878	unlc	BHADA						
15460694	11048878	wkdt	Q4683326						
16173213	11048878	link	https://en.wikipedia.org/wiki/Adliya						
13729126	11524244	unlc	BHKBS						
13190291	11550666	link	https://en.wikipedia.org/wiki/Isa_Air_Base						
13190292	11550666		Shaikh Isa Air Base				1		
13190293	11550666	icao	OBBS						
13729124	11550666	unlc	BHISA						
13647313	11843091	en	Hawar Island Highway Strip						
13647314	11843092	en	Ar Rifa Al Gharbi Heliport						
16196142	11874014	link	https://en.wikipedia.org/wiki/Beit_Al_Quran						
16893502	12261449	link	https://www.hilton.com/en/hotels/bahtagi-hilton-garden-inn-bahrain-bay/?WT.mc_id=zMDEC0BH1GI2NaturalSearch3Google_LGHotelListing4DGGeneric_5LocalSearch6BAHTAGI7EN8i102297						
