2188719	1899402	is	Cookeyjar						
2296698	1899402	is	Cooks-eyjar	1					
2299659	1899402	fr	Îles Cook	1					
2419814	1899402	am	ኩክ ደሴቶች	1					
2419815	1899402	ar	جزر كوك	1					
2419816	1899402	be	Кука астравы	1					
2419817	1899402	bg	Острови Кук	1					
2419818	1899402	bn	কুক দ্বীপপুঞ্জ	1					
2419819	1899402	bo	ཀཱུག གླིང་ཕྲེན་རྒྱལ་ཁབ།	1					
2419820	1899402	ca	Illes Cook	1					
2419821	1899402	cs	Cookovy ostrovy	1					
2419822	1899402	cy	Ynysoedd Cook	1					
2419823	1899402	da	Cook-øerne	1					
2419824	1899402	de	Cookinseln	1					
2419825	1899402	el	Νήσοι Κουκ	1					
2419826	1899402	en	Cook Islands	1					
2419827	1899402	eo	Kukinsuloj	1					
2419828	1899402	es	Islas Cook	1					
2419829	1899402	et	Cooki saared	1					
2419830	1899402	eu	Cook uharteak	1					
2419831	1899402	fa	جزایر کوک	1					
2419832	1899402	fi	Cookinsaaret	1					
2419833	1899402	fr	Iles Cook						
2419834	1899402	ga	Oileáin Cook	1					
2419835	1899402	gl	Illas Cook	1					
2419836	1899402	he	איי קוק	1					
2419837	1899402	hi	कुक द्वीपसमूह	1					
2419838	1899402	hr	Cookovi Otoci	1					
2419839	1899402	hu	Cook-szigetek	1					
2419840	1899402	ia	Insulas Cook	1					
2419841	1899402	id	Kepulauan Cook	1					
2419842	1899402	it	Isole Cook	1					
2419843	1899402	ja	クック諸島	1					
2419844	1899402	ka	კუკის კუნძულები	1					
2419845	1899402	ko	쿡제도	1					
2419846	1899402	lt	Kuko salos	1					
2419847	1899402	lv	Kuka salas	1					
2419848	1899402	mk	Кукови Острови	1					
2419849	1899402	ms	Cook Islands	1					
2419850	1899402	mt	Gżejjer Cook	1					
2419851	1899402	nb	Cookøyene	1					
2419852	1899402	nl	Cookeilanden	1					
2419853	1899402	nn	Cookøyane	1					
2419854	1899402	pl	Wyspy Cooka	1					
2419855	1899402	pt	Ilhas Cook	1					
2419856	1899402	ro	Insulele Cook	1					
2419857	1899402	ru	Острова Кука	1					
2419858	1899402	sk	Cookove ostrovy	1					
2419859	1899402	sl	Cookovo otočje	1					
2419860	1899402	sr	Кукова Острва	1					
2419861	1899402	sv	Cooköarna	1					
2419862	1899402	th	หมู่เกาะคุก	1					
2419863	1899402	to	ʻOtumotu Kuki	1					
2419864	1899402	tr	Cook Adaları	1					
2419865	1899402	uk	Острови Кука	1					
2419866	1899402	ur	کک آئلینڈز	1					
2419867	1899402	vi	Quần Đảo Cook	1					
2419868	1899402	zh	库克群岛	1					
3050868	1899402	link	https://ru.wikipedia.org/wiki/%D0%9E%D1%81%D1%82%D1%80%D0%BE%D0%B2%D0%B0_%D0%9A%D1%83%D0%BA%D0%B0						
3075773	1899402	link	https://en.wikipedia.org/wiki/Cook_Islands						
7085841	1899402	af	Cookeilande	1					
7085842	1899402	ak	Kook Nsupɔw	1					
7085843	1899402	az	Kuk Adaları	1					
7085844	1899402	bm	Kuki Gun	1					
7085845	1899402	br	Inizi Cook	1					
7085846	1899402	bs	Kukova Ostrva	1					
7085847	1899402	ee	Kook ƒudomekpo nutome	1					
7085848	1899402	ff	Duuɗe Kuuk	1					
7085849	1899402	fo	Cooksoyggjar	1					
7085850	1899402	gu	કુક આઇલેન્ડ્સ	1					
7085851	1899402	ha	Tsibiran Kuku	1					
7085852	1899402	is	Cookseyjar	1					
7085853	1899402	ki	Visiwa vya Cook	1					
7085854	1899402	kn	ಕುಕ್ ದ್ವೀಪಗಳು	1					
7085855	1899402	lg	Bizinga bya Kkuki	1					
7085856	1899402	ln	Bisanga bya Kookɛ	1					
7085857	1899402	lu	Lutanda lua Kookɛ	1					
7085858	1899402	mg	Nosy Kook	1					
7085859	1899402	ml	കൂക്ക് ദ്വീപുകള്‍	1					
7085860	1899402	mr	कुक बेटे	1					
7085861	1899402	my	ကွတ် ကျွန်းစု	1					
7085862	1899402	nd	Cook Islands	1					
7085863	1899402	ne	कुक टापुहरु	1					
7085864	1899402	or	କୁକ୍‌ ଦ୍ୱୀପପୁଞ୍ଜ	1					
7085865	1899402	rm	Inslas Cook	1					
7085866	1899402	rn	Izinga rya Kuku	1					
7085867	1899402	se	Cook-sullot	1					
7085868	1899402	sg	âzûâ Kûku	1					
7085869	1899402	si	කුක් දූපත්	1					
7085870	1899402	sn	Zvitsuwa zveCook	1					
7085871	1899402	so	Jasiiradda Kook	1					
7085872	1899402	sw	Visiwa vya Cook	1					
7085873	1899402	ta	குக் தீவுகள்	1					
7085874	1899402	te	కుక్ దీవులు	1					
7085875	1899402	ti	ደሴታት ኩክ	1					
7085876	1899402	yo	Etíokun Kùúkù	1					
7085877	1899402	zu	i-Cook Islands	1					
7579736	1899402	hr	Cookovo Otočje						
7579737	1899402	da	Cookøerne	1					
7579738	1899402	vi	Quần đảo Cook						
7579739	1899402	bo	ཁོ་ཁེ་གླིང་ཚོམ།						
7579740	1899402	vec	Isole Cook						
7579741	1899402	io	Insuli Cook						
7579742	1899402	ace	Pulo-pulo Cook						
7579743	1899402	os	Кучы сакъадæхтæ						
7579744	1899402	bs	Cookova Ostrva						
7579745	1899402	ug	Kuk Taqim Aralliri						
7579746	1899402	oc	Illas Cook						
7579747	1899402	az	Kuk adaları						
7579748	1899402	bg	Кук						
7579749	1899402	new	कूक टापू						
7579750	1899402	ang	Cōcīega						
7579751	1899402	be	Астравы Кука	1					
7579752	1899402	no	Cookøyene	1					
7579753	1899402	dsb	Cookowe kupy						
7579754	1899402	scn	Ìsuli Cook						
7579755	1899402	ms	Kepulauan Cook	1					
7579756	1899402	frp	Iles Cook						
7579757	1899402	ast	Islles Cook						
7579758	1899402	mr	कूक द्वीपसमूह						
7579759	1899402	su	Kapuloan Cook						
7579760	1899402	hbs	Kukova Ostrva						
7579761	1899402	la	Insulae de Cook						
7579762	1899402	sl	Cookovi otoki	1					
7579763	1899402	mi	Kuki Airani						
7579764	1899402	lt	Kuko Salos	1					
7579766	1899402	rw	Ibirwa bya Kuke						
7579767	1899402	war	Kapuropod-an Cook						
7579769	1899402	ext	Islas Cook						
7579770	1899402	mzn	کوک جزایر						
7579771	1899402	jv	Kapuloan Cook	1					
7579772	1899402	dv	ކުކް ޖަޒީރާ						
7579773	1899402	ko	쿡 제도	1					
7579774	1899402	kw	Ynysow Cook						
7579775	1899402	lij	Isoe Cook						
7579776	1899402	ku	Giravên Cook	1					
7579777	1899402	wo	Dunu Kook						
7579778	1899402	kk	Кук аралдары	1					
7579779	1899402	bpy	কোক দ্বীপমালা						
8183049	1899402	pa	ਕੁੱਕ ਟਾਪੂ	1					
8183050	1899402	ur	جزائر کک						
8183051	1899402	or	କୁକ ଦ୍ଵୀପପୁଞ୍ଜ						
8183052	1899402	hy	Կուկի կղզիներ	1					
8183053	1899402	hsb	Cookowe kupy						
8183054	1899402	tl	Kapuluang Cook						
8183055	1899402	yo	Àwọn Erékùṣù Cook						
8183056	1899402	crh	Kuk Adaları						
8699402	1899402	als	Cookinseln						
8699403	1899402	arz	جزر كوك						
8699404	1899402	ba	Кук утрауҙары						
8699405	1899402	ml	കുക്ക് ദ്വീപുകൾ	1					
8699406	1899402	nan	Cook Kûn-tó						
8699407	1899402	yue	曲克群島						
11320936	1899402	gag	Cook Adaları						
11320937	1899402	kaa	Kuk atawları						
11320938	1899402	ky	Кук аралдары	1					
11320939	1899402	li	Cookeilenj						
11320940	1899402	mrj	Кук ошмаотывлӓ						
11320941	1899402	my	ကွတ်ကျွန်းစု						
11320942	1899402	si	කුක් දිවයින්						
11320943	1899402	tt	Кук утраулары	1					
11320944	1899402	uz	Kuk orollari	1					
16925697	1899402	zh-Hant	庫克群島	1					
16927461	1899402	as	কুক দ্বীপপুঞ্জ	1					
16927462	1899402	ce	Кукан гӀайренаш	1					
16927463	1899402	dz	ཀུག་གླིང་ཚོམ	1					
16927464	1899402	fy	Cookeilannen	1					
16927465	1899402	gd	Eileanan Cook	1					
16927466	1899402	ig	Agwaetiti Cook	1					
16927467	1899402	kl	Cook qeqertaq	1					
16927468	1899402	km	កោះ​ខូក	1					
16927469	1899402	ks	کُک جٔزیٖرٕ	1					
16927470	1899402	lb	Cookinselen	1					
16927471	1899402	lo	ໝູ່ເກາະຄຸກ	1					
16927472	1899402	mn	Күүкийн арлууд	1					
16927473	1899402	ps	کوک ټاپوګان	1					
16927474	1899402	qu	Islas Cook	1					
16927475	1899402	sd	ڪوڪ ٻيٽ	1					
16927476	1899402	sq	Ishujt Kuk	1					
16927477	1899402	tg	Ҷазираҳои Кук	1					
16927478	1899402	tk	Kuk adalary	1					
16927479	1899402	ug	كۇك ئاراللىرى	1					
16927480	1899402	wo	Duni Kuuk	1					
16927481	1899402	yi	קוק אינזלען	1					
13705654	4030874	rar	Paura						
1547400	4031118		Vaiari						
4330090	4031118		Vaiere						
1547401	4031119		Turai						
4330096	4031119		Tuirai						
1547402	4031120		Tuāhua						
4330097	4031120		Tuaua						
13702004	4031120	rar	Tuahua						
1547403	4031121		Tokerau Islet						
1547404	4031121		Tokarau						
4330103	4031121		Tokerau						
1547405	4031122		Tepuka Island						
4330107	4031122		Tepuka						
1547406	4031124		Tekasi Island						
1547407	4031124		Tekasi Islet						
4330111	4031124		Tekasi						
1547408	4031125		Tehara Island						
4330113	4031125		Tehara						
1547409	4031126		Tautua						
4330118	4031126		Te Tautua						
11306033	4031126	link	https://en.wikipedia.org/wiki/Te_Tautua						
1547410	4031127		Tautua						
1547411	4031127		Tetautua						
4330119	4031127		Pokerekere						
1547412	4031128		West Pass						
1547413	4031128		Taruia Pass						
4330123	4031128		Taruia Passage						
1547414	4031129		Takuua Pass						
1547415	4031129		Northeast Pass						
4330129	4031129		Takuua Passage						
1547416	4031130		Takuua Islet						
4330130	4031130		Takuua						
1547417	4031131		Sekerangi Pass						
1547418	4031131		Northwest Pass						
1547419	4031131		Siki Rangi Pass						
4330135	4031131		Siki Rangi Passage						
1547420	4031132		Sau-makariri						
4330136	4031132		Sanisanireka						
15388814	4031132	wkdt	Q23006150						
1547421	4031133		Motu-a-sake						
4330137	4031133		Motu a Saka						
1547422	4031134		Ruapo						
4330139	4031134		Ruapou						
15212324	4031134	wkdt	Q23006148						
1547423	4031136		Ruahara Islets						
1547424	4031136		Ruahara Island						
4330140	4031136		Ruahara						
13702055	4031137	en	Round Reef						
1547425	4031139		Tongareva						
1547426	4031139		Penrhyn Island						
1547427	4031139		Fararanga						
1547428	4031139		Tongareva Island						
1547429	4031139		Bennett Island						
1547430	4031139		Mangorongoro						
1547431	4031139		Penrhyn						
1919400	4031139	es	Penrhyn						
1919401	4031139	fr	Penrhyn						
1919402	4031139	de	Penrhyn						
1919403	4031139	en	Penrhyn Island						
1919404	4031139	ca	Penrhyn						
1919405	4031139	cy	Tongareva						
1919406	4031139	fi	Tongareva						
1919407	4031139	no	Tongareva						
1919408	4031139	sv	Penrhyn						
3056805	4031139	link	https://ru.wikipedia.org/wiki/%D0%A2%D0%BE%D0%BD%D0%B3%D0%B0%D1%80%D0%B5%D0%B2%D0%B0						
4330149	4031139		Penrhyn Atoll						
13136368	4031139	iata	PYE						
13735903	4031139	unlc	CKPYE						
16650252	4031139	link	https://en.wikipedia.org/wiki/Penrhyn_atoll						
16650253	4031139		Māngarongaro						
16650254	4031139		Hararanga						
16650255	4031139		Te Pitaka						
1547432	4031140		Tokarau						
1547433	4031140		Paniko						
4330153	4031140		Painko						
1547434	4031141		Omoko						
4330160	4031141		Omoka						
7543801	4031141	link	https://en.wikipedia.org/wiki/Omoka						
1547435	4031142		Omoka						
1547436	4031142		Omoko						
1547437	4031142		Omoka Island						
4330161	4031142		Moananui						
16650300	4031142	link	https://en.wikipedia.org/wiki/Moananui_Islet						
1547438	4031143		Nuatinga Islands						
4330163	4031143		Nuitikainga						
13702086	4031144	en	North West Bank						
1547439	4031145		Ngangia Mutu						
1547440	4031145		Nganga Mutu						
4330166	4031145		Motu Ngangie						
1547441	4031146		Maturakina						
1547442	4031146		Motu-Rakinga						
4330173	4031146		Moturakina						
1547443	4031147		Motu Unga						
1547444	4031147		Molokai						
1547445	4031147		Motu-unga						
4330174	4031147		Matunga						
1547446	4031148		Matapurarua						
4330176	4031148		Motupurau						
1547447	4031149		Manono						
4330180	4031149		Manoro						
1547448	4031151		Makeeatta Island						
4330185	4031151		Makeeatta						
15245081	4031151	wkdt	Q23006135						
1547449	4031152		Hangarea						
4330196	4031152		Hangarei						
1547450	4031154		Flying Venus						
4330197	4031154		Flying Venus Reef						
13702134	4031155	en	First Reef						
13702166	4031157	rar	Ahuapapa						
1547451	4031158		Ahaumanu						
4330213	4031158		Ahu-a-manu						
13705581	4031400	rar	Mangarongaro						
13705582	4031401	rar	Takuroro						
13705583	4031402	rar	Aka Susanui						
13705584	4031403	rar	Te Toto						
13705585	4031404	rar	Tevete						
13705586	4031410	rar	Parahatea						
5905842	4031411	iata	PYE						
13136367	4031411	link	https://en.wikipedia.org/wiki/Tongareva_Airport						
13443226	4031411	icao	NCPY						
13901156	4031411	en	Penrhyn Tongareva Airport						
13901157	4031411	unlc	CKPYE						
13705587	4031412	rar	Motukoiti						
13705588	4031413	rar	Tarakore						
13705589	4031414	rar	Tesauma						
13705590	4031415	rar	Rangiriri						
13705591	4031416	rar	Aucklandnui						
13705592	4031418	rar	Torea						
13705593	4031419	rar	Tuperepere						
13705594	4031420	rar	Tauasoata						
13705595	4031421	rar	Kavaemaunga						
13705596	4031422	rar	Rukutia						
13705597	4031423	rar	Nahe						
13705598	4031424	rar	Anoa						
13705599	4031426	rar	Veseru						
13705600	4031429	rar	Patanga						
13705601	4031432	rar	Ahu-A-Miria						
13705602	4031432	rar	Ahu-a-Mira						
13705643	4031433	rar	Nauapoti						
7546397	4035435	link	https://en.wikipedia.org/wiki/Winslow_Reef%2C_Cook_Islands						
7566498	4035435		Winslow Reef						
15209571	4035436	wkdt	Q23006118						
15969131	4035436		Whale Island						
13701984	4035437	rar	Waitamina						
13701985	4035438	rar	Waipoa						
13701986	4035439	rar	Waipapa						
13701987	4035440	rar	Waipapa						
13701988	4035441	rar	Waiouru						
13701989	4035442	rar	Waiope						
13701990	4035443	rar	Waimatao						
13701991	4035444	rar	Waikerikeri						
13701992	4035445	rar	Waikakaia						
1550201	4035446		Via Piake						
1550202	4035446		Vai-Piake						
4330089	4035446		Vai Piake Landing						
13701993	4035450	rar	Vaimutu						
13701994	4035452	rar	Vaii						
13701995	4035453	rar	Uturei						
13701996	4035454	rar	Urumatia						
1550203	4035455		Uriata						
4330091	4035455		Uriaata Landing						
13701997	4035456	rar	Uke						
1550204	4035457		Turangi Creek						
4330092	4035457		Turangi Stream						
1550205	4035458		Turakina Passage						
4330093	4035458		Turakino Passage						
1550206	4035460		Tupapa Creek						
4330094	4035460		Tupapa Stream						
13701998	4035461	en	Tumai Landing						
13701999	4035461	rar	Tumai						
13702000	4035462	en	Tukume Landing						
13702001	4035462	rar	Tukume						
1550207	4035463		Tuko Village						
1550208	4035463		Tuko						
4330095	4035463		Tukao						
13702002	4035464	rar	Tukoropa						
13702003	4035465	rar	Tukoi						
13702005	4035468	rar	Tuapapa						
13702006	4035469	en	Tuakata Hill						
13702007	4035470	rar	Tuaati						
1550209	4035471		Motu Tou						
1550210	4035471		Motu Tou Island						
4330098	4035471		Motutoa						
15327238	4035471	wkdt	Q23006098						
1550211	4035472		Iotua Ika						
1550212	4035472		Iotua-Ika Landing						
1550213	4035472		Totua Ika						
1550214	4035472		Kona Kona Ko						
4330099	4035472		Totua-Ika Landing						
13702008	4035472	en	Lota Ika Landing						
1550215	4035473		Totokoitu						
4330100	4035473		Totokoitu Creek						
13702009	4035473	en	Totokoitu Stream						
1550216	4035474		Totiko						
4330101	4035474		Totiko Landing						
1550217	4035476		Tongaiti Mountain						
4330102	4035476		Maungatongaiti						
15671027	4035476	wkdt	Q23006096						
1550218	4035477		Toka Tutai						
4330104	4035477		Toka Tutae						
13702010	4035478	rar	Tokapapa						
13702011	4035479	rar	Toka Papa						
1550219	4035481		Titikaweka						
4330105	4035481		Titikaveka						
13702012	4035482	rar	Te Roto						
13702013	4035482	rar	Lake Tiriroto						
13702014	4035482	rar	Lake Tiroto						
16195947	4035482	link	https://en.wikipedia.org/wiki/Lake_Tiroto						
13702015	4035483	rar	Tikioki						
13702016	4035484	rar	Te Vaakauta						
15335922	4035484	wkdt	Q23006094						
13702017	4035485	rar	Te Tau						
2212589	4035486		The Needle						
4330106	4035486		Te Rua Manga						
15668919	4035486	wkdt	Q23006092						
13702018	4035487	rar	Te Rua						
13702019	4035488	rar	Teraamanga						
13702020	4035489	rar	Te Puka						
13702021	4035490	rar	Te Po						
13702022	4035491	rar	Tepari						
1550220	4035492		Te Pae Roa Ngake o Tuko						
4330108	4035492		Ngake						
13702023	4035493	rar	Teonepukeiara						
1550221	4035494		Tengatangi Village						
4330109	4035494		Tengatangi						
16178235	4035494	link	https://en.wikipedia.org/wiki/Tengatangi_Village						
13702024	4035495	rar	Tengatangi						
13702025	4035496	rar	Temo						
13702026	4035497	rar	Te Miro						
13702027	4035498	rar	Temati						
13702028	4035499	rar	Tematatoa						
7492894	4035500	link	https://en.wikipedia.org/wiki/Tema_Reef						
7566499	4035500		Tema Reef						
5713129	4035501	link	https://en.wikipedia.org/wiki/Te_Manga						
5722935	4035501		Te Manga						
1550222	4035502		Tekoutu						
4330110	4035502		Te Kouto Point						
13702029	4035503	en	Te Kou Creek						
13702030	4035504	rar	Te Kou						
13702031	4035505	rar	Te Koe						
13702032	4035506	rar	Te Kavete						
13702033	4035507	rar	Te Kapi						
1550223	4035508		Te Kainga Island						
4330112	4035508		Te Kainga						
1550224	4035509		Teenui						
4330114	4035509		Te Enui						
13702034	4035509	en	Teenui Village						
13702035	4035510	rar	Teenui						
13702036	4035511	rar	Te Ava Tapu						
1550225	4035512		Auotu						
1550226	4035512		Te-Au-o-Tu						
1550227	4035512		Auotu Island						
4330115	4035512		Te Au Otu						
13702037	4035512	rar	Te Au O Tu						
1550228	4035513		Mount Te Atu Kura						
4330116	4035513		Te Atukura						
15803303	4035513	wkdt	Q23006077						
13702038	4035514	rar	Te Arote						
13702039	4035516	rar	Te Ana Nui						
1550229	4035517		Te Aiti						
4330117	4035517		Teaiti Point						
15394267	4035517	wkdt	Q23006074						
1550230	4035518		Tautu						
4330120	4035518		Tautu District						
13702040	4035519	rar	Tauri Vaikai						
13702041	4035520	rar	Taungaroro						
13702042	4035521	en	Taungani Landing						
13702043	4035521	en	Taunganui Landing						
13702044	4035521	rar	Taunganui						
13702045	4035521	en	Mauke Harbour						
1550231	4035522		Taunganui						
4330121	4035522		Taunganui Landing						
1550232	4035523		Tauhunu Village						
4330122	4035523		Tauhunu						
7542053	4035524	link	https://en.wikipedia.org/wiki/Tauhunu						
7566500	4035524		Tauhunu						
13702046	4035525	rar	Tauae						
1550233	4035526		Tarapaku						
4330124	4035526		Tarupuku Landing						
13702047	4035526	en	Tarapaku Landing						
1550234	4035527		Tarakete						
4330125	4035527		Tarakete Rahi						
13702048	4035528	rar	Tapuriri						
1550235	4035529		Young’s Tooth						
4330126	4035529		Tapu Mountain						
1550236	4035530		Tamarua Village						
4330127	4035530		Tamarua						
1550237	4035531		Takuvaine Creek						
4330128	4035531		Takuvaine Stream						
1550238	4035532		Enua-iti						
1550239	4035532		Fenua Iti						
1550240	4035532		Takutea Island						
1550241	4035532		Otakuta						
1550242	4035532		Wenua Iti						
1550243	4035532		Wenooaette						
1550244	4035532		Otakootaia						
1949730	4035532	es	Takutea						
1949731	4035532	de	Takutea						
1949732	4035532	en	Takutea						
1949733	4035532	ca	Takutea						
1949734	4035532	fi	Takutea						
1949735	4035532	no	Takutea						
1949736	4035532	sv	Takutea						
2034592	4035532	nl	Takutea						
2989114	4035532	link	https://en.wikipedia.org/wiki/Takutea						
3056860	4035532	link	https://ru.wikipedia.org/wiki/%D0%A2%D0%B0%D0%BA%D1%83%D1%82%D0%B5%D0%B0						
4330131	4035532		Takutea						
13702049	4035534	rar	Takiora						
1550245	4035535		Tokauroa Landing						
4330132	4035535		Takauroa						
1550246	4035536		Takarae						
4330133	4035536		Takarae Point						
15690240	4035536	wkdt	Q23006068						
13702050	4035537	en	Taipara Creek						
13702051	4035538	rar	Tainga Kaa						
13702052	4035539	rar	Taeta						
13702053	4035540	rar	Taeta						
13702054	4035541	rar	Taakoka						
1550247	4035542		Souworoff						
1550248	4035542		Suvorov Islands						
1550249	4035542		Suvorov Atoll						
1550250	4035542		Suvarov						
1550251	4035542		Suwaroff						
4330134	4035542		Suwarrow Atoll						
8246208	4035542		Suwarrow						
15220649	4035542	wkdt	Q23006065						
16650299	4035542	link	https://en.wikipedia.org/wiki/Suwarrow						
1550252	4035545		Rutaki						
4330138	4035545		Rutaki Passage						
1550253	4035548		Rotuakakura						
1550254	4035548		Akaiai						
4330141	4035548		Akaiami						
6889374	4035548	link	https://en.wikipedia.org/wiki/Akaiami						
15749387	4035548	wkdt	Q4700175						
13702056	4035550	rar	Raukotaha						
1550256	4035552		Raroto-a						
1550257	4035552	en	Goodenough’s Island						
1645879	4035552	es	Rarotonga						
1645880	4035552	en	Rarotonga Island	1					
1645881	4035552	de	Rarotonga						
1645882	4035552	bg	Раротонга						
1645883	4035552	ca	Rarotonga						
1645884	4035552	fi	Rarotonga						
1645885	4035552	fr	Île de Rarotonga						
1645886	4035552	id	Rarotonga						
1645887	4035552	nl	Rarotonga						
1645888	4035552	no	Rarotonga						
1645889	4035552	sv	Rarotonga						
1998084	4035552	ja	ラロトンガ島						
2989115	4035552	link	https://en.wikipedia.org/wiki/Rarotonga						
3056861	4035552	link	https://ru.wikipedia.org/wiki/%D0%A0%D0%B0%D1%80%D0%BE%D1%82%D0%BE%D0%BD%D0%B3%D0%B0						
4330142	4035552		Rarotonga						
8328323	4035552	fa	راروتونگا						
8328324	4035552	sr	Раротонга						
8328325	4035552	gl	Illa de Rarotonga						
8328326	4035552	be	Востраў Раратонга						
8328327	4035552	ru	Раротонга						
8328328	4035552	zh	拉罗汤加岛						
8513225	4035552	iata	RAR						
8518737	4035552		Rarotonga Island						
8720827	4035552	ko	라로통가 섬						
11340943	4035552	he	ררוטונגה						
11340944	4035552	hy	Ռարոտոնգա						
13735905	4035552	unlc	CKRAR						
1550258	4035553		Rapoka						
4330143	4035553		Rapota						
6889397	4035553	link	https://en.wikipedia.org/wiki/Rapota						
15261628	4035553	wkdt	Q7294286						
13702057	4035555	rar	Rangimotia						
1550259	4035557		Reirson Island						
1550260	4035557		Rakahanga Island						
3056862	4035557	link	https://ru.wikipedia.org/wiki/%D0%A0%D0%B0%D0%BA%D0%B0%D1%85%D0%B0%D0%BD%D0%B3%D0%B0						
4330144	4035557		Rakahanga Atoll						
13702058	4035557	rar	Rakahanga						
16650298	4035557	link	https://en.wikipedia.org/wiki/Rakahanga						
13702059	4035558	rar	Raemaru						
13702060	4035560	rar	Putangaroa						
1550261	4035562		Danger Atoll						
1550262	4035562		Danger Islands						
4330145	4035562		Pukapuka Atoll						
15362828	4035562	wkdt	Q23006055						
16650250	4035562	link	https://en.wikipedia.org/wiki/Pukapuka						
16650251	4035562		Danger Island				1		
16812832	4035562		Pukapuka						
1550263	4035563		Wale						
2007447	4035563	es	Pukapuka						
2007448	4035563	fr	Pukapuka						
2007449	4035563	en	Pukapuka						
2007450	4035563	de	Pukapuka						
2007451	4035563	ca	Pukapuka						
2007452	4035563	fi	Pukapuka						
2007453	4035563	it	Pukapuka						
2007454	4035563	no	Pukapuka						
2007455	4035563	sv	Pukapuka						
3056863	4035563	link	https://ru.wikipedia.org/wiki/%D0%9F%D1%83%D0%BA%D0%B0%D0%BF%D1%83%D0%BA%D0%B0_%28%D0%B0%D1%82%D0%BE%D0%BB%D0%BB%29						
4330146	4035563		Pukapuka						
13136364	4035563	iata	PZK						
13702061	4035565	rar	Poutukara						
1550264	4035567		Pu Ara						
4330147	4035567		Pouara						
1550265	4035568		Ponea						
4330148	4035568		Porea						
15815243	4035568	wkdt	Q23006053						
13702062	4035571	rar	Poatu Reia						
13702063	4035572	rar	Poatu Nui						
13702064	4035573	rar	Pirikura						
13702065	4035574	rar	Piako						
15508208	4035574	wkdt	Q23006052						
13702066	4035577	rar	Pari Poto						
1550266	4035578		Pari Aniu						
4330150	4035578		Pari Anui						
13702067	4035579	rar	Paravae						
1550267	4035580		Papua						
4330151	4035580		Papua Passage						
1550268	4035581		Papua Creek						
4330152	4035581		Papua Stream						
13702068	4035587	rar	Papa						
1550269	4035588		Pangerao						
4330154	4035588		Pangeroa						
1550270	4035589		Avarau						
1550271	4035589		Palmerston						
1550272	4035589		Auarua Island						
1550273	4035589		Palmerston Islands						
1550274	4035589		San Pablo						
4330155	4035589		Palmerston Atoll						
16650256	4035589	link	https://en.wikipedia.org/wiki/Palmerston_Island						
1550275	4035590		Home Island						
4330156	4035590		Palmerston Island						
8682869	4035590	link	https://en.wikipedia.org/wiki/Palmerston_Island						
16812833	4035590		Palmerston						
13702069	4035591	rar	Painga Onu						
1550276	4035592		Captain Cook’s Landing						
1550277	4035592		Orovaru						
4330157	4035592		Orovaru Landing						
13702070	4035592	rar	Oravaru Landing						
13702071	4035593	rar	Oropepe						
13702072	4035595	rar	Opi						
13702073	4035598	rar	Onotau						
13702074	4035599	rar	Oneunga						
15466550	4035600	wkdt	Q23006044						
15969132	4035600		One Tree Island						
1550278	4035601		Temakatea Village						
4330158	4035601		Oneroa						
11303477	4035601	link	https://en.wikipedia.org/wiki/Oneroa%2C_Cook_Islands						
1550279	4035602		Oneroa						
4330159	4035602		Oneroa Landing						
13702075	4035603	rar	Oneroa						
13702076	4035604	rar	Oneroa						
15226108	4035604	wkdt	Q23006043						
13702077	4035605	rar	Onepoto						
13702078	4035606	rar	Okena						
13702079	4035607	rar	Motu Okakara						
13702080	4035607	rar	Okakara						
13702081	4035608	rar	Nu Turuma						
13702082	4035609	rar	Nunumoko						
1550280	4035611		Nukupuro						
4330162	4035611		Nukupure						
13702083	4035612	rar	Nukuao						
13702084	4035613	rar	Nukatere						
13702085	4035614	rar	Nuka						
13702087	4035616	en	North Point						
1550281	4035617		Northern Group						
1550282	4035617		Northern Cook Group						
1550283	4035617		Northern Islands						
4330164	4035617		Northern Cook Islands						
13702088	4035619	rar	Noanoa						
13702089	4035621	en	Ngatoe Stream						
13702090	4035621	rar	Ngatoe						
13702091	4035622	en	Ngatiarua Village						
13702092	4035622	rar	Ngatiarua						
13702093	4035623	rar	Ngatiarua						
13702094	4035624	rar	Ngatiarua						
1550284	4035625		Ngatangia						
1550285	4035625		Ngatangiia Harbor						
4330165	4035625		Ngatangiia Harbour						
13702095	4035626	rar	Ngatangiia						
16174814	4035626	link	https://en.wikipedia.org/wiki/Ngatangiia						
13702096	4035627	rar	Ngaroa						
13702097	4035628	rar	Motu Ngangie						
13702098	4035629	rar	Nga Kuru						
15723272	4035630	wkdt	Q23006029						
15969133	4035630		New Island						
13702099	4035631	rar	Nauke						
13702100	4035632	rar	Natikitea						
1550286	4035633		Motugaugau						
1550287	4035633		Nassau						
4330167	4035633		Nassau Island						
7181680	4035633	link	https://en.wikipedia.org/wiki/Nassau_%28Cook_Islands%29						
16650244	4035633		Te Nuku-o-Ngalewu				1		
16650245	4035633		Te Motu Ngaongao				1		
16650246	4035633		Adele Island				1		
13702101	4035634	rar	Nanupoto						
13702102	4035635	rar	Murihiti						
15573799	4035635	wkdt	Q23006028						
1550288	4035636		Muriavai Creek						
4330168	4035636		Muriavai Stream						
13702103	4035637	rar	Muri						
13702104	4035638	rar	Motutapu						
15461031	4035638	wkdt	Q23006026						
13702105	4035639	rar	Motupae						
15228097	4035639	wkdt	Q23006025						
1550289	4035640		Motulakau						
4330169	4035640		Moturakau						
6889275	4035640	link	https://en.wikipedia.org/wiki/Moturakau						
15228878	4035640	wkdt	Q6918768						
1550290	4035641		Motikitiu						
4330170	4035641		Motukitiu						
6889167	4035641	link	https://en.wikipedia.org/wiki/Motukitiu						
14938453	4035641	wkdt	Q6918748						
1550291	4035642		Mitiero						
1550292	4035642		Mitiero Island						
1550293	4035642		Mattiaro						
2989118	4035642	link	https://en.wikipedia.org/wiki/Mitiaro						
3056864	4035642	link	https://ru.wikipedia.org/wiki/%D0%9C%D0%B8%D1%82%D0%B8%D0%B0%D1%80%D0%BE						
4330171	4035642		Mitiaro						
13136359	4035642	iata	MOI						
13735901	4035642	unlc	CKMOI						
16650247	4035642		Nukuroa						
13702106	4035643	rar	Motu Mahuta						
13702107	4035643	rar	Motu Mauta						
13702108	4035644	rar	Maungatea						
15801440	4035644	wkdt	Q23006023						
13702109	4035645	rar	Maungaroa						
15520067	4035645	wkdt	Q23006022						
1550294	4035646		Parry Island						
1550295	4035646		Mauki						
1550296	4035646		Mauke Island						
1550297	4035646		Mauiki						
1550298	4035646		Perry						
2989119	4035646	link	https://en.wikipedia.org/wiki/Mauke						
3056865	4035646	link	https://ru.wikipedia.org/wiki/%D0%9C%D0%B0%D1%83%D0%BA%D0%B5						
4330172	4035646		Mauke						
13136316	4035646	iata	MUK						
13735902	4035646	unlc	CKMUK						
16650248	4035646		Ma'uke						
16650249	4035646		Akatokamanava						
1550299	4035648		Matavera Creek						
4330175	4035648		Matavera Stream						
1550300	4035650		Matai						
4330177	4035650		Matai Landing						
13702110	4035653	rar	Maramu						
13702111	4035654	rar	Maraengaro						
13702112	4035655	en	Mapumai Village						
13702113	4035655	rar	Mapumai						
13702114	4035656	rar	Mapumai						
13702115	4035657	rar	Manureva						
13702116	4035658	rar	Manukea						
1550301	4035659		Hervey Islands						
4330178	4035659		Manuae Atoll						
16650257	4035659	link	https://en.wikipedia.org/wiki/Manuae_(Cook_Islands)						
1550302	4035660		Manuae Island						
1948117	4035660	es	Manuae						
1948118	4035660	de	Manuae						
1948119	4035660	en	Manuae						
1948120	4035660	ca	Manuae						
1948121	4035660	fi	Manuae						
1948122	4035660	no	Manuae						
1948123	4035660	sv	Manuae						
2989120	4035660	link	https://en.wikipedia.org/wiki/Manuae_%28Cook_Islands%29						
3058197	4035660	link	https://ru.wikipedia.org/wiki/%D0%9C%D0%B0%D0%BD%D1%83%D0%B0%D1%8D_%28%D0%BE%D1%81%D1%82%D1%80%D0%BE%D0%B2%D0%B0_%D0%9A%D1%83%D0%BA%D0%B0%29						
4330179	4035660		Manuae						
15621639	4035661	wkdt	Q23006015						
15969134	4035661		Manu						
1550303	4035663		Humphrey’s Island						
1550304	4035663		Humphrey Island						
1550305	4035663		Humphrey						
1550306	4035663		Manahiki						
1550307	4035663		Manihiki Island						
1550308	4035663		Manihiki						
1550309	4035663		Manihika						
1550310	4035663		Northern Cook Island						
2212590	4035663		Island of Pearls						
3056866	4035663	link	https://ru.wikipedia.org/wiki/%D0%9C%D0%B0%D0%BD%D0%B8%D1%85%D0%B8%D0%BA%D0%B8						
4330181	4035663		Manihiki Atoll						
13136354	4035663	iata	MHX						
13735900	4035663	unlc	CKMHX						
16650258	4035663	link	https://en.wikipedia.org/wiki/Manihiki						
1550311	4035664		Humphrey Island Anchorage						
1550312	4035664		Manihiki Island Anchorage						
4330182	4035664		Manihiki Anchorage						
13702117	4035665	rar	Maniania						
1550313	4035666		Mangari						
4330183	4035666		Mangere						
6890083	4035666	link	https://en.wikipedia.org/wiki/Mangere_%28Cook_Islands%29						
15211154	4035666	wkdt	Q6748972						
1550314	4035667		Mangea						
1550315	4035667		Mangara						
1550316	4035667		Mangaia Island						
1920862	4035667	es	Mangaia						
1920863	4035667	fr	Mangaia						
1920864	4035667	de	Mangaia						
1920865	4035667	en	Mangaia						
1920866	4035667	ca	Mangaia						
1920867	4035667	fi	Mangaia						
1920868	4035667	nl	Mangaia						
1920869	4035667	no	Mangaia						
1920870	4035667	sv	Mangaia						
2004483	4035667	ja	マンガイア島						
2989122	4035667	link	https://en.wikipedia.org/wiki/Mangaia						
3056867	4035667	link	https://ru.wikipedia.org/wiki/%D0%9C%D0%B0%D0%BD%D0%B3%D0%B0%D0%B8%D0%B0						
4330184	4035667		Mangaia						
11638001	4035667	fa	مانگایا						
11638002	4035667	gl	Illa de Mangaia						
11638003	4035667	lt	Mangaja						
11638004	4035667	ru	Мангаиа						
13735899	4035667	unlc	CKMGS						
16650242	4035667		A'ua'u Enua						
16650243	4035667		A'ua'u						
13702118	4035668	rar	Makawai						
13702119	4035669	rar	Makatea						
6890202	4035670	link	https://en.wikipedia.org/wiki/Maina_%28Cook_Islands%29						
6923257	4035670		Maina						
15756962	4035670	wkdt	Q6736232						
13702120	4035671	rar	Maii						
13702121	4035673	rar	Maera						
13702122	4035673	rar	Maeva						
1550317	4035674		Southern Group						
1550318	4035674		Lower Group						
1550319	4035674		Lower Cook Group						
1550320	4035674		Southern Cook Islands						
1550321	4035674		Cook Islands						
4330186	4035674		Lower Cook Islands						
1550322	4035676		Likopua						
4330187	4035676		Tekopua						
6889320	4035676	link	https://en.wikipedia.org/wiki/Tekopua						
15465637	4035676	wkdt	Q7695480						
13702123	4035678	rar	Kuru						
1550323	4035679		Kumu Kumu						
4330188	4035679		Kumukumu Landing						
13702124	4035680	rar	Koru						
13702125	4035681	rar	Koromiri						
15376036	4035681	wkdt	Q23006006						
1550324	4035682		Koranganui						
4330189	4035682		Karanganui Landing						
1550325	4035684		Motu Ko						
4330190	4035684		Motu Koe						
14950943	4035684	wkdt	Q23006004						
13702126	4035685	rar	Koatau						
13702127	4035686	en	Kavera Mountain						
1550326	4035687		Motu Kavata Island						
1550327	4035687		Kotaua						
1550328	4035687		Kotawa						
4330191	4035687		Motu Kavata						
15216595	4035687	wkdt	Q23006001						
1550329	4035688		Kau Poto						
4330192	4035688		Kau Poto Landing						
13702128	4035689	rar	Kauare						
13702129	4035691	rar	Kakunoa						
13702130	4035692	rar	Kakari						
13702131	4035693	rar	Kaiwai						
1550330	4035694		Ivirua Village						
4330193	4035694		Ivirua						
1550331	4035695		Ivirua						
4330194	4035695		Ivirua Swamp						
1550332	4035696		Ikuranga						
1550333	4035696		Mount Ikurangi						
1550334	4035696		Hikurangi						
4330195	4035696		Ikurangi						
15659475	4035696	wkdt	Q23005996						
13702132	4035697	rar	Hunanui						
15525456	4035698	wkdt	Q23005994						
15969135	4035698		High Island						
13702133	4035699	rar	Haratini						
15222072	4035704	wkdt	Q23005989						
15969136	4035704		Entrance Island						
1550335	4035706		Hervey Islands						
1550336	4035706		Cook Group						
2296516	4035706	fr	Iles Cook						
4330198	4035706		Cook Islands						
1550337	4035708		Nicholson Island						
4330199	4035708		Beveridge Reef						
7524677	4035708	link	https://en.wikipedia.org/wiki/Beveridge_Reef						
13702135	4035710	en	Avatiu Stream						
1550338	4035711		Avatiu Harbor						
4330200	4035711		Avatiu Harbour						
16711141	4035711	unlc	CKATU						
7077711	4035712	link	https://en.wikipedia.org/wiki/Avatiu						
7119138	4035712		Avatiu						
15300718	4035712	wkdt	Q4827844						
13702136	4035713	en	Avarua Landing						
1550339	4035714		Avarua Harbor						
4330201	4035714		Avarua Harbour						
1596203	4035715	de	Avarua						
1596204	4035715	en	Avarua						
1596205	4035715	bg	Аваруа						
1596206	4035715	da	Avarua						
1596207	4035715	fi	Avarua						
1596208	4035715	fr	Avarua						
1596209	4035715	gl	Avarua						
1596210	4035715	io	Avarua						
1596211	4035715	nl	Avarua						
1596212	4035715	no	Avarua						
1596213	4035715	pl	Avarua						
1596214	4035715	sv	Avarua						
1637717	4035715	es	Avarua						
1637718	4035715	pt	Avarua						
1637719	4035715	sk	Avarua						
1649441	4035715	it	Avarua						
1649581	4035715	el	Avarua						
1904477	4035715	id	Avarua						
1991015	4035715	ja	アバルア						
1991016	4035715	ru	Аваруа						
2296474	4035715	is	Avarúa						
2989123	4035715	link	https://en.wikipedia.org/wiki/Avarua						
3056868	4035715	link	https://ru.wikipedia.org/wiki/%D0%90%D0%B2%D0%B0%D1%80%D1%83%D0%B0						
4330202	4035715		Avarua						
8065490	4035715	iata	RAR						
9374107	4035715	be	Аваруа						
9374108	4035715	bo	ཨ་ཝ་རུ་ཨ།						
9374109	4035715	eo	Avaruo						
9374110	4035715	fa	آواروآ						
9374111	4035715	ka	ავარუა						
9374112	4035715	ko	아바루아						
9374113	4035715	mk	Аваруа						
9374114	4035715	mr	अव्हारुआ						
9374115	4035715	sr	Аваруа						
9374116	4035715	ta	அவாருவா						
9374117	4035715	th	อะวารัว						
9374118	4035715	uk	Аваруа						
9374119	4035715	ur	آواریا						
9374120	4035715	zh	阿瓦鲁阿						
11405140	4035715	ar	آواروآ						
11405141	4035715	el	Αβαρούα						
11405142	4035715	he	אוורואה						
11405143	4035715	hy	Ավարուա						
11405144	4035715	kk	Аваруа						
11405145	4035715	xmf	ავარუა						
13735898	4035715	unlc	CKAVA						
14893746	4035715	wkdt	Q170482						
1550340	4035716		Avana Creek						
4330203	4035716		Avana Stream						
1550341	4035717		Avaava Takuo						
4330204	4035717		Avaava Takue						
1550342	4035718		Avaavaroa						
4330205	4035718		Avaavaroa Passage						
13702137	4035719	en	Avaavaroa Creek						
1550343	4035721		Atuakora						
1550344	4035721		Atuakoro Landing						
4330206	4035721		Atuakono Landing						
1550345	4035722		Vatiu						
1550346	4035722		Wateeo						
1642291	4035722	es	Atiu						
1642292	4035722	de	Atiu						
1642293	4035722	en	Atiu Island						
1642294	4035722	ca	Atiu						
1642295	4035722	fi	Atiu						
1642296	4035722	fr	Île d'Atiu						
1642297	4035722	gl	Atiu						
1642298	4035722	it	Atiu						
1642299	4035722	nl	Atiu						
1642300	4035722	no	Atiu						
1642301	4035722	ru	Атиу						
1642302	4035722	sv	Atiu						
3056869	4035722	link	https://ru.wikipedia.org/wiki/%D0%90%D1%82%D0%B8%D1%83						
4330207	4035722		Atiu						
11573122	4035722	fa	آتیو						
11573123	4035722	he	אטיו						
11573124	4035722	ja	アチウ島						
11664403	4035722	iata	AIU						
13735896	4035722	unlc	CKAIU						
16206206	4035722	link	https://en.wikipedia.org/wiki/Atiu						
16650241	4035722		Enuamanu						
13702138	4035723	rar	Atimoono						
1550348	4035724		Arutunga Anchorage						
1550349	4035724		Arutunga						
4330208	4035724		Arutanga Anchorage						
1550350	4035725		Arutunga						
4330209	4035725		Arutanga						
7537940	4035725	link	https://en.wikipedia.org/wiki/Arutanga						
13735897	4035725	unlc	CKARU						
15495623	4035725	wkdt	Q2717494						
8097946	4035726	link	https://en.wikipedia.org/wiki/Arorangi						
8108858	4035726		Arorangi						
1550351	4035727		Arako						
4330210	4035727		Aroko						
13702139	4035728	en	Aroa Creek						
13702140	4035729	rar	Areora						
13702141	4035730	rar	Areora						
13702142	4035731	rar	Areora						
13702143	4035733	rar	Aremango						
13702144	4035734	rar	Arekai						
13702145	4035735	rar	Areiti						
13702146	4035736	rar	Arapaea						
13702147	4035737	rar	Aranganoa						
1550352	4035738		Avamutu						
4330211	4035738		Aramutu						
13702148	4035739	rar	Araki						
13702149	4035740	rar	Apai						
13702150	4035742	en	Angataura Landing						
13702151	4035742	rar	Angataura						
13702152	4035743	rar	Angaroa						
13702153	4035744	rar	Anganga						
15484883	4035745	wkdt	Q23005971						
15969137	4035745		Anchorage Island						
13702154	4035746	rar	Anaue						
13702155	4035747	rar	Anareia						
13702156	4035748	rar	Anareia						
13702157	4035749	rar	Ana o Ruarangi						
13702158	4035750	rar	Anaopera						
13702159	4035751	rar	Anaokai						
13702160	4035752	rar	Anamoko						
13702161	4035753	rar	Anaki Pao						
13702162	4035754	rar	Anaio						
13702163	4035756	rar	Akaro						
13702164	4035757	en	Akapuao Stream						
13702165	4035757	en	Akapuao Creek						
1550353	4035759		Aitutaki Islands						
1550354	4035759		Whytootake						
1550355	4035759		Aitutaki						
4330212	4035759		Aitutaki Atoll						
13702167	4035760	en	Aanga Landing						
13702168	4035760	rar	Aanga						
15251744	4036421	wkdt	Q23005963						
16044970	4036421		Toms						
15630987	4036422	wkdt	Q23005962						
16044971	4036422		Cooks						
15777063	4036424	wkdt	Q23005961						
16044972	4036424		Primrose						
15800005	4036425	wkdt	Q23005960						
16044973	4036425		Calcutta						
15891888	4036426	wkdt	Q23005959						
16044974	4036426		Aparanuta						
1550757	4036432		Village						
1550758	4036432		Home						
1550759	4036432		Palmerston Island Village						
4996389	4036432		Palmerston						
2989144	4036434	link	https://en.wikipedia.org/wiki/Scratch_My_Arse_Rock						
4996390	4036434		Scratch My Arse Rock						
15592561	4036441	wkdt	Q23007287						
16044975	4036441		North Island						
14932637	4036443	wkdt	Q23007285						
16044976	4036443		Tamaketa						
1550760	4036445		Marion Bank						
4996391	4036445		Marions Bank						
15311749	4036452	wkdt	Q23007283						
16044978	4036452		Motu Ngangie						
15655278	4036453	wkdt	Q23007282						
16044979	4036453		Lee to Us						
15676613	4036457	wkdt	Q23007278						
16044980	4036457		Leicester						
15227078	4036458	wkdt	Q23007277						
16044981	4036458		Aaron Point						
15773861	4036459	wkdt	Q23007276						
16044982	4036459		John Point						
15232080	4036461	wkdt	Q23007274						
16044983	4036461		Karakerake						
15525545	4036463	wkdt	Q23007273						
16044984	4036463		Marsters Basin						
13705541	4036464	en	Omutu Landing						
13705542	4036465	en	Mangarei Village						
13705543	4036466	rar	Te Rotonui						
13705544	4036467	en	Kimiangatau Village						
13705545	4036471	rar	Arikirauru						
13705546	4036472	rar	Mataara						
13705547	4036473	en	Konakonako Landing						
13705548	4036474	en	Takau-roa Landing						
13705549	4036474	en	Ta-Kau Landing						
13705550	4036475	rar	Te Ana Kota Are						
5905424	4036476	iata	MGS						
13136317	4036476	link	https://en.wikipedia.org/wiki/Mangaia_Airport						
13136318	4036476	icao	NCMG						
13705551	4036477	en	Temakatea Village						
13705552	4036477	rar	Te Makatea						
13705553	4036478	en	Kaumata Village						
13705554	4036478	rar	Kaumata						
13705555	4036479	en	Tava’enga Village						
13705556	4036480	en	Karanga Village						
13705557	4036481	en	Matie Kura Landing						
6894357	4036482	link	https://en.wikipedia.org/wiki/Lake_Tiriara						
6928052	4036482		Lake Tiriara						
13705558	4036483	en	Kopua Swamp						
13705559	4036484	en	Tamarua Swamp						
13705560	4036485	en	Keia Swamp						
13705561	4036486	en	Kirikiri Swamp						
13705562	4036487	en	Karanga Swamp						
1550761	4036488		Veitatei						
4996483	4036488		Veitate Swamp						
13705563	4036489	en	Tava’enga Swamp						
13705564	4036490	rar	Lake Kauravai						
13705565	4036491	rar	Lake Tepeuru Ngau						
13705566	4036492	rar	Lake Tepeuru Iti						
1892575	4036493	icao	NCRG						
1892576	4036493	iata	RAR						
5805942	4036493	link	https://en.wikipedia.org/wiki/Rarotonga_International_Airport						
8513220	4036493	en	Rarotonga International Airport						
8513221	4036493	wuu	拉罗汤加国际机场						
8513222	4036493	ru	Международный аэропорт Раротонга						
8513223	4036493	ja	ラロトンガ国際空港						
8513224	4036493	fa	فرودگاه بین‌المللی راروتونگا						
15708790	4036493	wkdt	Q954472						
13705567	4036494	en	Pue Stream						
13705568	4036497	en	Rutaki Stream						
8686014	4036498	link	https://en.wikipedia.org/wiki/Matavera						
8736219	4036498		Matavera						
13705569	4036499	rar	Te Tanga						
15888626	4036499	wkdt	Q23007257						
13705570	4036500	rar	Oroenga						
15396262	4036501	wkdt	Q23007255						
1550762	4036502		Black Rock						
4996484	4036502		Tuoro						
13705571	4036503	rar	Arore						
13705572	4036504	rar	Te Reinga o Pora						
15282988	4036504	wkdt	Q23007252						
13705573	4036505	rar	Te Kaki Motu						
13705574	4036505	rar	Te Kahi Motu						
13705575	4036506	rar	Maungapiko						
13705576	4036506	rar	Maugapiko						
13705577	4036507	en	Vaikapuangi Stream						
1647228	4036508	en	Aitutaki						
1647229	4036508	de	Aitutaki						
1647230	4036508	es	Aitutaki						
1647231	4036508	ca	Aitutaki						
1647232	4036508	fi	Aitutaki						
1647233	4036508	fr	Aitutaki						
1647234	4036508	gl	Illa Aitutaki						
1647235	4036508	nl	Aitutaki						
1647236	4036508	no	Aitutaki						
1647237	4036508	sv	Aitutaki						
1998238	4036508	ast	Aitutaki						
1998239	4036508	ja	アイツタキ島						
2989145	4036508	link	https://en.wikipedia.org/wiki/Aitutaki						
3056873	4036508	link	https://ru.wikipedia.org/wiki/%D0%90%D0%B8%D1%82%D1%83%D1%82%D0%B0%D0%BA%D0%B8						
4996491	4036508		Aitutaki						
8145787	4036508	iata	AIT						
9360506	4036508	ru	Аитутаки						
11385953	4036508	fa	آیتوتاکی						
11385954	4036508	he	אייטוטקי						
11947843	4036508	en	Wooded Island				1		
13735895	4036508	unlc	CKAIT						
16650239	4036508		Utataki						
16650240	4036508		Araʻura						
1550763	4036510		Mount Maungapu						
4996493	4036510		Maungapu						
6889297	4036512	link	https://en.wikipedia.org/wiki/Akitua						
6928053	4036512		Akitua						
15699596	4036512	wkdt	Q4701252						
5905841	4036513	iata	AIT						
6262804	4036513		Aitutaki Airstrip						
8145599	4036513	icao	NCAI						
8145600	4036513	link	https://en.wikipedia.org/wiki/Aitutaki_Airport						
8150415	4036513		Aitutaki Airport						
1550764	4036514		Vaitupa						
4996651	4036514		Vaitupa District						
1550765	4036515		Anaunga						
4996653	4036515		Anaunga District						
1550766	4036516		Avanui						
4996657	4036516		Avanui District						
1550767	4036517		Amuri						
4996658	4036517		Amuri District						
1550768	4036518		Arutanga						
4996659	4036518		Arutanga District						
13705578	4036520	rar	Vaipeka						
1550769	4036521		Taravoa						
4996661	4036521		Taravao District						
13705579	4036522	rar	Nikaupara						
6889326	4036523	link	https://en.wikipedia.org/wiki/Angarei						
6928054	4036523		Angarei						
15275307	4036523	wkdt	Q4761953						
6889886	4036524	link	https://en.wikipedia.org/wiki/Ee_%28island%29						
6928055	4036524		Ee						
15481266	4036524	wkdt	Q5347003						
6889067	4036526	link	https://en.wikipedia.org/wiki/Tavaeruaiti						
6928056	4036526		Tavaeruaiti						
15672977	4036526	wkdt	Q7688990						
6889494	4036527	link	https://en.wikipedia.org/wiki/Tavaerua						
6928057	4036527		Tavaerua						
15239534	4036527	wkdt	Q7688989						
13705580	4036528	rar	Reureu						
13705603	4036529	en	Tauhunu Landing						
13705604	4036530	rar	Te Rae						
13705605	4036531	rar	Te Motu o Koa						
13705606	4036532	rar	Tumuringa						
13705607	4036533	rar	Tokerau						
13705608	4036534	rar	Papara						
13705609	4036535	rar	Te Motu O Pange						
13705610	4036536	rar	Te Rua Hapuku						
13705611	4036537	rar	Hakamaru						
13705612	4036538	rar	Totia						
13705613	4036539	rar	Nukuhiro						
13705614	4036540	rar	Motu Tou						
13705615	4036541	rar	Tiri Kopu						
13705616	4036542	rar	Hakari Manu						
13705617	4036543	rar	Tarakete Iti						
13705618	4036544	rar	Tevahavaha						
15642942	4036544	wkdt	Q23007238						
13705619	4036545	rar	Nafarakura						
13705620	4036546	rar	Punganui Rahi						
13705621	4036547	rar	Punganui Iti						
13705622	4036548	rar	Te Ruerue Rahi						
13705623	4036549	rar	Te Ruerue Iti						
13705624	4036550	rar	Tupuaekaha						
13705625	4036551	rar	Motu Vahine						
13705626	4036552	rar	Tehapai						
13705627	4036553	rar	Motu Roa						
13705628	4036554	rar	Te Motu o Tarakapoe						
13705629	4036555	rar	Paheke Rahi						
13705630	4036556	rar	Paheke Iti						
13705631	4036557	rar	Te Pa						
13705632	4036558	rar	Tima						
16189417	4036558	link	https://en.wikipedia.org/wiki/Tima						
13705633	4036559	rar	Motu o Poia						
13705634	4036560	rar	Hohake Iti						
13705635	4036561	rar	Hohake Rahi						
13705636	4036562	rar	Motu o Koteka						
13705637	4036563	rar	Rangahoe						
13705638	4036564	rar	Mehau Daniela						
13705639	4036565	rar	Mangungu						
13705640	4036566	rar	Te Mea A Tamaunu						
13705641	4036567	rar	Mehau Matatia						
13705642	4036568	rar	Tengakura						
13705644	4036569	rar	Pohaturoa						
13705645	4036570	rar	Kokiri Lui						
13705646	4036571	rar	A Moko						
13705647	4036572	rar	Tutaeakari						
13705648	4036573	rar	Mehau Matatia						
13705649	4036574	rar	Lahu						
13705650	4036575	rar	Malopaua						
13705651	4036575	rar	Matopaua						
13705652	4036576	rar	Kokiri Tou						
13705653	4036577	rar	Ngana						
13705655	4036578	rar	Motu Ohou Kai Marau						
13705656	4036579	rar	Fareunati Ki Tai						
13705657	4036580	rar	Tearai Ki Tai						
13705658	4036581	rar	Tearai Ki Uta						
13705659	4036582	rar	Fareunati Ki Uta						
13705660	4036583	rar	Koutu						
13705661	4036584	rar	Ngaere						
5778818	4036585		Motu Teru						
5778819	4036585		Motu Taru						
13705662	4036586	rar	Ngatapuroa						
13705663	4036587	rar	Ngatapoto						
13705664	4036588	rar	Keturau Moremore						
13705665	4036589	rar	Keturau Ngangie						
13705666	4036590	rar	Ngamahuta						
13705667	4036591	rar	Paparoa						
13705668	4036592	rar	Rahea Ki Uta						
13705669	4036593	rar	Fifinui						
13705670	4036594	rar	Takaniko						
13705671	4036595	rar	Motu Ohou						
13705672	4036596	rar	Rahea Kitai						
5885477	7730684	iata	AIU						
5885478	7730684	icao	NCAT						
5885479	7730684	link	https://en.wikipedia.org/wiki/Enua_Airport						
11664398	7730684	en	Enua Airport						
11664399	7730684	fr	Aéroport d'Enua						
11664400	7730684	es	Aeropuerto de Enua						
11664401	7730684	de	Flughafen Enua						
11664402	7730684	en	Atiu Island Airport						
5885480	7730685	iata	MHX						
5885481	7730685	icao	NCMH						
5885482	7730685	link	https://en.wikipedia.org/wiki/Manihiki_Island_Airport						
5885483	7730686	iata	MUK						
5885484	7730686	icao	NCMK						
5885485	7730686	link	https://en.wikipedia.org/wiki/Mauke_Airport						
15618255	7730686	wkdt	Q6792410						
5885486	7730687	iata	MOI						
5885487	7730687	icao	NCMR						
5885488	7730687	link	https://en.wikipedia.org/wiki/Mitiaro_Airport						
13136356	7730687	en	Nukuroa Airport						
7487208	8260891	iata	PZK						
13136363	8260891	icao	NCPK						
13735904	8260891	unlc	CKPZK						
16225643	11695124	link	https://en.wikipedia.org/wiki/Aitutaki						
2989124	11695126	link	https://en.wikipedia.org/wiki/Atiu						
16225644	11695127	link	https://en.wikipedia.org/wiki/Mangaia						
13359716	11695384	link	https://en.wikipedia.org/wiki/Manihiki						
13359717	11695385	link	https://en.wikipedia.org/wiki/Mauke						
13359718	11695386	link	https://en.wikipedia.org/wiki/Mitiaro						
16225645	11695387	link	https://en.wikipedia.org/wiki/Palmerston_Island						
2989004	11695388	link	https://en.wikipedia.org/wiki/Penrhyn_%28atoll%29						
2989117	11695389	link	https://en.wikipedia.org/wiki/Pukapuka						
2989116	11695390	link	https://en.wikipedia.org/wiki/Rakahanga						
16225646	11695425	link	https://en.wikipedia.org/wiki/Rarotonga						
13706541	11876780	en	Pokoinu Road						
13706542	11876781	en	Nikao Maori School						
13706543	11876782	en	Avatea School						
13706544	11876783	en	Tereora College						
13706545	11876784	rar	Puapuautu						
13706546	11876785	rar	Kaikaveka						
13706547	11876786	rar	Ara Metua						
13706548	11876787	en	Nukutere College						
16194535	11876787	link	https://en.wikipedia.org/wiki/Nukutere_College						
13706549	11876788	rar	Maitai						
13706550	11876789	en	Yankee						
13706551	11876790	rar	Vaikai						
13706552	11876791	rar	Tapae I Uta						
13706553	11876792	rar	Tapae						
13706554	11876793	rar	Punataia						
13706555	11876794	rar	Kiikii						
13706556	11876795	rar	Araitetonga						
13706557	11876796	rar	Tupaoa						
13706558	11876797	rar	Vaenga						
13706559	11876798	rar	Turangi						
13706560	11876799	rar	Ngati Au						
13706561	11876800	rar	Ngati Maoate						
13706562	11876801	rar	Ngati Vaikai						
13706563	11876802	rar	Avana						
13706564	11876803	en	Iwakuni Maru Number One						
13706565	11876804	rar	Akapuao						
13706566	11876805	rar	Te Puna						
13706567	11876806	rar	Titikaveka						
13706568	11876807	rar	Kauare						
13706569	11876808	rar	Arakuo						
13706570	11876809	rar	Turoa						
13706571	11876810	rar	Totokoitu						
13706572	11876811	rar	Avaavaroa						
13706573	11876812	rar	Vaimaanga						
13706574	11876813	rar	Rutaki						
13706575	11876814	rar	Vaiakura						
13706576	11876815	rar	Kavera						
13706577	11876816	rar	Aroa						
13706578	11876817	rar	Arerenga						
13706579	11876818	rar	Inave						
13706580	11876819	rar	Tokerau						
13706581	11876820	rar	Pokoinu I Raro						
13706582	11876821	rar	Atupa						
13706583	11876822	rar	Avatiu						
16711139	11876822	unlc	CKATU						
13706584	11876823	rar	Ruatonga						
13706585	11876824	rar	Tauae						
13706586	11876825	rar	Takuvaine						
13706587	11876826	rar	Ngatipa						
13706588	11876827	en	Tamare Resort						
13706589	11876828	en	Kiikii Motel						
13706590	11876829	rar	Titama						
13706591	11876830	rar	Tupapa						
13706592	11876831	en	Norrie Park						
13706593	11876832	rar	Matavera						
13706594	11876833	en	Tumunu Tavern						
13706595	11876834	en	Department of Scientific and Industrial Research Observatory						
13706596	11876835	en	Paringaru Stream						
13706597	11876836	en	Kent Hall						
13706598	11876837	en	Turoa Stream						
13706599	11876838	rar	Ara Tapu						
13706600	11876839	rar	Air Raro						
13706601	11876840	rar	Pokoinu						
13706602	11876841	rar	Akaoa						
13706603	11876842	rar	Atiu						
13706609	11876845	rar	Paerangi						
13706610	11876846	rar	Matara						
13706611	11876847	rar	Tetaha Kiraro						
13706612	11876848	rar	Tetukono						
13706613	11876849	rar	Tua i o Tui						
13706614	11876850	rar	Tongareva						
13706615	11876851	rar	Te Tarerenga						
13706616	11876852	rar	Nivano						
13706617	11876853	rar	Tuputeru						
13706618	11876854	rar	Piritaki						
13706619	11876855	rar	Tutae Akari						
13706620	11876856	rar	Te Kanenurai						
13706621	11876857	rar	Motu Roroi						
13706622	11876858	rar	Papatiki						
13706623	11876859	rar	Te Motu Tavatava						
13706624	11876860	rar	Motu o Miritau						
13706625	11876861	rar	Te Mata i Pohonu						
13706626	11876862	rar	Te Aria						
13706627	11876863	rar	Tua i Omoe						
13706628	11876864	rar	Tua i Pikara						
13706629	11876865	rar	Tua i Moturoa						
13706630	11876866	rar	Motutapu						
13706631	11876867	rar	Te Motu o Tati						
13706632	11876868	rar	Te Motu o Umurua						
13706633	11876869	rar	Taungaroro Landing						
13706638	11876870	rar	Atiati						
13706640	11876871	rar	Kovea						
13706641	11876872	rar	Teroakuku						
13706642	11876873	rar	Oponui						
13706643	11876874	rar	Vaikoua						
13706644	11876875	rar	Oronogomai						
13706645	11876876	rar	Teruaeke						
13706646	11876877	rar	Koveta						
13706647	11876878	rar	Tua i Omoka						
13706648	11876879	rar	Tua i Hakapanoko						
13706649	11876880	rar	Tua i Kaitu						
13706650	11876881	rar	Tua i te au Marau						
13706651	11876882	rar	Tua Te Ngaroapapa						
13706652	11876883	rar	Tua i Takatungu						
13706653	11876884	rar	Tua i Pakuku						
13706654	11876885	rar	Piraungoio						
13706655	11876886	en	Auta Village						
13706656	11876887	en	Atai Village						
13706657	11876888	rar	Te Matarengarenga						
13706658	11876889	rar	Vainanao						
13706659	11876890	rar	Kaapoto						
13706660	11876891	rar	Okaraua						
13706661	11876892	rar	Kakenga a onu						
13706662	11876893	rar	Okore						
13706663	11876894	rar	Omapere						
13706664	11876895	rar	Parava						
13706665	11876896	rar	Nanamaru						
13706666	11876897	rar	Kakari						
13706667	11876898	rar	Te Unu						
13706668	11876899	rar	Te Kokonga						
13706669	11876900	rar	Oavea						
13706670	11876901	rar	Te Rua O Te Pui						
13706671	11876902	rar	Te Tua O Utu						
13706672	11876903	rar	Teruataura						
13706673	11876904	rar	Tiaara						
13706674	11876905	rar	Akapa						
13706675	11876906	rar	Taurangi						
13706676	11876907	rar	Atai and Aula						
13706677	11876908	en	Takaue Village						
13706678	11876909	en	Cook Islands Christian Church						
13706679	11876910	en	Onerua Landing						
13706680	11876911	rar	Tapuaetai						
15705342	11876911	wkdt	Q7684858						
16173608	11876911	link	https://en.wikipedia.org/wiki/Tapuaetai						
13706681	11876912	rar	Muritapua						
15723631	11876912	wkdt	Q6938744						
16202762	11876912	link	https://en.wikipedia.org/wiki/Muritapua						
13706682	11876913	en	Pacific Resort Aitutaki						
13706683	11876913	en	Rapae Motel						
13706684	11876914	en	Amuri School						
13706685	11876915	rar	Ureia						
13706686	11876916	en	Araura School						
13706687	11876917	en	Seventh Day Adventist School						
13706688	11876918	en	Cook Islands Christian Church						
13706689	11876919	en	Arutanga Seventh Day Adventist Church						
13706690	11876920	en	Cook Islands Christian Church						
13706691	11876921	en	Vaitau School						
13706692	11876922	en	Cook Islands Christian Church						
13706693	11876923	en	Christian Church Cook Island						
13706694	11876924	en	Roman Catholic Church and School						
13706695	11876925	en	Anaraura Landing						
13706696	11876926	en	Cook Islands Christian Church						
13706697	11876927	en	Oiretumu Village						
