<?xml version="1.0" encoding="UTF-8" standalone="no"?>
<svg
   xmlns:dc="http://purl.org/dc/elements/1.1/"
   xmlns:cc="http://creativecommons.org/ns#"
   xmlns:rdf="http://www.w3.org/1999/02/22-rdf-syntax-ns#"
   xmlns:svg="http://www.w3.org/2000/svg"
   xmlns="http://www.w3.org/2000/svg"
   xmlns:sodipodi="http://sodipodi.sourceforge.net/DTD/sodipodi-0.dtd"
   xmlns:inkscape="http://www.inkscape.org/namespaces/inkscape"
   height="96"
   viewBox="0 0 96 96.000001"
   width="96"
   version="1.1"
   id="svg32"
   sodipodi:docname="weather-sleet3-symbolic.svg"
   inkscape:version="1.0.1 (0767f8302a, 2020-10-17)">
  <metadata
     id="metadata38">
    <rdf:RDF>
      <cc:Work
         rdf:about="">
        <dc:format>image/svg+xml</dc:format>
        <dc:type
           rdf:resource="http://purl.org/dc/dcmitype/StillImage" />
        <dc:title />
      </cc:Work>
    </rdf:RDF>
  </metadata>
  <defs
     id="defs36" />
  <sodipodi:namedview
     pagecolor="#ffffff"
     bordercolor="#666666"
     borderopacity="1"
     objecttolerance="10"
     gridtolerance="10"
     guidetolerance="10"
     inkscape:pageopacity="0"
     inkscape:pageshadow="2"
     inkscape:window-width="1848"
     inkscape:window-height="1016"
     id="namedview34"
     showgrid="false"
     inkscape:zoom="6.4081552"
     inkscape:cx="55.111175"
     inkscape:cy="46.060439"
     inkscape:window-x="72"
     inkscape:window-y="27"
     inkscape:window-maximized="1"
     inkscape:current-layer="g16"
     inkscape:document-rotation="0" />
  <g
     transform="translate(67.86 -78.51)"
     id="g30">
    <g
       transform="matrix(0 -1 -1 0 373.5 516.5)"
       id="g28">
      <g
         transform="matrix(-.9996 0 0 1 575.9 -611)"
         id="g26">
        <g
           transform="matrix(-1 0 0 1 576 611)"
           id="g24">
          <rect
             style="color:#000000"
             transform="scale(-1,1)"
             height="96"
             width="96.04"
             y="345.4"
             x="-438"
             fill="none"
             id="rect2" />
          <path
             style="color:#000000"
             d="m58.78 3.891c-7.51 0.009-14.56 3.614-18.97 9.699-1.64-0.46-3.33-0.7-5.02-0.71-10.09 0.02-18.35 8.02-18.7 18.11-6.892 0.83-12.08 6.68-12.09 13.63 0 7.59 6.14 13.75 13.72 13.75h7.22c-1.23-1.14-2.28-2.49-3.06-4h-4.16c-5.41 0-9.72-4.32-9.72-9.75 0.009-4.96 3.66-9.07 8.57-9.66l3.4-0.41 0.12-3.42c0.28-7.98 6.73-14.23 14.69-14.24 1.33 0 2.66 0.19 3.94 0.55l2.69 0.76 1.64-2.26c3.66-5.05 9.5-8.041 15.72-8.051 10.63 0.006 19.23 8.441 19.46 19.09l0.06 2.55 2.32 1.02c4.5 2 7.39 6.44 7.39 11.37 0 6.57-4.96 11.86-11.36 12.4-0.45 1.45-1.19 2.77-2.14 3.9 0.69 0.02 1.41 0.04 1.56 0.12 8.84-0.25 15.94-7.5 15.94-16.42 0-6.5-3.83-12.39-9.77-15.02-0.27-12.78-10.69-23-23.45-23.01z"
             transform="matrix(0 -1 -1 0 438 441.4)"
             fill="#808080"
             id="path4" />
          <path
             style="color-rendering:auto;color:#000000;shape-rendering:auto;text-decoration-line:none;image-rendering:auto;text-indent:0;text-transform:none"
             d="m419.4 387.7c0 7.81-4.829 14.44-11.68 17.6-0.5352 7.334-6.883 13.12-14.57 13.12-8.028 0-14.66-6.293-14.66-14.1v-32.11c0-5.967 5.071-10.77 11.18-10.77 4.633 0 8.545 2.784 10.23 6.736 10.79 0.4878 19.5 8.98 19.5 19.53zm-4 0c0-8.343-6.893-15.13-15.68-15.53l-2.517-0.1133-0.9828-2.316c-1.072-2.518-3.517-4.303-6.548-4.303-4.008 0-7.177 3.073-7.177 6.773v32.11c0 5.537 4.718 10.09 10.65 10.09 5.676 0 10.2-4.208 10.58-9.404l0.1719-2.357 2.147-0.9863c5.568-2.561 9.355-7.802 9.355-13.96z"
             fill="#808080"
             id="path6" />
          <g
             transform="matrix(0 -1 -1 0 516.5 473.5)"
             id="g22">
            <g
               transform="matrix(0 -1 -1 0 373.5 516.5)"
               id="g20">
              <g
                 transform="matrix(-.9996 0 0 1 575.9 -601)"
                 id="g18">
                <g
                   transform="matrix(-1 0 0 1 576 611.9)"
                   fill="#808080"
                   id="g16">
                  <g
                     id="g37"
                     transform="matrix(0,-0.442,-0.44235381,0,389.35315,782.67583)">
                    <path
                       style="color:#000000;fill:#808080;stroke-width:2.66647"
                       d="m 1053.1746,37.606171 3.4644,-0.61316 v 32.44441 h -3.4644 z"
                       id="path12-3" />
                    <rect
                       style="color:#000000;fill:#808080;stroke-width:2.66641"
                       transform="matrix(-0.50004273,-0.86600073,0.86603737,-0.49997927,0,0)"
                       height="32.425575"
                       width="3.4634442"
                       y="870.79596"
                       x="-575.11151"
                       id="rect14" />
                    <rect
                       style="color:#000000;fill:#808080;stroke-width:2.66641"
                       transform="matrix(0.50004273,-0.86600073,-0.86603737,-0.49997927,0,0)"
                       height="32.425575"
                       width="3.4634442"
                       y="-956.51575"
                       x="479.61993"
                       id="rect16" />
                  </g>
                  <g
                     id="g32-5"
                     transform="matrix(0,-0.442,-0.44235381,0,390.36299,737.73543)">
                    <path
                       style="color:#000000;fill:#808080;stroke-width:2.66647"
                       d="m 1099.047,49.602871 5.1153,-0.90535 v 47.88016 h -5.1153 z"
                       id="path18-6" />
                    <rect
                       style="color:#000000;fill:#808080;stroke-width:2.66641"
                       transform="matrix(-0.50004273,-0.86600073,0.86603737,-0.49997927,0,0)"
                       height="47.865059"
                       width="5.1165123"
                       y="893.72852"
                       x="-616.17169"
                       id="rect20-2" />
                    <rect
                       style="color:#000000;fill:#808080;stroke-width:2.66641"
                       transform="matrix(0.50004273,-0.86600073,-0.86603737,-0.49997927,0,0)"
                       height="47.865059"
                       width="5.1165123"
                       y="-1014.3799"
                       x="485.48566"
                       id="rect22-9" />
                  </g>
                  <path
                     inkscape:transform-center-x="0.0040296009"
                     inkscape:transform-center-y="-7.9703526"
                     inkscape:connector-curvature="0"
                     id="path4248"
                     d="m 348.61132,295.11806 c 0,3.064 2.48478,5.5478 5.54997,5.5478 0.60862,0 1.19254,-0.1031 1.74049,-0.2835 0.0557,-0.018 0.11315,-0.033 0.16809,-0.053 0.46777,-0.1412 7.26591,-2.2123 13.36229,-5.2168 0,0 -5.7e-4,0 -0.001,0 -5.7e-4,0 -0.002,0 -0.004,0 -0.001,0 -0.002,0 -0.003,0 -5.7e-4,0 -10e-4,0 -10e-4,0 -6.65829,-3.21 -13.52133,-5.2506 -13.52133,-5.2506 v 0 c -0.54763,-0.1807 -1.13224,-0.2799 -1.74048,-0.2799 -3.06518,0 -5.54995,2.4839 -5.54995,5.5479 z"
                     style="color:#000000;display:inline;overflow:visible;visibility:visible;fill:#808080;fill-opacity:1;fill-rule:nonzero;stroke:none;stroke-width:3.0012;marker:none;enable-background:accumulate" />
                  <path
                     style="color:#000000;display:inline;overflow:visible;visibility:visible;fill:#808080;fill-opacity:1;fill-rule:nonzero;stroke:none;stroke-width:3.0012;marker:none;enable-background:accumulate"
                     d="m 355.22093,272.75536 c 0,2.4333 1.97331,4.4058 4.40756,4.4058 0.48335,0 0.94707,-0.081 1.38224,-0.2252 0.0442,-0.014 0.0898,-0.026 0.13347,-0.042 0.37149,-0.1122 5.7703,-1.757 10.6118,-4.143 0,0 -5.6e-4,0 -10e-4,0 -5.6e-4,0 -10e-4,0 -0.003,0 -8.4e-4,0 -0.002,0 -0.003,0 -5.6e-4,0 -0.001,0 -0.001,0 -5.28775,-2.5494 -10.7381,-4.17 -10.7381,-4.17 v 0 c -0.43491,-0.1434 -0.89917,-0.2222 -1.38221,-0.2222 -2.43425,0 -4.40756,1.9726 -4.40756,4.4058 z"
                     id="path4274"
                     inkscape:connector-curvature="0"
                     inkscape:transform-center-y="-6.3297277"
                     inkscape:transform-center-x="0.0040142635" />
                </g>
              </g>
            </g>
          </g>
        </g>
      </g>
    </g>
  </g>
</svg>
