{
    "_id": "635695543c09e90010212351",
    "applicationId": "jetsondashboard",
    "organizationId": "Org",
    "pluginType": "API",
    "pluginId": "API",
    "unpublishedAction": {
        "name": "loadMapOfBooks",
        "datasource": {
            "invalids": [],
            "datasourceConfiguration": {
                "url": "https://noderedritman-6335828aa386c31100000ae2.ubos.tech"
            },
            "isValid": true,
            "name": "NodeRedRitman",
            "new": true,
            "organizationId": "Org",
            "pluginId": "API",
            "userPermissions": []
        },
        "executeOnLoad": true,
        "pageId": "Dashboard1",
        "actionConfiguration": {
            "timeoutInMillisecond": 10000,
            "encodeParamsToggle": true,
            "httpMethod": "POST",
            "headers": [
                {
                    "key": "content-type",
                    "value": "application/json"
                }
            ],
            "queryParameters": [],
            "body": "{\n\t\"year_from\": \"{{year_from_field.formattedDate}}\",\n\t\"year_to\": \"{{year_to_field.formattedDate}}\",\n\t\"keywords\": {{keywords_input.selectedOptionValues}},\n\t\"limit_count\": {{Limit_count_input.text}}\n}",
            "bodyFormData": [],
            "formData": {
                "apiContentType": "application/json"
            },
            "pluginSpecifiedTemplates": [
                {
                    "value": true
                }
            ],
            "path": "/getBooksForMap"
        },
        "dynamicBindingPathList": [],
        "isValid": true,
        "invalids": [],
        "jsonPathKeys": [
            "year_from_field.formattedDate",
            "year_to_field.formattedDate",
            "keywords_input.selectedOptionValues",
            "Limit_count_input.text"
        ],
        "userSetOnLoad": false,
        "confirmBeforeExecute": false
    },
    "createdAt": "2022-10-24T13:38:28.576Z",
    "updatedAt": "2022-10-27T16:45:02.491Z",
    "deleted": true,
    "policies": [
        {
            "permission": "read:actions",
            "groups": [],
            "users": []
        },
        {
            "permission": "manage:actions",
            "groups": [],
            "users": []
        },
        {
            "permission": "execute:actions",
            "groups": [],
            "users": []
        }
    ],
    "publishedAction": {
        "name": "loadMapOfBooks",
        "datasource": {
            "invalids": [],
            "datasourceConfiguration": {
                "url": "https://noderedritman-6335828aa386c31100000ae2.ubos.tech"
            },
            "isValid": true,
            "name": "NodeRedRitman",
            "new": true,
            "organizationId": "Org",
            "pluginId": "API",
            "userPermissions": []
        },
        "executeOnLoad": true,
        "pageId": "Dashboard1",
        "actionConfiguration": {
            "timeoutInMillisecond": 10000,
            "encodeParamsToggle": true,
            "httpMethod": "POST",
            "headers": [
                {
                    "key": "content-type",
                    "value": "application/json"
                }
            ],
            "queryParameters": [],
            "body": "{\n\t\"year_from\": \"{{year_from_field.formattedDate}}\",\n\t\"year_to\": \"{{year_to_field.formattedDate}}\",\n\t\"keywords\": {{keywords_input.selectedOptionValues}},\n\t\"limit_count\": {{Limit_count_input.text}}\n}",
            "bodyFormData": [],
            "formData": {
                "apiContentType": "application/json"
            },
            "pluginSpecifiedTemplates": [
                {
                    "value": true
                }
            ],
            "path": "/getBooksForMap"
        },
        "dynamicBindingPathList": [],
        "isValid": true,
        "invalids": [],
        "jsonPathKeys": [
            "year_from_field.formattedDate",
            "year_to_field.formattedDate",
            "keywords_input.selectedOptionValues",
            "Limit_count_input.text"
        ],
        "userSetOnLoad": false,
        "confirmBeforeExecute": false
    },
    "deletedAt": "2022-10-31T22:23:59.586Z"
}
