{
    "_id": "6360f7331197b60011b3a9b8",
    "name": "dataOnTheMap",
    "collectionId": "635bd0363b28da1100000002",
    "executeOnLoad": false,
    "pageId": "Dashboard",
    "organizationId": "Org",
    "actionConfiguration": {
        "body": "async () => {\n\t\tif(!Object.entries(main.store).length) {\n\t\t\t// Will call only old data saved in Local Storage\n\t\t\treturn;\n\t\t}\n\t\tlet arr = main.store.InitMapData;\n\t\t\n\t\t\n\t\t/*  Categories:   */\n\t\tif (List1Copy.selectedItem.name && List1Copy.selectedItem.name !== \"<b>ALL</b>\") {\n\t\t\tif (List1Copy.selectedItem.name === 'No category') {\n\t\t\t\tarr = arr.filter(el=>!el.keywords)\n\t\t\t} else {\n\t\t   arr = arr.filter(el => el.keywords.toLocaleLowerCase() == List1Copy.selectedItem.name.toLocaleLowerCase())\n\t\t\t}\n\t\t}\n\t\t\n\t\t\n\t\t/*  Map:   */ \n\t\tif (Object.entries(MapOfBooksPublication.getBounds).length) {\n\t\t\tarr = arr.filter(el => (\n\t\t\t\tel.lon >\n\t\t\t\tMapOfBooksPublication.getBounds.west && el.lon <\n\t\t\t\tMapOfBooksPublication.getBounds.east &&  el.lat > \n\t\t\t\tMapOfBooksPublication.getBounds.south && el.lat < \n\t\t\t\tMapOfBooksPublication.getBounds.north\n\t\t\t))\n\t\t}\n\t\t\n\t\t\n\t\t/*  Timeline:   */\n\t\tif (LargeAreaChart.filteredData && LargeAreaChart.filteredData.length > 0) { \n\t\t\t\tarr = arr.filter(el => el.year_of_publication >= LargeAreaChart.filteredData[0].time && el.year_of_publication <= LargeAreaChart.filteredData[LargeAreaChart.filteredData.length - 1].time);\n\t\t}\n\t\t\n\t\tconst count = {}; \n\t\tfor (let data of arr) {\t\t\t\n\t\t\t\tlet dataTime = data.year_of_publication;\n\t\t\t\tcount[dataTime] = count[dataTime] ? count[dataTime] + 1 : 1;\n\t\t}\n\t\tconst res = Object.entries(count).map(i => ({time: i[0], count: i[1]}));\n\t\tlet result = [];\n\n\t\tif (res && res.length > 0) {\n\t\t\tlet start = parseInt(year_from_field.selectedDate.slice(0, 10));\n\t\t\tconst end = parseInt(year_to_field.selectedDate.slice(0, 10));\n\t\t\t\n\t\t\tfor(let i = start; i <= end; i++){\n\t\t\t\tresult.push({ \"time\": String(i), \"count\": count[i] ? count[i] : 0 })\n\t\t\t}\n\t\t}\n\t\t\n\t\t\n\t\tstoreValue(\"timlineDataGlobal\", result)\n\t\tstoreValue(\"dataFromMap\", arr)\n\t\t//arr = arr.length ? arr : main.store.InitMapData;\n\t\treturn arr;\n\t}",
        "isAsync": true,
        "timeoutInMillisecond": 10000,
        "jsArguments": [],
        "paginationType": "NONE",
        "encodeParamsToggle": true
    },
    "applicationId": "jetsondashboard",
    "datasource": {
        "isValid": true,
        "messages": [],
        "name": "UNUSED_DATASOURCE",
        "new": true,
        "organizationId": "Org",
        "pluginId": "",
        "userPermissions": []
    },
    "dynamicBindingPathList": [
        {
            "key": "body"
        }
    ],
    "fullyQualifiedName": "funcs.dataOnTheMap",
    "isValid": true,
    "jsonPathKeys": [
        "() => {\n\t\tlet arr=[]\n\t\tif(main.store.filterByCategroy){\n\t\tarr = main.store.DataForZoomAfterFilter;\n\t\t}\n\t\telse{\n\t\t\tarr=main.store.InitMapData\t\t\t\n\t\t}\n\t\t\n\t\tif(MapOfBooksPublication.getBounds) {\n\t\t\tarr = arr.filter(el => (\n\t\t\t\tel.lon >\n\t\t\t\tMapOfBooksPublication.getBounds.west && el.lon <\n\t\t\t\tMapOfBooksPublication.getBounds.east &&  el.lat > \n\t\t\t\tMapOfBooksPublication.getBounds.south && el.lat < \n\t\t\t\tMapOfBooksPublication.getBounds.north\n\t\t\t))\n\t\t}\n\t\tstoreValue(\"dataFromMap\", arr)\n\t\treturn arr;\n\t}"
    ],
    "pluginType": "JS",
    "id": "6360f7331197b60011b3a9b8"
}
