{
    "_id": "635aa072a0f9ad0011c9bb7b",
    "applicationId": "jetsondashboard",
    "organizationId": "Org",
    "pluginType": "API",
    "pluginId": "API",
    "unpublishedAction": {
        "name": "getKeywords",
        "datasource": {
            "invalids": [],
            "datasourceConfiguration": {
                "url": "https://noderedritman-6335828aa386c31100000ae2.ubos.tech"
            },
            "isValid": true,
            "name": "NodeRedRitman",
            "new": true,
            "organizationId": "Org",
            "pluginId": "API",
            "userPermissions": []
        },
        "executeOnLoad": true,
        "pageId": "Dashboard1",
        "actionConfiguration": {
            "timeoutInMillisecond": 10000,
            "encodeParamsToggle": true,
            "httpMethod": "GET",
            "headers": [
                {
                    "key": "content-type",
                    "value": "application/json"
                }
            ],
            "queryParameters": [],
            "bodyFormData": [],
            "formData": {
                "apiContentType": "application/json"
            },
            "pluginSpecifiedTemplates": [
                {
                    "value": true
                }
            ],
            "path": "/getKeywords",
            "body": "{\n\t\"keywords\": {{keywords_input.selectedOptionValues}}\n}"
        },
        "dynamicBindingPathList": [
            {
                "key": "body"
            }
        ],
        "isValid": true,
        "invalids": [],
        "jsonPathKeys": [
            "keywords_input.selectedOptionValues"
        ],
        "userSetOnLoad": false,
        "confirmBeforeExecute": false
    },
    "createdAt": "2022-10-27T15:14:58.579Z",
    "updatedAt": "2022-10-27T15:14:58.579Z",
    "deleted": false,
    "policies": [
        {
            "permission": "read:actions",
            "groups": [],
            "users": []
        },
        {
            "permission": "manage:actions",
            "groups": [],
            "users": []
        },
        {
            "permission": "execute:actions",
            "groups": [],
            "users": []
        }
    ],
    "publishedAction": {
        "name": "getKeywords",
        "datasource": {
            "invalids": [],
            "datasourceConfiguration": {
                "url": "https://noderedritman-6335828aa386c31100000ae2.ubos.tech"
            },
            "isValid": true,
            "name": "NodeRedRitman",
            "new": true,
            "organizationId": "Org",
            "pluginId": "API",
            "userPermissions": []
        },
        "executeOnLoad": true,
        "pageId": "Dashboard1",
        "actionConfiguration": {
            "timeoutInMillisecond": 10000,
            "encodeParamsToggle": true,
            "httpMethod": "GET",
            "headers": [
                {
                    "key": "content-type",
                    "value": "application/json"
                }
            ],
            "queryParameters": [],
            "bodyFormData": [],
            "formData": {
                "apiContentType": "application/json"
            },
            "pluginSpecifiedTemplates": [
                {
                    "value": true
                }
            ],
            "path": "/getKeywords",
            "body": "{\n\t\"keywords\": {{keywords_input.selectedOptionValues}}\n}"
        },
        "dynamicBindingPathList": [
            {
                "key": "body"
            }
        ],
        "isValid": true,
        "invalids": [],
        "jsonPathKeys": [
            "keywords_input.selectedOptionValues"
        ],
        "userSetOnLoad": false,
        "confirmBeforeExecute": false
    }
}
