{
    "_id": "630cd78af720481100000015",
    "applicationId": "jetsondashboard",
    "organizationId": "Org",
    "pluginType": "API",
    "pluginId": "API",
    "unpublishedAction": {
        "name": "login",
        "datasource": {
            "invalids": [],
            "datasourceConfiguration": {
                "url": "{{main.env.nodeUrl}}/login"
            },
            "isValid": true,
            "name": "DEFAULT_REST_DATASOURCE",
            "new": true,
            "organizationId": "Org",
            "pluginId": "API",
            "userPermissions": []
        },
        "executeOnLoad": false,
        "pageId": "Login",
        "actionConfiguration": {
            "timeoutInMillisecond": 10000,
            "encodeParamsToggle": true,
            "httpMethod": "POST",
            "headers": [
                {
                    "key": "content-type",
                    "value": "application/json"
                }
            ],
            "queryParameters": [],
            "body": "{\n\t\"email\":\"{{email_field.text}}\",\n\t\"password\":\"{{pass_field.text}}\"\n}",
            "bodyFormData": [],
            "formData": {
                "apiContentType": "none"
            },
            "pluginSpecifiedTemplates": [
                {
                    "value": true
                }
            ],
            "path": ""
        },
        "dynamicBindingPathList": [
            {
                "key": "body"
            },
            {
                "key": "datasourceUrl"
            }
        ],
        "isValid": true,
        "invalids": [],
        "jsonPathKeys": [
            "email_field.text",
            "pass_field.text",
            "main.env.nodeUrl"
        ],
        "userSetOnLoad": false,
        "confirmBeforeExecute": false
    },
    "createdAt": "2022-08-29T15:13:14.157Z",
    "updatedAt": "2023-02-17T21:12:49.934Z",
    "deleted": false,
    "policies": [
        {
            "permission": "read:actions",
            "groups": [],
            "users": []
        },
        {
            "permission": "manage:actions",
            "groups": [],
            "users": []
        },
        {
            "permission": "execute:actions",
            "groups": [],
            "users": []
        }
    ],
    "publishedAction": {
        "name": "login",
        "datasource": {
            "invalids": [],
            "datasourceConfiguration": {
                "url": "{{main.env.nodeUrl}}/login"
            },
            "isValid": true,
            "name": "DEFAULT_REST_DATASOURCE",
            "new": true,
            "organizationId": "Org",
            "pluginId": "API",
            "userPermissions": []
        },
        "executeOnLoad": false,
        "pageId": "Login",
        "actionConfiguration": {
            "timeoutInMillisecond": 10000,
            "encodeParamsToggle": true,
            "httpMethod": "POST",
            "headers": [
                {
                    "key": "content-type",
                    "value": "application/json"
                }
            ],
            "queryParameters": [],
            "body": "{\n\t\"email\":\"{{email_field.text}}\",\n\t\"password\":\"{{pass_field.text}}\"\n}",
            "bodyFormData": [],
            "formData": {
                "apiContentType": "none"
            },
            "pluginSpecifiedTemplates": [
                {
                    "value": true
                }
            ],
            "path": ""
        },
        "dynamicBindingPathList": [
            {
                "key": "body"
            },
            {
                "key": "datasourceUrl"
            }
        ],
        "isValid": true,
        "invalids": [],
        "jsonPathKeys": [
            "email_field.text",
            "pass_field.text",
            "main.env.nodeUrl"
        ],
        "userSetOnLoad": false,
        "confirmBeforeExecute": false
    }
}
