{
    "_id": "6362835b65d44c1100000003",
    "applicationId": "jetsondashboard",
    "organizationId": "Org",
    "pluginType": "API",
    "pluginId": "API",
    "unpublishedAction": {
        "name": "deleteBook",
        "datasource": {
            "invalids": [],
            "datasourceConfiguration": {
                "url": "https://noderedritman-6335828aa386c31100000ae2.ubos.tech"
            },
            "isValid": true,
            "name": "NodeRedRitman",
            "new": true,
            "organizationId": "Org",
            "pluginId": "API",
            "userPermissions": []
        },
        "executeOnLoad": false,
        "pageId": "Admin",
        "actionConfiguration": {
            "timeoutInMillisecond": 10000,
            "encodeParamsToggle": true,
            "httpMethod": "DELETE",
            "headers": [
                {
                    "key": "content-type",
                    "value": "application/json"
                }
            ],
            "queryParameters": [],
            "body": "{\n\t\"uuid\": \"{{TableBooks.selectedRow.uuid}}\"\n}",
            "bodyFormData": [],
            "formData": {
                "apiContentType": "application/json"
            },
            "pluginSpecifiedTemplates": [
                {
                    "value": true
                }
            ],
            "path": "/deleteBook"
        },
        "dynamicBindingPathList": [
            {
                "key": "body"
            }
        ],
        "isValid": true,
        "invalids": [],
        "jsonPathKeys": [
            "TableBooks.selectedRow.uuid"
        ],
        "userSetOnLoad": false,
        "confirmBeforeExecute": false
    },
    "createdAt": "2022-11-02T14:48:59.475Z",
    "updatedAt": "2022-11-02T14:50:22.044Z",
    "deleted": false,
    "policies": [
        {
            "permission": "read:actions",
            "groups": [],
            "users": []
        },
        {
            "permission": "manage:actions",
            "groups": [],
            "users": []
        },
        {
            "permission": "execute:actions",
            "groups": [],
            "users": []
        }
    ],
    "publishedAction": {
        "name": "deleteBook",
        "datasource": {
            "invalids": [],
            "datasourceConfiguration": {
                "url": "https://noderedritman-6335828aa386c31100000ae2.ubos.tech"
            },
            "isValid": true,
            "name": "NodeRedRitman",
            "new": true,
            "organizationId": "Org",
            "pluginId": "API",
            "userPermissions": []
        },
        "executeOnLoad": false,
        "pageId": "Admin",
        "actionConfiguration": {
            "timeoutInMillisecond": 10000,
            "encodeParamsToggle": true,
            "httpMethod": "DELETE",
            "headers": [
                {
                    "key": "content-type",
                    "value": "application/json"
                }
            ],
            "queryParameters": [],
            "body": "{\n\t\"uuid\": \"{{TableBooks.selectedRow.uuid}}\"\n}",
            "bodyFormData": [],
            "formData": {
                "apiContentType": "application/json"
            },
            "pluginSpecifiedTemplates": [
                {
                    "value": true
                }
            ],
            "path": "/deleteBook"
        },
        "dynamicBindingPathList": [
            {
                "key": "body"
            }
        ],
        "isValid": true,
        "invalids": [],
        "jsonPathKeys": [
            "TableBooks.selectedRow.uuid"
        ],
        "userSetOnLoad": false,
        "confirmBeforeExecute": false
    }
}
