{
    "_id": "634fb3114f75a91100000001",
    "applicationId": "jetsondashboard",
    "organizationId": "Org",
    "pluginType": "API",
    "pluginId": "API",
    "unpublishedAction": {
        "name": "signout",
        "datasource": {
            "datasourceConfiguration": {
                "url": "https://noderedritman-6335828aa386c31100000ae2.ubos.tech"
            },
            "id": "633aa88d9c7b0a0011f33c16",
            "invalids": [],
            "isValid": true,
            "name": "NodeRedRitman",
            "new": false,
            "type": "api",
            "organizationId": "Org",
            "pluginId": "API",
            "userPermissions": [
                "execute:datasources",
                "read:datasources",
                "manage:datasources"
            ],
            "settings_data": {
                "gitName": "",
                "projectName": "NodeRedRitman",
                "systemType": "latest",
                "gitUrl": "",
                "gitPassword": "",
                "urlNodeRed": "https://noderedritman-6335828aa386c31100000ae2.ubos.tech",
                "serviceId": "noderedritman6335828aa386c31100000ae2ubraine",
                "applicationId": "6335828aa386c31100000ae2",
                "env": [],
                "status": "ready"
            }
        },
        "executeOnLoad": false,
        "pageId": "DashboardOld",
        "actionConfiguration": {
            "timeoutInMillisecond": 10000,
            "encodeParamsToggle": true,
            "httpMethod": "POST",
            "headers": [
                {
                    "key": "content-type",
                    "value": "application/json"
                }
            ],
            "queryParameters": [],
            "bodyFormData": [],
            "formData": {
                "apiContentType": "none"
            },
            "pluginSpecifiedTemplates": [
                {
                    "value": true
                }
            ],
            "path": "/signout",
            "body": ""
        },
        "dynamicBindingPathList": [],
        "isValid": true,
        "invalids": [],
        "jsonPathKeys": [],
        "userSetOnLoad": false,
        "confirmBeforeExecute": false
    },
    "createdAt": "2022-10-19T08:19:29.473Z",
    "updatedAt": "2022-10-19T08:19:39.381Z",
    "deleted": false,
    "policies": [
        {
            "permission": "read:actions",
            "groups": [],
            "users": []
        },
        {
            "permission": "manage:actions",
            "groups": [],
            "users": []
        },
        {
            "permission": "execute:actions",
            "groups": [],
            "users": []
        }
    ],
    "publishedAction": {
        "name": "signout",
        "datasource": {
            "datasourceConfiguration": {
                "url": "https://noderedritman-6335828aa386c31100000ae2.ubos.tech"
            },
            "id": "633aa88d9c7b0a0011f33c16",
            "invalids": [],
            "isValid": true,
            "name": "NodeRedRitman",
            "new": false,
            "type": "api",
            "organizationId": "Org",
            "pluginId": "API",
            "userPermissions": [
                "execute:datasources",
                "read:datasources",
                "manage:datasources"
            ],
            "settings_data": {
                "gitName": "",
                "projectName": "NodeRedRitman",
                "systemType": "latest",
                "gitUrl": "",
                "gitPassword": "",
                "urlNodeRed": "https://noderedritman-6335828aa386c31100000ae2.ubos.tech",
                "serviceId": "noderedritman6335828aa386c31100000ae2ubraine",
                "applicationId": "6335828aa386c31100000ae2",
                "env": [],
                "status": "ready"
            }
        },
        "executeOnLoad": false,
        "pageId": "DashboardOld",
        "actionConfiguration": {
            "timeoutInMillisecond": 10000,
            "encodeParamsToggle": true,
            "httpMethod": "POST",
            "headers": [
                {
                    "key": "content-type",
                    "value": "application/json"
                }
            ],
            "queryParameters": [],
            "bodyFormData": [],
            "formData": {
                "apiContentType": "none"
            },
            "pluginSpecifiedTemplates": [
                {
                    "value": true
                }
            ],
            "path": "/signout",
            "body": ""
        },
        "dynamicBindingPathList": [],
        "isValid": true,
        "invalids": [],
        "jsonPathKeys": [],
        "userSetOnLoad": false,
        "confirmBeforeExecute": false
    }
}
