{
    "_id": "63565dd3d1e1de1000000001",
    "applicationId": "jetsondashboard",
    "slug": "queryToResetPassword",
    "unpublishedPage": {
        "name": "queryToResetPassword",
        "layouts": [
            {
                "_id": "63565dd3d1e1de1000000002",
                "viewMode": false,
                "dsl": {
                    "widgetName": "MainContainer",
                    "backgroundColor": "none",
                    "rightColumn": 1224,
                    "snapColumns": 64,
                    "widgetId": "0",
                    "topRow": 0,
                    "bottomRow": 1290,
                    "parentRowSpace": 1,
                    "type": "CANVAS_WIDGET",
                    "detachFromLayout": true,
                    "minHeight": 760,
                    "dynamicBindingPathList": [],
                    "parentColumnSpace": 1,
                    "leftColumn": 0,
                    "children": [
                        {
                            "isVisible": true,
                            "backgroundColor": "#FFFFFF",
                            "widgetName": "Container2",
                            "containerStyle": "card",
                            "borderColor": "transparent",
                            "borderWidth": "0",
                            "borderRadius": "0",
                            "boxShadow": "NONE",
                            "animateLoading": true,
                            "children": [
                                {
                                    "isVisible": true,
                                    "widgetName": "Canvas13",
                                    "version": 1,
                                    "detachFromLayout": true,
                                    "type": "CANVAS_WIDGET",
                                    "hideCard": true,
                                    "displayName": "Canvas",
                                    "key": "l6lft6vszh",
                                    "containerStyle": "none",
                                    "canExtend": false,
                                    "children": [
                                        {
                                            "isVisible": true,
                                            "backgroundColor": "",
                                            "widgetName": "Container1",
                                            "containerStyle": "card",
                                            "borderColor": "transparent",
                                            "borderWidth": "0",
                                            "borderRadius": "0",
                                            "boxShadow": "NONE",
                                            "animateLoading": true,
                                            "children": [
                                                {
                                                    "isVisible": true,
                                                    "widgetName": "Canvas12",
                                                    "version": 1,
                                                    "detachFromLayout": true,
                                                    "type": "CANVAS_WIDGET",
                                                    "hideCard": true,
                                                    "displayName": "Canvas",
                                                    "key": "l6lft6vszh",
                                                    "containerStyle": "none",
                                                    "canExtend": false,
                                                    "children": [
                                                        {
                                                            "isVisible": true,
                                                            "defaultImage": "https://cdn-icons-png.flaticon.com/512/1995/1995670.png",
                                                            "imageShape": "RECTANGLE",
                                                            "maxZoomLevel": 1,
                                                            "enableRotation": false,
                                                            "enableDownload": false,
                                                            "objectFit": "contain",
                                                            "image": "https://cdn-icons-png.flaticon.com/512/1791/1791961.png",
                                                            "widgetName": "Image2",
                                                            "version": 1,
                                                            "animateLoading": true,
                                                            "type": "IMAGE_WIDGET",
                                                            "hideCard": false,
                                                            "displayName": "Image",
                                                            "key": "geqawl9y1p",
                                                            "iconSVG": "/static/media/icon.52d8fb96.svg",
                                                            "widgetId": "t6se9ya7rc",
                                                            "renderMode": "CANVAS",
                                                            "isLoading": false,
                                                            "parentColumnSpace": 7.8642578125,
                                                            "parentRowSpace": 10,
                                                            "leftColumn": 0,
                                                            "rightColumn": 64,
                                                            "topRow": 1,
                                                            "bottomRow": 18,
                                                            "parentId": "9ewzguz7ga",
                                                            "dynamicBindingPathList": [],
                                                            "dynamicTriggerPathList": []
                                                        },
                                                        {
                                                            "isVisible": true,
                                                            "text": "Enter the email address associated with your account and we'll send you a link to reset your password.",
                                                            "fontSize": "PARAGRAPH",
                                                            "fontStyle": "",
                                                            "textAlign": "CENTER",
                                                            "textColor": "#231F20",
                                                            "truncateButtonColor": "#FFC13D",
                                                            "widgetName": "Text2",
                                                            "shouldTruncate": false,
                                                            "overflow": "NONE",
                                                            "version": 1,
                                                            "animateLoading": true,
                                                            "type": "TEXT_WIDGET",
                                                            "hideCard": false,
                                                            "displayName": "Text",
                                                            "key": "k73yyzluo7",
                                                            "iconSVG": "/static/media/icon.97c59b52.svg",
                                                            "widgetId": "2pah3d2jj5",
                                                            "renderMode": "CANVAS",
                                                            "isLoading": false,
                                                            "parentColumnSpace": 4.599609375,
                                                            "parentRowSpace": 10,
                                                            "leftColumn": 0,
                                                            "rightColumn": 64,
                                                            "topRow": 20,
                                                            "bottomRow": 28,
                                                            "parentId": "9ewzguz7ga",
                                                            "dynamicBindingPathList": [],
                                                            "dynamicTriggerPathList": []
                                                        },
                                                        {
                                                            "isVisible": true,
                                                            "animateLoading": true,
                                                            "widgetName": "Form1",
                                                            "backgroundColor": "white",
                                                            "children": [
                                                                {
                                                                    "isVisible": true,
                                                                    "widgetName": "Canvas14",
                                                                    "version": 1,
                                                                    "detachFromLayout": true,
                                                                    "type": "CANVAS_WIDGET",
                                                                    "hideCard": true,
                                                                    "displayName": "Canvas",
                                                                    "key": "w0t0cghy7d",
                                                                    "containerStyle": "none",
                                                                    "canExtend": false,
                                                                    "children": [
                                                                        {
                                                                            "isVisible": true,
                                                                            "widgetName": "FormButton1",
                                                                            "text": "Continue",
                                                                            "isDefaultClickDisabled": true,
                                                                            "recaptchaType": "V3",
                                                                            "version": 1,
                                                                            "animateLoading": true,
                                                                            "type": "FORM_BUTTON_WIDGET",
                                                                            "hideCard": true,
                                                                            "displayName": "FormButton",
                                                                            "key": "7ozrvnk23b",
                                                                            "iconSVG": "/static/media/icon.cca02633.svg",
                                                                            "buttonVariant": "PRIMARY",
                                                                            "buttonColor": "#2E3D49",
                                                                            "disabledWhenInvalid": true,
                                                                            "resetFormOnClick": true,
                                                                            "widgetId": "0wzduiumbd",
                                                                            "renderMode": "CANVAS",
                                                                            "isLoading": false,
                                                                            "leftColumn": 0,
                                                                            "rightColumn": 64,
                                                                            "topRow": 12,
                                                                            "bottomRow": 17,
                                                                            "parentId": "raftenphq4",
                                                                            "dynamicBindingPathList": [],
                                                                            "dynamicTriggerPathList": [
                                                                                {
                                                                                    "key": "onClick"
                                                                                }
                                                                            ],
                                                                            "onClick": "{{sendEmailForResetPassword.run(() => navigateTo('Info',{email: InputEmail.text}), () => {})}}",
                                                                            "dynamicPropertyPathList": [],
                                                                            "borderRadius": "ROUNDED"
                                                                        },
                                                                        {
                                                                            "isVisible": true,
                                                                            "text": "Email",
                                                                            "fontSize": "PARAGRAPH",
                                                                            "fontStyle": "BOLD",
                                                                            "textAlign": "LEFT",
                                                                            "textColor": "#231F20",
                                                                            "truncateButtonColor": "#FFC13D",
                                                                            "widgetName": "Text1",
                                                                            "shouldTruncate": false,
                                                                            "overflow": "NONE",
                                                                            "version": 1,
                                                                            "animateLoading": true,
                                                                            "type": "TEXT_WIDGET",
                                                                            "hideCard": false,
                                                                            "displayName": "Text",
                                                                            "key": "k73yyzluo7",
                                                                            "iconSVG": "/static/media/icon.97c59b52.svg",
                                                                            "widgetId": "lbey2f3wwm",
                                                                            "renderMode": "CANVAS",
                                                                            "isLoading": false,
                                                                            "parentColumnSpace": 6.564453125,
                                                                            "parentRowSpace": 10,
                                                                            "leftColumn": 0,
                                                                            "rightColumn": 64,
                                                                            "topRow": 0,
                                                                            "bottomRow": 4,
                                                                            "parentId": "raftenphq4",
                                                                            "dynamicBindingPathList": [],
                                                                            "dynamicTriggerPathList": []
                                                                        },
                                                                        {
                                                                            "isVisible": true,
                                                                            "label": "",
                                                                            "labelPosition": "Left",
                                                                            "labelAlignment": "left",
                                                                            "labelWidth": 5,
                                                                            "widgetName": "InputEmail",
                                                                            "version": 2,
                                                                            "defaultText": "",
                                                                            "iconAlign": "left",
                                                                            "autoFocus": false,
                                                                            "labelStyle": "",
                                                                            "resetOnSubmit": true,
                                                                            "isRequired": true,
                                                                            "isDisabled": false,
                                                                            "animateLoading": true,
                                                                            "classStyle": "",
                                                                            "inputType": "EMAIL",
                                                                            "type": "INPUT_WIDGET_V2",
                                                                            "hideCard": false,
                                                                            "displayName": "Input",
                                                                            "key": "o2wp3np7ip",
                                                                            "iconSVG": "/static/media/icon.9f505595.svg",
                                                                            "widgetId": "hkoge6m5z7",
                                                                            "renderMode": "CANVAS",
                                                                            "isLoading": false,
                                                                            "parentColumnSpace": 6.564453125,
                                                                            "parentRowSpace": 10,
                                                                            "leftColumn": 0,
                                                                            "rightColumn": 64,
                                                                            "topRow": 4,
                                                                            "bottomRow": 8,
                                                                            "parentId": "raftenphq4",
                                                                            "dynamicBindingPathList": [
                                                                                {
                                                                                    "key": "validation"
                                                                                }
                                                                            ],
                                                                            "dynamicTriggerPathList": [],
                                                                            "validation": "{{ InputEmail.text.length > 4 }}"
                                                                        },
                                                                        {
                                                                            "isVisible": true,
                                                                            "text": "{{sendEmailForResetPassword.data.data}}",
                                                                            "fontSize": "PARAGRAPH2",
                                                                            "fontStyle": "BOLD",
                                                                            "textAlign": "LEFT",
                                                                            "textColor": "#BF986F",
                                                                            "truncateButtonColor": "#FFC13D",
                                                                            "widgetName": "TextEmailSent",
                                                                            "shouldTruncate": false,
                                                                            "overflow": "NONE",
                                                                            "version": 1,
                                                                            "animateLoading": true,
                                                                            "type": "TEXT_WIDGET",
                                                                            "hideCard": false,
                                                                            "displayName": "Text",
                                                                            "key": "k73yyzluo7",
                                                                            "iconSVG": "/static/media/icon.97c59b52.svg",
                                                                            "widgetId": "9rz8xhi0pr",
                                                                            "renderMode": "CANVAS",
                                                                            "isLoading": false,
                                                                            "parentColumnSpace": 4.599609375,
                                                                            "parentRowSpace": 10,
                                                                            "leftColumn": 0,
                                                                            "rightColumn": 64,
                                                                            "topRow": 8,
                                                                            "bottomRow": 12,
                                                                            "parentId": "raftenphq4",
                                                                            "dynamicBindingPathList": [
                                                                                {
                                                                                    "key": "text"
                                                                                }
                                                                            ],
                                                                            "dynamicTriggerPathList": [],
                                                                            "dynamicPropertyPathList": []
                                                                        },
                                                                        {
                                                                            "isVisible": true,
                                                                            "animateLoading": true,
                                                                            "text": "Don't have an account? Sign up!",
                                                                            "buttonColor": "#999",
                                                                            "buttonVariant": "TERTIARY",
                                                                            "placement": "CENTER",
                                                                            "widgetName": "Button2",
                                                                            "isDisabled": false,
                                                                            "isDefaultClickDisabled": true,
                                                                            "recaptchaType": "V3",
                                                                            "version": 1,
                                                                            "classStyle": "",
                                                                            "type": "BUTTON_WIDGET",
                                                                            "hideCard": false,
                                                                            "displayName": "Button",
                                                                            "key": "7rkgu0p85e",
                                                                            "iconSVG": "/static/media/icon.cca02633.svg",
                                                                            "widgetId": "rx4h6shliq",
                                                                            "renderMode": "CANVAS",
                                                                            "isLoading": false,
                                                                            "parentColumnSpace": 4.599609375,
                                                                            "parentRowSpace": 10,
                                                                            "leftColumn": 0,
                                                                            "rightColumn": 64,
                                                                            "topRow": 24,
                                                                            "bottomRow": 28,
                                                                            "parentId": "raftenphq4",
                                                                            "dynamicBindingPathList": [],
                                                                            "dynamicTriggerPathList": [
                                                                                {
                                                                                    "key": "onClick"
                                                                                }
                                                                            ],
                                                                            "onClick": "{{navigateTo('Registration', {})}}"
                                                                        },
                                                                        {
                                                                            "isVisible": true,
                                                                            "animateLoading": true,
                                                                            "text": "Back to Login",
                                                                            "buttonColor": "#999",
                                                                            "buttonVariant": "TERTIARY",
                                                                            "placement": "CENTER",
                                                                            "widgetName": "Button2Copy",
                                                                            "isDisabled": false,
                                                                            "isDefaultClickDisabled": true,
                                                                            "recaptchaType": "V3",
                                                                            "version": 1,
                                                                            "classStyle": "",
                                                                            "type": "BUTTON_WIDGET",
                                                                            "hideCard": false,
                                                                            "displayName": "Button",
                                                                            "key": "7rkgu0p85e",
                                                                            "iconSVG": "/static/media/icon.cca02633.svg",
                                                                            "widgetId": "xx9wuq730h",
                                                                            "renderMode": "CANVAS",
                                                                            "isLoading": false,
                                                                            "parentColumnSpace": 4.599609375,
                                                                            "parentRowSpace": 10,
                                                                            "leftColumn": 0,
                                                                            "rightColumn": 64,
                                                                            "topRow": 28,
                                                                            "bottomRow": 32,
                                                                            "parentId": "raftenphq4",
                                                                            "dynamicBindingPathList": [],
                                                                            "dynamicTriggerPathList": [
                                                                                {
                                                                                    "key": "onClick"
                                                                                }
                                                                            ],
                                                                            "onClick": "{{navigateTo('Login', {})}}"
                                                                        }
                                                                    ],
                                                                    "minHeight": 400,
                                                                    "widgetId": "raftenphq4",
                                                                    "renderMode": "CANVAS",
                                                                    "isLoading": false,
                                                                    "parentColumnSpace": 1,
                                                                    "parentRowSpace": 1,
                                                                    "leftColumn": 0,
                                                                    "rightColumn": 457.125,
                                                                    "topRow": 0,
                                                                    "bottomRow": 390,
                                                                    "parentId": "v78dds5iws"
                                                                }
                                                            ],
                                                            "type": "FORM_WIDGET",
                                                            "hideCard": false,
                                                            "displayName": "Form",
                                                            "key": "i3kb4jkscx",
                                                            "iconSVG": "/static/media/icon.ea3e08d1.svg",
                                                            "isCanvas": true,
                                                            "widgetId": "v78dds5iws",
                                                            "renderMode": "CANVAS",
                                                            "isLoading": false,
                                                            "parentColumnSpace": 19.046875,
                                                            "parentRowSpace": 10,
                                                            "leftColumn": 0,
                                                            "rightColumn": 64,
                                                            "topRow": 28,
                                                            "bottomRow": 62,
                                                            "parentId": "9ewzguz7ga"
                                                        }
                                                    ],
                                                    "minHeight": 400,
                                                    "widgetId": "9ewzguz7ga",
                                                    "renderMode": "CANVAS",
                                                    "isLoading": false,
                                                    "parentColumnSpace": 1,
                                                    "parentRowSpace": 1,
                                                    "leftColumn": 0,
                                                    "rightColumn": 377.25,
                                                    "topRow": 0,
                                                    "bottomRow": 640,
                                                    "parentId": "0er9l67g2v"
                                                }
                                            ],
                                            "version": 1,
                                            "classStyle": "",
                                            "type": "CONTAINER_WIDGET",
                                            "hideCard": false,
                                            "displayName": "Container",
                                            "key": "39p5plinn3",
                                            "iconSVG": "/static/media/icon.1977dca3.svg",
                                            "isCanvas": true,
                                            "widgetId": "0er9l67g2v",
                                            "renderMode": "CANVAS",
                                            "isLoading": false,
                                            "parentColumnSpace": 15.71875,
                                            "parentRowSpace": 10,
                                            "leftColumn": 22,
                                            "rightColumn": 42,
                                            "topRow": 10,
                                            "bottomRow": 74,
                                            "parentId": "5x2yqbix19",
                                            "dynamicBindingPathList": [],
                                            "dynamicTriggerPathList": []
                                        }
                                    ],
                                    "minHeight": 400,
                                    "widgetId": "5x2yqbix19",
                                    "renderMode": "CANVAS",
                                    "isLoading": false,
                                    "parentColumnSpace": 1,
                                    "parentRowSpace": 1,
                                    "leftColumn": 0,
                                    "rightColumn": 377.25,
                                    "topRow": 0,
                                    "bottomRow": 760,
                                    "parentId": "p0zt67vt9h"
                                }
                            ],
                            "version": 1,
                            "classStyle": "",
                            "type": "CONTAINER_WIDGET",
                            "hideCard": false,
                            "displayName": "Container",
                            "key": "39p5plinn3",
                            "iconSVG": "/static/media/icon.1977dca3.svg",
                            "isCanvas": true,
                            "widgetId": "p0zt67vt9h",
                            "renderMode": "CANVAS",
                            "isLoading": false,
                            "parentColumnSpace": 15.71875,
                            "parentRowSpace": 10,
                            "leftColumn": 0,
                            "rightColumn": 64,
                            "topRow": 0,
                            "bottomRow": 91,
                            "parentId": "0"
                        }
                    ],
                    "snapRows": 75,
                    "containerStyle": "none",
                    "canExtend": true,
                    "version": 57
                },
                "widgetNames": [
                    "MainContainer",
                    "Container2",
                    "Canvas13",
                    "Container1",
                    "Canvas12",
                    "Image2",
                    "Text2",
                    "Form1",
                    "Canvas14",
                    "FormButton1",
                    "Text1",
                    "InputEmail",
                    "TextEmailSent",
                    "Button2",
                    "Button2Copy"
                ],
                "deleted": false,
                "policies": [],
                "layoutOnLoadActions": [
                    [
                        {
                            "_id": "635663973c09e90010212348",
                            "id": "635663973c09e90010212348",
                            "collectionId": "63566371d1e1de1000000003",
                            "confirmBeforeExecute": false,
                            "name": "textSatus",
                            "pluginType": "JS",
                            "jsonPathKeys": [
                                "() => {\n\t\tstoreValue(\"statusVisible\", false);\n\t}"
                            ],
                            "timeoutInMillisecond": 10000
                        }
                    ]
                ],
                "layoutOnCloseActions": []
            }
        ],
        "isHidden": false
    },
    "createdAt": "2022-10-24T09:41:39.201Z",
    "updatedAt": "2022-10-24T09:41:39.201Z",
    "deleted": false,
    "policies": [
        {
            "permission": "read:pages",
            "groups": [],
            "users": [
                null
            ]
        },
        {
            "permission": "manage:pages",
            "groups": [],
            "users": [
                null
            ]
        }
    ],
    "publishedPages": {
        "name": "queryToResetPassword",
        "layouts": [
            {
                "_id": "63565dd3d1e1de1000000002",
                "viewMode": false,
                "dsl": {
                    "widgetName": "MainContainer",
                    "backgroundColor": "none",
                    "rightColumn": 1224,
                    "snapColumns": 64,
                    "widgetId": "0",
                    "topRow": 0,
                    "bottomRow": 1290,
                    "parentRowSpace": 1,
                    "type": "CANVAS_WIDGET",
                    "detachFromLayout": true,
                    "minHeight": 760,
                    "dynamicBindingPathList": [],
                    "parentColumnSpace": 1,
                    "leftColumn": 0,
                    "children": [
                        {
                            "isVisible": true,
                            "backgroundColor": "#FFFFFF",
                            "widgetName": "Container2",
                            "containerStyle": "card",
                            "borderColor": "transparent",
                            "borderWidth": "0",
                            "borderRadius": "0",
                            "boxShadow": "NONE",
                            "animateLoading": true,
                            "children": [
                                {
                                    "isVisible": true,
                                    "widgetName": "Canvas13",
                                    "version": 1,
                                    "detachFromLayout": true,
                                    "type": "CANVAS_WIDGET",
                                    "hideCard": true,
                                    "displayName": "Canvas",
                                    "key": "l6lft6vszh",
                                    "containerStyle": "none",
                                    "canExtend": false,
                                    "children": [
                                        {
                                            "isVisible": true,
                                            "backgroundColor": "",
                                            "widgetName": "Container1",
                                            "containerStyle": "card",
                                            "borderColor": "transparent",
                                            "borderWidth": "0",
                                            "borderRadius": "0",
                                            "boxShadow": "NONE",
                                            "animateLoading": true,
                                            "children": [
                                                {
                                                    "isVisible": true,
                                                    "widgetName": "Canvas12",
                                                    "version": 1,
                                                    "detachFromLayout": true,
                                                    "type": "CANVAS_WIDGET",
                                                    "hideCard": true,
                                                    "displayName": "Canvas",
                                                    "key": "l6lft6vszh",
                                                    "containerStyle": "none",
                                                    "canExtend": false,
                                                    "children": [
                                                        {
                                                            "isVisible": true,
                                                            "defaultImage": "https://cdn-icons-png.flaticon.com/512/1995/1995670.png",
                                                            "imageShape": "RECTANGLE",
                                                            "maxZoomLevel": 1,
                                                            "enableRotation": false,
                                                            "enableDownload": false,
                                                            "objectFit": "contain",
                                                            "image": "https://cdn-icons-png.flaticon.com/512/1791/1791961.png",
                                                            "widgetName": "Image2",
                                                            "version": 1,
                                                            "animateLoading": true,
                                                            "type": "IMAGE_WIDGET",
                                                            "hideCard": false,
                                                            "displayName": "Image",
                                                            "key": "geqawl9y1p",
                                                            "iconSVG": "/static/media/icon.52d8fb96.svg",
                                                            "widgetId": "t6se9ya7rc",
                                                            "renderMode": "CANVAS",
                                                            "isLoading": false,
                                                            "parentColumnSpace": 7.8642578125,
                                                            "parentRowSpace": 10,
                                                            "leftColumn": 0,
                                                            "rightColumn": 64,
                                                            "topRow": 1,
                                                            "bottomRow": 18,
                                                            "parentId": "9ewzguz7ga",
                                                            "dynamicBindingPathList": [],
                                                            "dynamicTriggerPathList": []
                                                        },
                                                        {
                                                            "isVisible": true,
                                                            "text": "Enter the email address associated with your account and we'll send you a link to reset your password.",
                                                            "fontSize": "PARAGRAPH",
                                                            "fontStyle": "",
                                                            "textAlign": "CENTER",
                                                            "textColor": "#231F20",
                                                            "truncateButtonColor": "#FFC13D",
                                                            "widgetName": "Text2",
                                                            "shouldTruncate": false,
                                                            "overflow": "NONE",
                                                            "version": 1,
                                                            "animateLoading": true,
                                                            "type": "TEXT_WIDGET",
                                                            "hideCard": false,
                                                            "displayName": "Text",
                                                            "key": "k73yyzluo7",
                                                            "iconSVG": "/static/media/icon.97c59b52.svg",
                                                            "widgetId": "2pah3d2jj5",
                                                            "renderMode": "CANVAS",
                                                            "isLoading": false,
                                                            "parentColumnSpace": 4.599609375,
                                                            "parentRowSpace": 10,
                                                            "leftColumn": 0,
                                                            "rightColumn": 64,
                                                            "topRow": 20,
                                                            "bottomRow": 28,
                                                            "parentId": "9ewzguz7ga",
                                                            "dynamicBindingPathList": [],
                                                            "dynamicTriggerPathList": []
                                                        },
                                                        {
                                                            "isVisible": true,
                                                            "animateLoading": true,
                                                            "widgetName": "Form1",
                                                            "backgroundColor": "white",
                                                            "children": [
                                                                {
                                                                    "isVisible": true,
                                                                    "widgetName": "Canvas14",
                                                                    "version": 1,
                                                                    "detachFromLayout": true,
                                                                    "type": "CANVAS_WIDGET",
                                                                    "hideCard": true,
                                                                    "displayName": "Canvas",
                                                                    "key": "w0t0cghy7d",
                                                                    "containerStyle": "none",
                                                                    "canExtend": false,
                                                                    "children": [
                                                                        {
                                                                            "isVisible": true,
                                                                            "widgetName": "FormButton1",
                                                                            "text": "Continue",
                                                                            "isDefaultClickDisabled": true,
                                                                            "recaptchaType": "V3",
                                                                            "version": 1,
                                                                            "animateLoading": true,
                                                                            "type": "FORM_BUTTON_WIDGET",
                                                                            "hideCard": true,
                                                                            "displayName": "FormButton",
                                                                            "key": "7ozrvnk23b",
                                                                            "iconSVG": "/static/media/icon.cca02633.svg",
                                                                            "buttonVariant": "PRIMARY",
                                                                            "buttonColor": "#2E3D49",
                                                                            "disabledWhenInvalid": true,
                                                                            "resetFormOnClick": true,
                                                                            "widgetId": "0wzduiumbd",
                                                                            "renderMode": "CANVAS",
                                                                            "isLoading": false,
                                                                            "leftColumn": 0,
                                                                            "rightColumn": 64,
                                                                            "topRow": 12,
                                                                            "bottomRow": 17,
                                                                            "parentId": "raftenphq4",
                                                                            "dynamicBindingPathList": [],
                                                                            "dynamicTriggerPathList": [
                                                                                {
                                                                                    "key": "onClick"
                                                                                }
                                                                            ],
                                                                            "onClick": "{{sendEmailForResetPassword.run(() => navigateTo('Info',{email: InputEmail.text}), () => {})}}",
                                                                            "dynamicPropertyPathList": [],
                                                                            "borderRadius": "ROUNDED"
                                                                        },
                                                                        {
                                                                            "isVisible": true,
                                                                            "text": "Email",
                                                                            "fontSize": "PARAGRAPH",
                                                                            "fontStyle": "BOLD",
                                                                            "textAlign": "LEFT",
                                                                            "textColor": "#231F20",
                                                                            "truncateButtonColor": "#FFC13D",
                                                                            "widgetName": "Text1",
                                                                            "shouldTruncate": false,
                                                                            "overflow": "NONE",
                                                                            "version": 1,
                                                                            "animateLoading": true,
                                                                            "type": "TEXT_WIDGET",
                                                                            "hideCard": false,
                                                                            "displayName": "Text",
                                                                            "key": "k73yyzluo7",
                                                                            "iconSVG": "/static/media/icon.97c59b52.svg",
                                                                            "widgetId": "lbey2f3wwm",
                                                                            "renderMode": "CANVAS",
                                                                            "isLoading": false,
                                                                            "parentColumnSpace": 6.564453125,
                                                                            "parentRowSpace": 10,
                                                                            "leftColumn": 0,
                                                                            "rightColumn": 64,
                                                                            "topRow": 0,
                                                                            "bottomRow": 4,
                                                                            "parentId": "raftenphq4",
                                                                            "dynamicBindingPathList": [],
                                                                            "dynamicTriggerPathList": []
                                                                        },
                                                                        {
                                                                            "isVisible": true,
                                                                            "label": "",
                                                                            "labelPosition": "Left",
                                                                            "labelAlignment": "left",
                                                                            "labelWidth": 5,
                                                                            "widgetName": "InputEmail",
                                                                            "version": 2,
                                                                            "defaultText": "",
                                                                            "iconAlign": "left",
                                                                            "autoFocus": false,
                                                                            "labelStyle": "",
                                                                            "resetOnSubmit": true,
                                                                            "isRequired": true,
                                                                            "isDisabled": false,
                                                                            "animateLoading": true,
                                                                            "classStyle": "",
                                                                            "inputType": "EMAIL",
                                                                            "type": "INPUT_WIDGET_V2",
                                                                            "hideCard": false,
                                                                            "displayName": "Input",
                                                                            "key": "o2wp3np7ip",
                                                                            "iconSVG": "/static/media/icon.9f505595.svg",
                                                                            "widgetId": "hkoge6m5z7",
                                                                            "renderMode": "CANVAS",
                                                                            "isLoading": false,
                                                                            "parentColumnSpace": 6.564453125,
                                                                            "parentRowSpace": 10,
                                                                            "leftColumn": 0,
                                                                            "rightColumn": 64,
                                                                            "topRow": 4,
                                                                            "bottomRow": 8,
                                                                            "parentId": "raftenphq4",
                                                                            "dynamicBindingPathList": [
                                                                                {
                                                                                    "key": "validation"
                                                                                }
                                                                            ],
                                                                            "dynamicTriggerPathList": [],
                                                                            "validation": "{{ InputEmail.text.length > 4 }}"
                                                                        },
                                                                        {
                                                                            "isVisible": true,
                                                                            "text": "{{sendEmailForResetPassword.data.data}}",
                                                                            "fontSize": "PARAGRAPH2",
                                                                            "fontStyle": "BOLD",
                                                                            "textAlign": "LEFT",
                                                                            "textColor": "#BF986F",
                                                                            "truncateButtonColor": "#FFC13D",
                                                                            "widgetName": "TextEmailSent",
                                                                            "shouldTruncate": false,
                                                                            "overflow": "NONE",
                                                                            "version": 1,
                                                                            "animateLoading": true,
                                                                            "type": "TEXT_WIDGET",
                                                                            "hideCard": false,
                                                                            "displayName": "Text",
                                                                            "key": "k73yyzluo7",
                                                                            "iconSVG": "/static/media/icon.97c59b52.svg",
                                                                            "widgetId": "9rz8xhi0pr",
                                                                            "renderMode": "CANVAS",
                                                                            "isLoading": false,
                                                                            "parentColumnSpace": 4.599609375,
                                                                            "parentRowSpace": 10,
                                                                            "leftColumn": 0,
                                                                            "rightColumn": 64,
                                                                            "topRow": 8,
                                                                            "bottomRow": 12,
                                                                            "parentId": "raftenphq4",
                                                                            "dynamicBindingPathList": [
                                                                                {
                                                                                    "key": "text"
                                                                                }
                                                                            ],
                                                                            "dynamicTriggerPathList": [],
                                                                            "dynamicPropertyPathList": []
                                                                        },
                                                                        {
                                                                            "isVisible": true,
                                                                            "animateLoading": true,
                                                                            "text": "Don't have an account? Sign up!",
                                                                            "buttonColor": "#999",
                                                                            "buttonVariant": "TERTIARY",
                                                                            "placement": "CENTER",
                                                                            "widgetName": "Button2",
                                                                            "isDisabled": false,
                                                                            "isDefaultClickDisabled": true,
                                                                            "recaptchaType": "V3",
                                                                            "version": 1,
                                                                            "classStyle": "",
                                                                            "type": "BUTTON_WIDGET",
                                                                            "hideCard": false,
                                                                            "displayName": "Button",
                                                                            "key": "7rkgu0p85e",
                                                                            "iconSVG": "/static/media/icon.cca02633.svg",
                                                                            "widgetId": "rx4h6shliq",
                                                                            "renderMode": "CANVAS",
                                                                            "isLoading": false,
                                                                            "parentColumnSpace": 4.599609375,
                                                                            "parentRowSpace": 10,
                                                                            "leftColumn": 0,
                                                                            "rightColumn": 64,
                                                                            "topRow": 24,
                                                                            "bottomRow": 28,
                                                                            "parentId": "raftenphq4",
                                                                            "dynamicBindingPathList": [],
                                                                            "dynamicTriggerPathList": [
                                                                                {
                                                                                    "key": "onClick"
                                                                                }
                                                                            ],
                                                                            "onClick": "{{navigateTo('Registration', {})}}"
                                                                        },
                                                                        {
                                                                            "isVisible": true,
                                                                            "animateLoading": true,
                                                                            "text": "Back to Login",
                                                                            "buttonColor": "#999",
                                                                            "buttonVariant": "TERTIARY",
                                                                            "placement": "CENTER",
                                                                            "widgetName": "Button2Copy",
                                                                            "isDisabled": false,
                                                                            "isDefaultClickDisabled": true,
                                                                            "recaptchaType": "V3",
                                                                            "version": 1,
                                                                            "classStyle": "",
                                                                            "type": "BUTTON_WIDGET",
                                                                            "hideCard": false,
                                                                            "displayName": "Button",
                                                                            "key": "7rkgu0p85e",
                                                                            "iconSVG": "/static/media/icon.cca02633.svg",
                                                                            "widgetId": "xx9wuq730h",
                                                                            "renderMode": "CANVAS",
                                                                            "isLoading": false,
                                                                            "parentColumnSpace": 4.599609375,
                                                                            "parentRowSpace": 10,
                                                                            "leftColumn": 0,
                                                                            "rightColumn": 64,
                                                                            "topRow": 28,
                                                                            "bottomRow": 32,
                                                                            "parentId": "raftenphq4",
                                                                            "dynamicBindingPathList": [],
                                                                            "dynamicTriggerPathList": [
                                                                                {
                                                                                    "key": "onClick"
                                                                                }
                                                                            ],
                                                                            "onClick": "{{navigateTo('Login', {})}}"
                                                                        }
                                                                    ],
                                                                    "minHeight": 400,
                                                                    "widgetId": "raftenphq4",
                                                                    "renderMode": "CANVAS",
                                                                    "isLoading": false,
                                                                    "parentColumnSpace": 1,
                                                                    "parentRowSpace": 1,
                                                                    "leftColumn": 0,
                                                                    "rightColumn": 457.125,
                                                                    "topRow": 0,
                                                                    "bottomRow": 390,
                                                                    "parentId": "v78dds5iws"
                                                                }
                                                            ],
                                                            "type": "FORM_WIDGET",
                                                            "hideCard": false,
                                                            "displayName": "Form",
                                                            "key": "i3kb4jkscx",
                                                            "iconSVG": "/static/media/icon.ea3e08d1.svg",
                                                            "isCanvas": true,
                                                            "widgetId": "v78dds5iws",
                                                            "renderMode": "CANVAS",
                                                            "isLoading": false,
                                                            "parentColumnSpace": 19.046875,
                                                            "parentRowSpace": 10,
                                                            "leftColumn": 0,
                                                            "rightColumn": 64,
                                                            "topRow": 28,
                                                            "bottomRow": 62,
                                                            "parentId": "9ewzguz7ga"
                                                        }
                                                    ],
                                                    "minHeight": 400,
                                                    "widgetId": "9ewzguz7ga",
                                                    "renderMode": "CANVAS",
                                                    "isLoading": false,
                                                    "parentColumnSpace": 1,
                                                    "parentRowSpace": 1,
                                                    "leftColumn": 0,
                                                    "rightColumn": 377.25,
                                                    "topRow": 0,
                                                    "bottomRow": 640,
                                                    "parentId": "0er9l67g2v"
                                                }
                                            ],
                                            "version": 1,
                                            "classStyle": "",
                                            "type": "CONTAINER_WIDGET",
                                            "hideCard": false,
                                            "displayName": "Container",
                                            "key": "39p5plinn3",
                                            "iconSVG": "/static/media/icon.1977dca3.svg",
                                            "isCanvas": true,
                                            "widgetId": "0er9l67g2v",
                                            "renderMode": "CANVAS",
                                            "isLoading": false,
                                            "parentColumnSpace": 15.71875,
                                            "parentRowSpace": 10,
                                            "leftColumn": 22,
                                            "rightColumn": 42,
                                            "topRow": 10,
                                            "bottomRow": 74,
                                            "parentId": "5x2yqbix19",
                                            "dynamicBindingPathList": [],
                                            "dynamicTriggerPathList": []
                                        }
                                    ],
                                    "minHeight": 400,
                                    "widgetId": "5x2yqbix19",
                                    "renderMode": "CANVAS",
                                    "isLoading": false,
                                    "parentColumnSpace": 1,
                                    "parentRowSpace": 1,
                                    "leftColumn": 0,
                                    "rightColumn": 377.25,
                                    "topRow": 0,
                                    "bottomRow": 760,
                                    "parentId": "p0zt67vt9h"
                                }
                            ],
                            "version": 1,
                            "classStyle": "",
                            "type": "CONTAINER_WIDGET",
                            "hideCard": false,
                            "displayName": "Container",
                            "key": "39p5plinn3",
                            "iconSVG": "/static/media/icon.1977dca3.svg",
                            "isCanvas": true,
                            "widgetId": "p0zt67vt9h",
                            "renderMode": "CANVAS",
                            "isLoading": false,
                            "parentColumnSpace": 15.71875,
                            "parentRowSpace": 10,
                            "leftColumn": 0,
                            "rightColumn": 64,
                            "topRow": 0,
                            "bottomRow": 91,
                            "parentId": "0"
                        }
                    ],
                    "snapRows": 75,
                    "containerStyle": "none",
                    "canExtend": true,
                    "version": 57
                },
                "widgetNames": [
                    "MainContainer",
                    "Container2",
                    "Canvas13",
                    "Container1",
                    "Canvas12",
                    "Image2",
                    "Text2",
                    "Form1",
                    "Canvas14",
                    "FormButton1",
                    "Text1",
                    "InputEmail",
                    "TextEmailSent",
                    "Button2",
                    "Button2Copy"
                ],
                "deleted": false,
                "policies": [],
                "layoutOnLoadActions": [
                    [
                        {
                            "_id": "635663973c09e90010212348",
                            "id": "635663973c09e90010212348",
                            "collectionId": "63566371d1e1de1000000003",
                            "confirmBeforeExecute": false,
                            "name": "textSatus",
                            "pluginType": "JS",
                            "jsonPathKeys": [
                                "() => {\n\t\tstoreValue(\"statusVisible\", false);\n\t}"
                            ],
                            "timeoutInMillisecond": 10000
                        }
                    ]
                ],
                "layoutOnCloseActions": []
            }
        ],
        "isHidden": false
    }
}
