{
    "_id": "630cd29ff72048110000000e",
    "applicationId": "jetsondashboard",
    "organizationId": "Org",
    "pluginType": "API",
    "pluginId": "API",
    "unpublishedAction": {
        "name": "addModuleToRoles",
        "datasource": {
            "name": "DEFAULT_REST_DATASOURCE",
            "datasourceConfiguration": {
                "url": "{{main.env.nodeUrl}}/addModuleToRole"
            },
            "invalids": [],
            "isValid": true,
            "pluginId": "API",
            "organizationId": "Org",
            "messages": []
        },
        "executeOnLoad": false,
        "pageId": "AdminRoles",
        "actionConfiguration": {
            "timeoutInMillisecond": 10000,
            "encodeParamsToggle": true,
            "httpMethod": "POST",
            "headers": [
                {
                    "key": "content-type",
                    "value": "application/json"
                }
            ],
            "queryParameters": [],
            "bodyFormData": [],
            "formData": {
                "apiContentType": "application/json"
            },
            "pluginSpecifiedTemplates": [
                {
                    "value": true
                }
            ],
            "path": "",
            "body": "{\n\t\"_id\":\"{{roles_table.selectedRow._id}}\",\n\t\"moduleValue\": {{modules_field.selectedOptionValues}},\n\t\"moduleName\": {{modules_field.selectedOptionLabels}},\n\t\"options\": {{options_switch.selectedValues}}\n}"
        },
        "dynamicBindingPathList": [
            {
                "key": "body"
            },
            {
                "key": "datasourceUrl"
            }
        ],
        "isValid": true,
        "invalids": [],
        "jsonPathKeys": [
            "main.env.nodeUrl",
            "roles_table.selectedRow._id",
            "modules_field.selectedOptionValues",
            "modules_field.selectedOptionLabels",
            "options_switch.selectedValues"
        ],
        "userSetOnLoad": false,
        "confirmBeforeExecute": false
    },
    "createdAt": "2022-08-29T14:52:15.502Z",
    "updatedAt": "2022-12-08T10:47:50.881Z",
    "deleted": false,
    "policies": [
        {
            "permission": "read:actions",
            "groups": [],
            "users": []
        },
        {
            "permission": "manage:actions",
            "groups": [],
            "users": []
        },
        {
            "permission": "execute:actions",
            "groups": [],
            "users": []
        }
    ],
    "publishedAction": {
        "name": "addModuleToRoles",
        "datasource": {
            "name": "DEFAULT_REST_DATASOURCE",
            "datasourceConfiguration": {
                "url": "{{main.env.nodeUrl}}/addModuleToRole"
            },
            "invalids": [],
            "isValid": true,
            "pluginId": "API",
            "organizationId": "Org",
            "messages": []
        },
        "executeOnLoad": false,
        "pageId": "AdminRoles",
        "actionConfiguration": {
            "timeoutInMillisecond": 10000,
            "encodeParamsToggle": true,
            "httpMethod": "POST",
            "headers": [
                {
                    "key": "content-type",
                    "value": "application/json"
                }
            ],
            "queryParameters": [],
            "bodyFormData": [],
            "formData": {
                "apiContentType": "application/json"
            },
            "pluginSpecifiedTemplates": [
                {
                    "value": true
                }
            ],
            "path": "",
            "body": "{\n\t\"_id\":\"{{roles_table.selectedRow._id}}\",\n\t\"moduleValue\": {{modules_field.selectedOptionValues}},\n\t\"moduleName\": {{modules_field.selectedOptionLabels}},\n\t\"options\": {{options_switch.selectedValues}}\n}"
        },
        "dynamicBindingPathList": [
            {
                "key": "body"
            },
            {
                "key": "datasourceUrl"
            }
        ],
        "isValid": true,
        "invalids": [],
        "jsonPathKeys": [
            "main.env.nodeUrl",
            "roles_table.selectedRow._id",
            "modules_field.selectedOptionValues",
            "modules_field.selectedOptionLabels",
            "options_switch.selectedValues"
        ],
        "userSetOnLoad": false,
        "confirmBeforeExecute": false
    }
}
