{
    "_id": "6360f6a91197b60011b3a9b6",
    "name": "timlineData",
    "collectionId": "6360f6a36e57c61100000002",
    "executeOnLoad": false,
    "pageId": "Dashboard",
    "organizationId": "Org",
    "actionConfiguration": {
        "body": "() => {\n\t\tconst count = {}; \n\t\tconst uuidBooks = {};\n\t\tlet dataFromMap = main.store.dataFromMap;\n\t\tif(!dataFromMap) {\n\t\t\tdataFromMap = main.store.InitMapData;\n\t\t}\n\n\t\tfor (let data of dataFromMap) {\t\t\t\n\t\t\t\tlet dataTime = data.year_of_publication;\n\t\t\t  const item = {\n            title: data.title,\n            keywords: data.keywords,\n            place_of_publication: data.place_of_publication,\n            year_of_publication: data.year_of_publication,\n            author: data.author,\n            status: data.status,\n            city: data.city\n        };\n\t\t\t\tcount[dataTime] = count[dataTime] ? count[dataTime] + 1 : 1;\n\t\t\t\tuuidBooks[dataTime] = uuidBooks[dataTime] ? [...uuidBooks[dataTime], item] : [item];\n\t\t\t\t\n\t\t}\n\t\t const res = Object.entries(count).map(i => ({time: i[0], count: i[1], books: uuidBooks[i[0]]}));\n\t\t //return res;\n\t\tconst result = [];\n\t\tlet start=parseInt(res[0].time);\n\t\tconst end= parseInt(res[res.length-1].time)\n\t\tfor(let i=start; i <= end;i++){\n\t\t\tlet check=res.filter(el=> el.time==i);\n\t\t\tif(check && check.length > 0){\n\t\t\t\tresult.push(check[0]);\t\t\t\t\n\t\t\t}\n\t\t\telse{\n\t\t\t\tresult.push({\"time\":String(i),\"count\":0})\n\t\t\t}\n\t\t}\n           \n \t\t\t\n\t\t\t \n\t\treturn result;\n\n\t}",
        "isAsync": false,
        "timeoutInMillisecond": 10000,
        "jsArguments": [],
        "paginationType": "NONE",
        "encodeParamsToggle": true
    },
    "applicationId": "jetsondashboard",
    "datasource": {
        "isValid": true,
        "messages": [],
        "name": "UNUSED_DATASOURCE",
        "new": true,
        "organizationId": "Org",
        "pluginId": "",
        "userPermissions": []
    },
    "dynamicBindingPathList": [
        {
            "key": "body"
        }
    ],
    "fullyQualifiedName": "JSObject1.timlineData",
    "isValid": true,
    "jsonPathKeys": [
        "() => {\n\t\tconst count = {}; \n\t\tconst uuidBooks = {};\n\t\tlet dataFromMap = main.store.dataFromMap;\n\t\tif(!dataFromMap) {\n\t\t\tdataFromMap = main.store.InitMapData;\n\t\t}\n\n\t\tfor (let data of dataFromMap) {\t\t\t\n\t\t\t\tlet dataTime = data.year_of_publication;\n\t\t\t  const item = {\n            title: data.title,\n            keywords: data.keywords,\n            place_of_publication: data.place_of_publication,\n            year_of_publication: data.year_of_publication,\n            author: data.author,\n            status: data.status,\n            city: data.city\n        };\n\t\t\t\tcount[dataTime] = count[dataTime] ? count[dataTime] + 1 : 1;\n\t\t\t\tuuidBooks[dataTime] = uuidBooks[dataTime] ? [...uuidBooks[dataTime], item] : [item];\n\t\t\t\t\n\t\t}\n\t\t const res = Object.entries(count).map(i => ({time: i[0], count: i[1], books: uuidBooks[i[0]]}));\n\t\t //return res;\n\t\tconst result = [];\n\t\tlet start=parseInt(res[0].time);\n\t\tconst end= parseInt(res[res.length-1].time)\n\t\tfor(let i=start; i <= end;i++){\n\t\t\tlet check=res.filter(el=> el.time==i);\n\t\t\tif(check && check.length > 0){\n\t\t\t\tresult.push(check[0]);\t\t\t\t\n\t\t\t}\n\t\t\telse{\n\t\t\t\tresult.push({\"time\":String(i),\"count\":0})\n\t\t\t}\n\t\t}\n           \n \t\t\t\n\t\t\t \n\t\treturn result;\n\n\t}"
    ],
    "pluginType": "JS"
}
