{
    "_id": "6369285ec2e17400119dc7f2",
    "name": "filterByTimeline",
    "collectionId": "635bd0363b28da1100000002",
    "executeOnLoad": false,
    "pageId": "Dashboard",
    "organizationId": "Org",
    "actionConfiguration": {
        "body": "() => {\n\t\tlet arr = [];\n\t\t\n\t\tarr = main.store.dataFromMap.filter(el=>el.year_of_publication >= LargeAreaChart.dataSet.start && el.year_of_publication <= LargeAreaChart.dataSet.end);\n\t\t\n\t\tstoreValue(\"dataForTable\", arr);\n\t\tstoreValue(\"dataFromMap\", arr);\n\t}",
        "isAsync": false,
        "timeoutInMillisecond": 10000,
        "jsArguments": [],
        "paginationType": "NONE",
        "encodeParamsToggle": true
    },
    "applicationId": "jetsondashboard",
    "datasource": {
        "isValid": true,
        "messages": [],
        "name": "UNUSED_DATASOURCE",
        "new": true,
        "organizationId": "Org",
        "pluginId": "",
        "userPermissions": []
    },
    "dynamicBindingPathList": [
        {
            "key": "body"
        }
    ],
    "fullyQualifiedName": "funcs.filterByTimeline",
    "isValid": true,
    "jsonPathKeys": [
        "() => {\n\t\t\n\t}"
    ],
    "pluginType": "JS",
    "id": "6369285ec2e17400119dc7f2"
}
