{
    "_id": "634e5d7f8c7cd1001128f964",
    "applicationId": "jetsondashboard",
    "organizationId": "Org",
    "pluginType": "API",
    "pluginId": "API",
    "unpublishedAction": {
        "name": "getBooksTimeline",
        "datasource": {
            "invalids": [],
            "datasourceConfiguration": {
                "url": "https://noderedritman-6335828aa386c31100000ae2.ubos.tech"
            },
            "isValid": true,
            "name": "NodeRedRitman",
            "new": true,
            "organizationId": "Org",
            "pluginId": "API",
            "userPermissions": []
        },
        "executeOnLoad": false,
        "pageId": "Dashboard Copy",
        "actionConfiguration": {
            "timeoutInMillisecond": 10000,
            "encodeParamsToggle": true,
            "httpMethod": "GET",
            "headers": [
                {
                    "key": "content-type",
                    "value": "none"
                }
            ],
            "queryParameters": [],
            "bodyFormData": [],
            "formData": {
                "apiContentType": "none"
            },
            "pluginSpecifiedTemplates": [
                {
                    "value": true
                }
            ],
            "path": "/getBooksTimeline",
            "body": "{\n\t\"limit_count\": {{Limit_count_input.text}}\n}"
        },
        "dynamicBindingPathList": [
            {
                "key": "body"
            }
        ],
        "isValid": true,
        "invalids": [],
        "jsonPathKeys": [
            "Limit_count_input.text"
        ],
        "userSetOnLoad": false,
        "confirmBeforeExecute": false
    },
    "createdAt": "2022-10-18T08:02:07.073Z",
    "updatedAt": "2022-10-18T08:02:07.073Z",
    "deleted": false,
    "policies": [
        {
            "permission": "read:actions",
            "groups": [],
            "users": []
        },
        {
            "permission": "manage:actions",
            "groups": [],
            "users": []
        },
        {
            "permission": "execute:actions",
            "groups": [],
            "users": []
        }
    ],
    "publishedAction": {
        "name": "getBooksTimeline",
        "datasource": {
            "invalids": [],
            "datasourceConfiguration": {
                "url": "https://noderedritman-6335828aa386c31100000ae2.ubos.tech"
            },
            "isValid": true,
            "name": "NodeRedRitman",
            "new": true,
            "organizationId": "Org",
            "pluginId": "API",
            "userPermissions": []
        },
        "executeOnLoad": false,
        "pageId": "Dashboard Copy",
        "actionConfiguration": {
            "timeoutInMillisecond": 10000,
            "encodeParamsToggle": true,
            "httpMethod": "GET",
            "headers": [
                {
                    "key": "content-type",
                    "value": "none"
                }
            ],
            "queryParameters": [],
            "bodyFormData": [],
            "formData": {
                "apiContentType": "none"
            },
            "pluginSpecifiedTemplates": [
                {
                    "value": true
                }
            ],
            "path": "/getBooksTimeline",
            "body": "{\n\t\"limit_count\": {{Limit_count_input.text}}\n}"
        },
        "dynamicBindingPathList": [
            {
                "key": "body"
            }
        ],
        "isValid": true,
        "invalids": [],
        "jsonPathKeys": [
            "Limit_count_input.text"
        ],
        "userSetOnLoad": false,
        "confirmBeforeExecute": false
    }
}
