{
    "_id": "633d4b92b9aac11100000008",
    "applicationId": "jetsondashboard",
    "organizationId": "Org",
    "pluginType": "API",
    "pluginId": "API",
    "unpublishedAction": {
        "name": "updateBook",
        "datasource": {
            "invalids": [],
            "datasourceConfiguration": {
                "url": "https://noderedritman-6335828aa386c31100000ae2.ubos.tech"
            },
            "isValid": true,
            "name": "NodeRedRitman",
            "new": true,
            "organizationId": "Org",
            "pluginId": "API",
            "userPermissions": []
        },
        "executeOnLoad": false,
        "pageId": "Admin",
        "actionConfiguration": {
            "timeoutInMillisecond": 10000,
            "encodeParamsToggle": true,
            "httpMethod": "PUT",
            "headers": [
                {
                    "key": "content-type",
                    "value": "application/json"
                }
            ],
            "queryParameters": [],
            "body": "{\n\t\"uuid\": \"{{TableBooks.selectedRow.uuid}}\",\n\t\"title\": \"{{TitleEdit.text}}\",\n\t\"author\": \"{{AuthorEdit.text}}\",\n\t\"placeOfPublication\": \"{{PlaceOfPublicationEdit.text}}\",\n\t\"yearOfPublication\": \"{{YearOfPublicationEdit.text}}\",\n\t\"shelfMark\": \"{{ShelfMarkEdit.text}}\",\n\t\"keywords\": \"{{KeywordsEdit.text}}\",\n\t\"language\": \"{{LanguageEdit.text}}\",\n\t\"numberOfCopies\": \"{{NumberOfCopiesEdit.text}}\",\n\t\"status\": \"{{StatusEdit.text}}\",\n\t\"stateCollection\": \"{{StateCollectionEdit.text}}\",\n\t\"lat\": {{LatEdit.text}},\n\t\"long\": {{LongEdit.text}}\n}",
            "bodyFormData": [],
            "formData": {
                "apiContentType": "none"
            },
            "pluginSpecifiedTemplates": [
                {
                    "value": true
                }
            ],
            "path": "/updateBook"
        },
        "dynamicBindingPathList": [
            {
                "key": "body"
            }
        ],
        "isValid": true,
        "invalids": [],
        "jsonPathKeys": [
            "TableBooks.selectedRow.uuid",
            "TitleEdit.text",
            "AuthorEdit.text",
            "PlaceOfPublicationEdit.text",
            "YearOfPublicationEdit.text",
            "ShelfMarkEdit.text",
            "KeywordsEdit.text",
            "LanguageEdit.text",
            "NumberOfCopiesEdit.text",
            "StatusEdit.text",
            "StateCollectionEdit.text",
            "LatEdit.text",
            "LongEdit.text"
        ],
        "userSetOnLoad": false,
        "confirmBeforeExecute": false
    },
    "createdAt": "2022-10-05T09:17:06.284Z",
    "updatedAt": "2022-10-25T17:11:29.160Z",
    "deleted": false,
    "policies": [
        {
            "permission": "read:actions",
            "groups": [],
            "users": []
        },
        {
            "permission": "manage:actions",
            "groups": [],
            "users": []
        },
        {
            "permission": "execute:actions",
            "groups": [],
            "users": []
        }
    ],
    "publishedAction": {
        "name": "updateBook",
        "datasource": {
            "invalids": [],
            "datasourceConfiguration": {
                "url": "https://noderedritman-6335828aa386c31100000ae2.ubos.tech"
            },
            "isValid": true,
            "name": "NodeRedRitman",
            "new": true,
            "organizationId": "Org",
            "pluginId": "API",
            "userPermissions": []
        },
        "executeOnLoad": false,
        "pageId": "Admin",
        "actionConfiguration": {
            "timeoutInMillisecond": 10000,
            "encodeParamsToggle": true,
            "httpMethod": "PUT",
            "headers": [
                {
                    "key": "content-type",
                    "value": "application/json"
                }
            ],
            "queryParameters": [],
            "body": "{\n\t\"uuid\": \"{{TableBooks.selectedRow.uuid}}\",\n\t\"title\": \"{{TitleEdit.text}}\",\n\t\"author\": \"{{AuthorEdit.text}}\",\n\t\"placeOfPublication\": \"{{PlaceOfPublicationEdit.text}}\",\n\t\"yearOfPublication\": \"{{YearOfPublicationEdit.text}}\",\n\t\"shelfMark\": \"{{ShelfMarkEdit.text}}\",\n\t\"keywords\": \"{{KeywordsEdit.text}}\",\n\t\"language\": \"{{LanguageEdit.text}}\",\n\t\"numberOfCopies\": \"{{NumberOfCopiesEdit.text}}\",\n\t\"status\": \"{{StatusEdit.text}}\",\n\t\"stateCollection\": \"{{StateCollectionEdit.text}}\",\n\t\"lat\": {{LatEdit.text}},\n\t\"long\": {{LongEdit.text}}\n}",
            "bodyFormData": [],
            "formData": {
                "apiContentType": "none"
            },
            "pluginSpecifiedTemplates": [
                {
                    "value": true
                }
            ],
            "path": "/updateBook"
        },
        "dynamicBindingPathList": [
            {
                "key": "body"
            }
        ],
        "isValid": true,
        "invalids": [],
        "jsonPathKeys": [
            "TableBooks.selectedRow.uuid",
            "TitleEdit.text",
            "AuthorEdit.text",
            "PlaceOfPublicationEdit.text",
            "YearOfPublicationEdit.text",
            "ShelfMarkEdit.text",
            "KeywordsEdit.text",
            "LanguageEdit.text",
            "NumberOfCopiesEdit.text",
            "StatusEdit.text",
            "StateCollectionEdit.text",
            "LatEdit.text",
            "LongEdit.text"
        ],
        "userSetOnLoad": false,
        "confirmBeforeExecute": false
    }
}
