{
    "common": {
        "vdb_path": "./lighting_all.vdb",
        "parameters": {
            "filter": "center",
            "samples": 4,
            "pass": "beauty,shadows,irradiance_direct",
            "resolution": "256x256"
        }
    },
    "tests": {
        "light_linking": {
            "graph":"light_linking",
            "frame_range": {"start":1, "end":2}
        },
        "visibility": {
            "graph":"visibility",
            "frame_range": {"start":1, "end":5},
            "parameters": {
                "samples": 1,
                "pass": "beauty"
            }
        }
    }
}