{
    "common": {
        "vdb_path": "./volume_lights.vdb",
        "parameters": {
            "samples": 4,
            "bounces": 1,
            "pass": "beauty,indirect,volume_scattering,volume_extinction,shadows"
        }
    },
    "tests": {
        "area_light": {
            "graph":"area_light",
            "frame_range": { "start":0, "end":11 }
        },
        "directional_light": {
            "graph":"directional_light"
        },
        "envmap_light": {
            "graph":"envmap_light"
        },
        "point_light": {
            "graph":"point_light"
        },
        "spot_light": {
            "graph":"spot_light"
        },
        "many_lights": {
            "graph":"many_lights"
        }
    }
}