{
    "common": {
        "vdb_path": "./export_import_expr_builtins.vdb",
        "parameters": {
            "filter": "center",
            "camera": "Camera_001"
        }
    },
    "tests": {
        "expr_i": {
            "graph":"expr_i"
        },
        "expr_n": {
            "graph":"expr_n"
        },
        "expr_p": {
            "graph":"expr_p"
        },
        "expr_uv": {
            "graph":"expr_uv"
        }
    }
}