{
    "common": {
        "vdb_path": "./export_import_expr.vdb",
        "parameters": {
            "filter": "center",
            "camera": "Camera_001",
            "resolution": "16x16"
        }
    },
    "tests": {
        "color_connected_none": {
            "graph":"color_connected_none"
        },
        "color_connected_shading_A": {
            "graph":"color_connected_shading_A"
        },
        "color_connected_shading_RA": {
            "graph":"color_connected_shading_RA"
        },
        "color_connected_shading_value_RA": {
            "graph":"color_connected_shading_value_RA"
        },
        "color_connected_value_A": {
            "graph":"color_connected_value_A"
        },
        "color_connected_value_RA": {
            "graph":"color_connected_value_RA"
        },
        "color_connected_whole_shading": {
            "graph":"color_connected_whole_shading"
        },
        "color_connected_whole_value": {
            "graph":"color_connected_whole_value"
        },
        "vec2_connected_both_mixed": {
            "graph":"vec2_connected_both_mixed"
        },
        "vec2_connected_none": {
            "graph":"vec2_connected_none"
        },
        "vec2_connected_whole_shading": {
            "graph":"vec2_connected_whole_shading"
        },
        "vec2_connected_whole_value": {
            "graph":"vec2_connected_whole_value"
        },
        "vec2_connected_X_shading": {
            "graph":"vec2_connected_X_shading"
        },
        "vec2_connected_X_value": {
            "graph":"vec2_connected_X_value"
        },
        "vec3_connected_mixed": {
            "graph":"vec3_connected_mixed"
        },
        "vec3_connected_none": {
            "graph":"vec3_connected_none"
        },
        "vec3_connected_whole_shading": {
            "graph":"vec3_connected_whole_shading"
        },
        "vec3_connected_whole_value": {
            "graph":"vec3_connected_whole_value"
        },
        "vec3_connected_X_shading": {
            "graph":"vec3_connected_X_shading"
        },
        "vec3_connected_X_value": {
            "graph":"vec3_connected_X_value"
        },
        "vec4_connected_none": {
            "graph":"vec4_connected_none"
        },
        "vec4_connected_whole_shading": {
            "graph":"vec4_connected_whole_shading"
        },
        "vec4_connected_whole_value": {
            "graph":"vec4_connected_whole_value"
        },
        "vec4_connected_X_mixed": {
            "graph":"vec4_connected_X_mixed"
        },
        "vec4_connected_X_shading": {
            "graph":"vec4_connected_X_shading"
        },
        "vec4_connected_X_value": {
            "graph":"vec4_connected_X_value"
        }
    }
}