{
    "common": {
        "vdb_path": "./export_import_color_ramp.vdb",
        "parameters": {
            "filter": "center"
        }
    },
    "tests": {
        "connected_color_channel_shading": {
            "graph":"connected_color_channel_shading"
        },
        "connected_color_channel_value": {
            "graph":"connected_color_channel_value"
        },
        "connected_none": {
            "graph":"connected_none"
        },
        "connected_whole_color_mixed": {
            "graph":"connected_whole_color_mixed"
        },
        "connected_whole_color_shading": {
            "graph":"connected_whole_color_shading"
        },
        "connected_whole_color_value": {
            "graph":"connected_whole_color_value"
        },
        "override_u": {
            "graph":"override_u"
        }
    }
}