{
    "common": {
        "vdb_path": "./shading_noise.vdb",
        "parameters": {
            "filter": "center"
        }
    },
    "tests": {
        "3d_world_vs_local": {
            "graph":"3d_world_vs_local",
            "frame_range": { "start":1, "end": 2 }
        }
    }
}