{
    "common": {
        "vdb_path": "./shading_uber_material.vdb",
        "parameters": {
            "samples": 9,
            "bounces": 2,
            "pass": "beauty,diffuse,glossy_reflection_refraction,indirect"
        }
    },
    "tests": {
        "base_color": {
            "graph":"01_baseColor",
            "parameters": {
                "resolution": "320x64"
            }
        },
        "metallic": {
            "graph":"02_metallic",
            "parameters": {
                "resolution": "320x64"
            }
        },
        "glassness": {
            "graph":"03_glassness",
            "parameters": {
                "resolution": "320x64"
            }
        },
        "translucence": {
            "graph":"04_translucence",
            "parameters": {
                "resolution": "320x64"
            }
        },
        "roughness": {
            "graph":"05_roughness",
            "parameters": {
                "resolution": "320x160"
            }
        },
        "ios": {
            "graph":"07_ios",
            "parameters": {
                "resolution": "320x160"
            }
        },
        "specular_tint": {
            "graph":"08_specularTint",
            "parameters": {
                "resolution": "320x107"
            }
        },
        "anisotropy": {
            "graph":"09_anisotropy",
            "parameters": {
                "resolution": "320x160"
            }
        },
        "anisotropy_rotation": {
            "graph":"10_anisotropyRotation",
            "parameters": {
                "resolution": "320x160"
            }
        },
        "emission_color": {
            "graph":"11_emissionColor",
            "parameters": {
                "resolution": "320x64"
            }
        },
        "absorption": {
            "graph":"12_absorption",
            "parameters": {
                "resolution": "320x107"
            }
        },
        "absorption_color": {
            "graph":"13_absorptionColor",
            "parameters": {
                "resolution": "180x180"
            }
        },
        "absorption_distance": {
            "graph":"14_absorptionDistance",
            "parameters": {
                "resolution": "320x107"
            }
        },
        "sheen": {
            "graph":"15_sheen",
            "parameters": {
                "resolution": "320x64"
            }
        },
        "sheen_edginess": {
            "graph":"16_sheenEdginess",
            "parameters": {
                "resolution": "320x64"
            }
        },
        "sheen_tint": {
            "graph":"17_sheenTint",
            "parameters": {
                "resolution": "320x64"
            }
        },
        "clear_coat": {
            "graph":"18_clearCoat",
            "parameters": {
                "resolution": "320x64"
            }
        },
        "clear_coat_roughness": {
            "graph":"19_clearCoatRoughness",
            "parameters": {
                "resolution": "320x64"
            }
        },
        "opacity": {
            "graph":"20_opacity",
            "parameters": {
                "resolution": "320x64"
            }
        },
        "advance_roughness": {
            "graph":"21_adv_roughness",
            "parameters": {
                "resolution": "320x160",
                "samples": 16,
                "bounces": 1
            }
        }
    }
}