{
    "common": {
        "vdb_path": "./shading_texture.vdb",
        "parameters": {
            "camera": "Camera_001",
            "pass": "diffuse_color",
            "filter": "center"
        }
    },
    "tests": {
        "move_texcoord": {
            "graph":"move_texcoord",
            "parameters": {
                "resolution": "256x256"
            }
        },
        "memory_images": {
            "graph":"memory_images",
            "frame_range": { "start": 0, "end":2 },
            "parameters": {
                "resolution": "512x512"
            }
        },
        "udim": {
            "graph":"udim",
            "parameters": {
                "resolution": "256x256"
            }
        }
    }
}