{
    "common": {
        "vdb_path": "./lighting_animation.vdb",
        "frame_range": { "start":1, "end":3 },
        "parameters": {
            "filter": "center",
            "samples": 4,
            "pass": "beauty,shadows,irradiance_direct",
            "resolution": "320x180"
        }
    },
    "tests": {
        "area": {
            "graph":"area"
        },
        "directional": {
            "graph":"directional"
        },
        "envmap": {
            "graph":"envmap"
        },
        "geometry": {
            "graph":"geometry"
        },
        "point": {
            "graph":"point"
        },
        "spot": {
            "graph":"spot"
        }
    }
}