{
    "common": {
        "vdb_path": "./lighting_ranges.vdb",
        "parameters": {
            "resolution": "160x90",
            "samples": 4
        }
    },
    "tests": {
        "point_ranges": {
            "graph": "point_ranges"
        },
        "area_ranges": {
            "graph": "area_ranges"
        },
        "spot_ranges": {
            "graph": "spot_ranges"
        }
    }
}
