{
    "common": {
        "vdb_path": "./export_import_plugarray_nonstruct.vdb",
        "parameters": {
            "filter": "center",
            "resolution": "16x16",
            "camera": "Camera_001"
        }
    },
    "tests": {
        "color_all_connected": {
            "graph":"color_all_connected"
        },
        "color_channel_connected": {
            "graph":"color_channel_connected"
        },
        "color_none_connected": {
            "graph":"color_none_connected"
        },
        "color_one_connected": {
            "graph":"color_one_connected"
        },
        "float_connected": {
            "graph":"float_connected"
        },
        "int_connected": {
            "graph":"int_connected"
        },
        "vec3f_channel_connected": {
            "graph":"vec3f_channel_connected"
        }
    }
}