<?xml version="1.0" encoding="UTF-8"?>
<svg width="17px" height="9px" viewBox="0 0 17 9" version="1.1" xmlns="http://www.w3.org/2000/svg" xmlns:xlink="http://www.w3.org/1999/xlink">
    <!-- Generator: Sketch 60.1 (88133) - https://sketch.com -->
    <title>icon_arrow_up_white</title>
    <desc>Created with Sketch.</desc>
    <g id="icon_arrow_up_white" stroke="none" stroke-width="1" fill="none" fill-rule="evenodd">
        <polygon id="Path" fill="#FFFFFF" fill-rule="nonzero" points="1 7.9038392 8.61094598 0.292893219 16.221892 7.9038392 15.5147852 8.61094598 8.61055339 1.706 1.70710678 8.61094598"></polygon>
    </g>
</svg>