<?xml version="1.0" encoding="UTF-8"?>
<svg width="15px" height="11px" viewBox="0 0 15 11" version="1.1" xmlns="http://www.w3.org/2000/svg" xmlns:xlink="http://www.w3.org/1999/xlink">
    <!-- Generator: Sketch 60.1 (88133) - https://sketch.com -->
    <title>icon_hierarchy_arrow_right</title>
    <desc>Created with Sketch.</desc>
    <g id="icon_hierarchy_arrow_right" stroke="none" stroke-width="1" fill="none" fill-rule="evenodd">
        <rect id="Rectangle-Copy-8" fill="#000000" x="0" y="6" width="13" height="1"></rect>
        <polyline id="Rectangle" stroke="#000000" transform="translate(9.500000, 6.535534) rotate(45.000000) translate(-9.500000, -6.535534) " points="7 4.03553391 12 4.03553391 12 9.03553391"></polyline>
    </g>
</svg>