<?xml version="1.0" encoding="UTF-8"?>
<svg width="20px" height="21px" viewBox="0 0 20 21" version="1.1" xmlns="http://www.w3.org/2000/svg" xmlns:xlink="http://www.w3.org/1999/xlink">
    <!-- Generator: Sketch 60.1 (88133) - https://sketch.com -->
    <title>icon_search</title>
    <desc>Created with Sketch.</desc>
    <defs>
        <polygon id="path-1" points="0.0006 0.0003 19.974 0.0003 19.974 20.6641 0.0006 20.6641"></polygon>
    </defs>
    <g id="icon_search" stroke="none" stroke-width="1" fill="none" fill-rule="evenodd">
        <g id="Group-3">
            <mask id="mask-2" fill="white">
                <use xlink:href="#path-1"></use>
            </mask>
            <g id="Clip-2"></g>
            <path d="M2.6966,8.2491 C2.6966,5.1871 5.1866,2.6961 8.2496,2.6961 C11.3106,2.6961 13.8016,5.1871 13.8016,8.2491 C13.8016,11.3111 11.3106,13.8021 8.2496,13.8021 C5.1866,13.8021 2.6966,11.3111 2.6966,8.2491 L2.6966,8.2491 Z M19.9746,18.7581 L14.6536,13.4371 C15.8046,12.0191 16.4986,10.2141 16.4986,8.2491 C16.4986,3.7011 12.7976,0.0001 8.2496,0.0001 C3.7006,0.0001 0.0006,3.7011 0.0006,8.2491 C0.0006,12.7971 3.7006,16.4981 8.2496,16.4981 C9.8596,16.4981 11.3586,16.0271 12.6306,15.2261 L18.0686,20.6641 L19.9746,18.7581 Z" id="Fill-1" fill="#FFFFFF" mask="url(#mask-2)"></path>
        </g>
    </g>
</svg>