<?xml version="1.0" encoding="UTF-8" standalone="no"?>
<svg
   xmlns:dc="http://purl.org/dc/elements/1.1/"
   xmlns:cc="http://creativecommons.org/ns#"
   xmlns:rdf="http://www.w3.org/1999/02/22-rdf-syntax-ns#"
   xmlns:svg="http://www.w3.org/2000/svg"
   xmlns="http://www.w3.org/2000/svg"
   xmlns:sodipodi="http://sodipodi.sourceforge.net/DTD/sodipodi-0.dtd"
   xmlns:inkscape="http://www.inkscape.org/namespaces/inkscape"
   width="24px"
   height="21px"
   viewBox="0 0 24 21"
   version="1.1"
   id="svg6"
   sodipodi:docname="icon_UV_list.svg"
   inkscape:version="0.92.3 (2405546, 2018-03-11)">
  <metadata
     id="metadata12">
    <rdf:RDF>
      <cc:Work
         rdf:about="">
        <dc:format>image/svg+xml</dc:format>
        <dc:type
           rdf:resource="http://purl.org/dc/dcmitype/StillImage" />
        <dc:title>icon_UV_list</dc:title>
      </cc:Work>
    </rdf:RDF>
  </metadata>
  <defs
     id="defs10" />
  <sodipodi:namedview
     pagecolor="#ffffff"
     bordercolor="#666666"
     borderopacity="1"
     objecttolerance="10"
     gridtolerance="10"
     guidetolerance="10"
     inkscape:pageopacity="0"
     inkscape:pageshadow="2"
     inkscape:window-width="1153"
     inkscape:window-height="684"
     id="namedview8"
     showgrid="false"
     inkscape:zoom="11.238095"
     inkscape:cx="12"
     inkscape:cy="10.5"
     inkscape:window-x="250"
     inkscape:window-y="118"
     inkscape:window-maximized="0"
     inkscape:current-layer="svg6" />
  <title
     id="title2">icon_UV_list</title>
  <g
     id="icon_UV_list"
     stroke="none"
     stroke-width="1"
     fill="none"
     fill-rule="evenodd">
    <path
       d="M24,0 L24,21 L0,21 L0,0 L24,0 Z M20,3 L10,3 L10,18 L20,18 L20,3 Z M7,15 L3,15 L3,18 L7,18 L7,15 Z M7,9 L3,9 L3,12 L7,12 L7,9 Z M7,3 L3,3 L3,6 L7,6 L7,3 Z"
       id="Combined-Shape"
       fill="#000000" />
  </g>
  <text
     xml:space="preserve"
     style="font-style:normal;font-weight:normal;font-size:13.33333333px;line-height:1.25;font-family:sans-serif;letter-spacing:0px;word-spacing:0px;fill:#000000;fill-opacity:1;stroke:none;"
     x="8.4533901"
     y="5.25"
     id="text824"><tspan
       sodipodi:role="line"
       id="tspan822"
       x="8.4533901"
       y="14.6875"></tspan></text>
  <text
     xml:space="preserve"
     style="font-style:normal;font-weight:normal;font-size:10.66666698px;line-height:1.25;font-family:sans-serif;letter-spacing:0px;word-spacing:0px;fill:#000000;fill-opacity:1;stroke:none"
     x="7.9194913"
     y="16.817797"
     id="text828"><tspan
       sodipodi:role="line"
       id="tspan826"
       x="7.9194913"
       y="26.255297"></tspan></text>
  <text
     xml:space="preserve"
     style="font-style:normal;font-weight:normal;font-size:10.66666698px;line-height:1.25;font-family:sans-serif;letter-spacing:0px;word-spacing:0px;fill:#000000;fill-opacity:1;stroke:none"
     x="10.322033"
     y="14.237288"
     id="text832"><tspan
       sodipodi:role="line"
       id="tspan830"
       x="10.322033"
       y="14.237288">U</tspan></text>
</svg>
