<!-- Generator: Adobe Illustrator 23.0.6, SVG Export Plug-In  -->
<svg version="1.1" xmlns="http://www.w3.org/2000/svg" xmlns:xlink="http://www.w3.org/1999/xlink" x="0px" y="0px" width="24.1px"
	 height="21.3px" viewBox="0 0 24.1 21.3" style="enable-background:new 0 0 24.1 21.3;" xml:space="preserve">
<style type="text/css">
	.st0{fill:none;stroke:#000000;stroke-width:2;stroke-miterlimit:10;}
</style>
<defs>
</defs>
<g>
	<polyline class="st0" points="12.8,20.6 22.7,10.7 12.8,0.7 	"/>
	<line class="st0" x1="22.7" y1="10.7" x2="0" y2="10.7"/>
</g>
</svg>
