<?xml version="1.0" encoding="UTF-8" standalone="no"?>
<svg
   xmlns:dc="http://purl.org/dc/elements/1.1/"
   xmlns:cc="http://creativecommons.org/ns#"
   xmlns:rdf="http://www.w3.org/1999/02/22-rdf-syntax-ns#"
   xmlns:svg="http://www.w3.org/2000/svg"
   xmlns="http://www.w3.org/2000/svg"
   xmlns:sodipodi="http://sodipodi.sourceforge.net/DTD/sodipodi-0.dtd"
   xmlns:inkscape="http://www.inkscape.org/namespaces/inkscape"
   width="15px"
   height="7px"
   viewBox="0 0 15 7"
   version="1.1"
   id="svg8"
   sodipodi:docname="icon_dropdown_open.svg"
   inkscape:version="0.92.3 (2405546, 2018-03-11)">
  <metadata
     id="metadata14">
    <rdf:RDF>
      <cc:Work
         rdf:about="">
        <dc:format>image/svg+xml</dc:format>
        <dc:type
           rdf:resource="http://purl.org/dc/dcmitype/StillImage" />
      </cc:Work>
    </rdf:RDF>
  </metadata>
  <defs
     id="defs12" />
  <sodipodi:namedview
     pagecolor="#ffffff"
     bordercolor="#666666"
     borderopacity="1"
     objecttolerance="10"
     gridtolerance="10"
     guidetolerance="10"
     inkscape:pageopacity="0"
     inkscape:pageshadow="2"
     inkscape:window-width="1104"
     inkscape:window-height="788"
     id="namedview10"
     showgrid="false"
     inkscape:zoom="22.4"
     inkscape:cx="7.5892857"
     inkscape:cy="3.5"
     inkscape:window-x="371"
     inkscape:window-y="219"
     inkscape:window-maximized="0"
     inkscape:current-layer="svg8" />
  <!-- Generator: Sketch 60.1 (88133) - https://sketch.com -->
  <title
     id="title2">icon_dropdown</title>
  <desc
     id="desc4">Created with Sketch.</desc>
  <g
     id="icon_dropdown"
     transform="matrix(1,0,0,-1,0,6.9868763)"
     style="fill:none;fill-rule:evenodd;stroke:none;stroke-width:1">
    <polygon
       id="Rectangle"
       points="7.5,6.9868763 0,3.281179e-13 15,3.281179e-13 "
       style="fill:#2d373c" />
  </g>
</svg>
