<?xml version="1.0" encoding="UTF-8"?>
<svg width="11px" height="16px" viewBox="0 0 11 16" version="1.1" xmlns="http://www.w3.org/2000/svg" xmlns:xlink="http://www.w3.org/1999/xlink">
    <!-- Generator: Sketch 60.1 (88133) - https://sketch.com -->
    <title>icon_arrow_search_white</title>
    <desc>Created with Sketch.</desc>
    <g id="icon_arrow_search_white" stroke="none" stroke-width="1" fill="none" fill-rule="evenodd">
        <polygon id="Rectangle" fill="#FFFFFF" fill-rule="nonzero" transform="translate(3.000000, 8.000000) rotate(45.000000) translate(-3.000000, -8.000000) " points="8 3 8 13 6 13 6 5 -2 5 -2 3"></polygon>
    </g>
</svg>