<?xml version="1.0" encoding="UTF-8"?>
<svg width="15px" height="9px" viewBox="0 0 15 9" version="1.1" xmlns="http://www.w3.org/2000/svg" xmlns:xlink="http://www.w3.org/1999/xlink">
    <!-- Generator: Sketch 60.1 (88133) - https://sketch.com -->
    <title>icon_hierarchy_arrow_left</title>
    <desc>Created with Sketch.</desc>
    <g id="icon_hierarchy_arrow_left" stroke="none" stroke-width="1" fill="none" fill-rule="evenodd">
        <rect id="Rectangle-Copy-8" fill="#000000" transform="translate(6.500000, 4.500000) scale(-1, 1) translate(-6.500000, -4.500000) " x="1" y="4" width="11" height="1"></rect>
        <polyline id="Rectangle" stroke="#000000" transform="translate(4.500000, 4.500000) scale(-1, 1) rotate(45.000000) translate(-4.500000, -4.500000) " points="2 2 7 2 7 7"></polyline>
    </g>
</svg>