{
  "$schema": "../../node_modules/ng-packagr/ng-package.schema.json",
  "dest": "../../dist/rdv-lib2",
  "lib": {
    "entryFile": "src/public-api.ts",
    "umdModuleIds": {
      "@ngx-translate/core": "x1",
      "@ngrx/store": "x2",
      "@gilsdav/ngx-translate-router": "x3",
      "ngx-toastr": "x4",
      "@ngrx/effects": "x5",
      "@ngrx/entity": "x6",
      "ngx-clipboard": "x7",
      "dompurify": "DOMPurify",
      "popper.js": "Popper",
      "date-fns/locale/en-GB": "x8",
      "date-fns/locale/de": "x9",
      "date-fns/locale/fr": "x10",
      "date-fns/locale/it": "x11",
      "date-fns-tz": "x12",
      "@ng-select/ng-select": "x13",
      "tinymce": "tinymce",
      "lz-string": "LZString"
    }
  }
}
