<?xml version="1.0" encoding="UTF-8"?>
<svg width="15px" height="15px" viewBox="0 0 15 15" version="1.1" xmlns="http://www.w3.org/2000/svg" xmlns:xlink="http://www.w3.org/1999/xlink">
    <!-- Generator: Sketch 60.1 (88133) - https://sketch.com -->
    <title>icon_arrow_left</title>
    <desc>Created with Sketch.</desc>
    <g id="icon_arrow_left" stroke="none" stroke-width="1" fill="none" fill-rule="evenodd">
        <polygon id="Path" fill="#2D373C" fill-rule="nonzero" transform="translate(4.030330, 7.553553) scale(-1, 1) rotate(90.000000) translate(-4.030330, -7.553553) " points="-3.3232233 10.8767767 4.03033009 3.5232233 11.3838835 10.8767767 10.6767767 11.5838835 4.03033009 4.93733009 -2.61611652 11.5838835"></polygon>
        <rect id="Rectangle" fill="#2D373C" x="1" y="7" width="14" height="1"></rect>
    </g>
</svg>