<?xml version="1.0" encoding="utf-8"?>
<!-- Generator: Adobe Illustrator 22.1.0, SVG Export Plug-In . SVG Version: 6.00 Build 0)  -->
<svg version="1.1" id="Ebene_1" xmlns="http://www.w3.org/2000/svg" xmlns:xlink="http://www.w3.org/1999/xlink" x="0px" y="0px"
	 width="200px" height="83px" viewBox="0 0 200 83" style="enable-background:new 0 0 200 83;" xml:space="preserve">
<style type="text/css">
	.st0{fill:#1D1D1B;}
	.st1{fill:#545454;}
</style>
<g>
	<g>
		<path class="st0" d="M49,33.9c-0.1-0.8-0.5-1.2-1.3-1.2c-0.6,0-1.2,0.3-1.2,1c0,0.8,0.7,0.9,1.4,1.1c1.2,0.3,2.9,0.6,2.9,2.2
			c0,1.9-1.7,2.6-3.3,2.6c-1.8,0-3-0.7-3-2.6h1.7c-0.1,0.9,0.4,1.4,1.3,1.4c0.7,0,1.5-0.2,1.5-1c0-0.9-1.1-1-1.8-1.1
			c-1.1-0.3-2.5-0.8-2.5-2.1c0-1.8,1.6-2.5,3.2-2.5c1.5,0,2.7,0.8,2.7,2.4H49z"/>
		<path class="st0" d="M58.5,34.2c0-0.8-0.5-1.5-1.5-1.5c-1.2,0-1.5,1.7-1.5,2.8s0.3,2.8,1.5,2.8c1,0,1.5-0.7,1.5-1.5h1.8
			c-0.1,1.9-1.5,2.7-3.2,2.7c-2.2,0-3.2-1.8-3.2-4c0-2.2,1-4,3.2-4c1.8,0,3.2,0.7,3.2,2.7H58.5z"/>
		<path class="st0" d="M63.7,39.4v-7.7h1.7v3h2.9v-3h1.7v7.7h-1.7V36h-2.9v3.4H63.7z"/>
		<path class="st0" d="M77.6,31.7h1.9l1.3,5.8h0l1.2-5.8h1.6l-2,7.7h-1.8l-1.4-5.9h0l-1.5,5.9H75l-1.9-7.7h1.7l1.2,5.8h0L77.6,31.7z
			"/>
		<path class="st0" d="M86.9,31.7H92V33h-3.5v1.8h3.3v1.3h-3.3v2.1h3.6v1.3h-5.3V31.7z"/>
		<path class="st0" d="M97.9,39.4h-1.7v-7.7h1.7V39.4z"/>
		<path class="st0" d="M101.6,38.1l3.8-5.1h-3.6v-1.3h5.6V33l-3.8,5.1h3.9v1.3h-5.9V38.1z"/>
		<path class="st0" d="M111.2,31.7h5.2V33h-3.5v1.8h3.3v1.3h-3.3v2.1h3.6v1.3h-5.3V31.7z"/>
		<path class="st0" d="M122.1,39.4h-1.7v-7.7h3.3c1.3,0,2.7,0.4,2.7,2c0,1-0.6,1.7-1.6,1.9v0c1.3,0.1,1.3,0.9,1.4,2
			c0.1,0.5,0.1,1.4,0.4,1.8h-1.8c-0.1-0.7-0.2-1.4-0.3-2.1c0-0.4-0.1-1-0.7-1h-1.7V39.4z M122.1,35h1.4c0.7,0,1.2-0.4,1.2-1.1
			c0-0.7-0.4-1-1.2-1h-1.4V35z"/>
		<path class="st0" d="M132,39.4h-1.7v-7.7h1.7V39.4z"/>
		<path class="st0" d="M140.1,33.9c-0.1-0.8-0.5-1.2-1.3-1.2c-0.6,0-1.2,0.3-1.2,1c0,0.8,0.7,0.9,1.4,1.1c1.2,0.3,2.9,0.6,2.9,2.2
			c0,1.9-1.7,2.6-3.3,2.6c-1.8,0-3-0.7-3-2.6h1.7c-0.1,0.9,0.4,1.4,1.3,1.4c0.7,0,1.5-0.2,1.5-1c0-0.9-1.1-1-1.8-1.1
			c-1.1-0.3-2.5-0.8-2.5-2.1c0-1.8,1.6-2.5,3.2-2.5c1.5,0,2.7,0.8,2.7,2.4H140.1z"/>
		<path class="st0" d="M149.7,34.2c0-0.8-0.5-1.5-1.5-1.5c-1.2,0-1.5,1.7-1.5,2.8s0.3,2.8,1.5,2.8c1,0,1.5-0.7,1.5-1.5h1.8
			c-0.1,1.9-1.5,2.7-3.2,2.7c-2.2,0-3.2-1.8-3.2-4c0-2.2,1-4,3.2-4c1.8,0,3.2,0.7,3.2,2.7H149.7z"/>
		<path class="st0" d="M154.9,39.4v-7.7h1.7v3h2.9v-3h1.7v7.7h-1.7V36h-2.9v3.4H154.9z"/>
		<path class="st0" d="M165.1,31.7h5.2V33h-3.5v1.8h3.3v1.3h-3.3v2.1h3.6v1.3h-5.3V31.7z"/>
		<path class="st0" d="M178.2,33.9c-0.1-0.8-0.5-1.2-1.3-1.2c-0.6,0-1.2,0.3-1.2,1c0,0.8,0.7,0.9,1.4,1.1c1.2,0.3,2.9,0.6,2.9,2.2
			c0,1.9-1.7,2.6-3.3,2.6c-1.8,0-3-0.7-3-2.6h1.7c-0.1,0.9,0.4,1.4,1.3,1.4c0.7,0,1.5-0.2,1.5-1c0-0.9-1.1-1-1.8-1.1
			c-1.1-0.3-2.5-0.8-2.5-2.1c0-1.8,1.6-2.5,3.2-2.5c1.5,0,2.7,0.8,2.7,2.4H178.2z"/>
		<path class="st0" d="M48.6,44.7h1.9l1.3,5.8h0l1.2-5.8h1.6l-2,7.7h-1.8l-1.4-5.9h0L48,52.4h-1.9l-1.9-7.7h1.7l1.2,5.8h0L48.6,44.7
			z"/>
		<path class="st0" d="M59.7,52.4h-1.7v-7.7h1.7V52.4z"/>
		<path class="st0" d="M65.6,52.4h-1.7v-7.7h3.3c1.3,0,2.7,0.4,2.7,2c0,1-0.7,1.7-1.6,1.9v0c1.3,0.1,1.3,0.9,1.4,2
			c0.1,0.5,0.1,1.4,0.4,1.8h-1.8c-0.1-0.7-0.2-1.4-0.3-2.1c0-0.4-0.1-1-0.7-1h-1.7V52.4z M65.6,48h1.4c0.7,0,1.2-0.4,1.2-1.1
			c0-0.7-0.4-1-1.2-1h-1.4V48z"/>
		<path class="st0" d="M72.8,44.7h6.2V46h-2.3v6.4h-1.7V46h-2.3V44.7z"/>
		<path class="st0" d="M86.1,46.9c-0.1-0.8-0.5-1.2-1.3-1.2c-0.6,0-1.2,0.3-1.2,1c0,0.8,0.7,0.9,1.4,1.1c1.2,0.3,2.9,0.6,2.9,2.2
			c0,1.9-1.7,2.6-3.3,2.6c-1.8,0-3-0.7-3-2.6h1.7c-0.1,0.9,0.4,1.4,1.3,1.4c0.7,0,1.5-0.2,1.5-1c0-0.9-1.1-1-1.8-1.1
			c-1.1-0.3-2.5-0.8-2.5-2.1c0-1.8,1.6-2.5,3.2-2.5c1.5,0,2.7,0.8,2.7,2.4H86.1z"/>
		<path class="st0" d="M95.6,47.2c0-0.8-0.5-1.5-1.5-1.5c-1.2,0-1.5,1.7-1.5,2.8s0.3,2.8,1.5,2.8c1,0,1.5-0.7,1.5-1.5h1.8
			c-0.1,1.9-1.5,2.7-3.2,2.7c-2.2,0-3.2-1.8-3.2-4c0-2.2,1-4,3.2-4c1.8,0,3.2,0.7,3.2,2.7H95.6z"/>
		<path class="st0" d="M100.9,52.4v-7.7h1.7v3h2.9v-3h1.7v7.7h-1.7V49h-2.9v3.4H100.9z"/>
		<path class="st0" d="M110.6,52.4l2.8-7.7h2l2.7,7.7h-1.7l-0.6-1.6h-3l-0.6,1.6H110.6z M115.4,49.5l-1.1-3.3h0l-1.1,3.3H115.4z"/>
		<path class="st0" d="M121.4,52.4v-7.7h5V46h-3.3v1.9h3.1v1.3h-3.1v3.3H121.4z"/>
		<path class="st0" d="M129.4,44.7h6.2V46h-2.3v6.4h-1.7V46h-2.3V44.7z"/>
		<path class="st0" d="M142.7,46.9c-0.1-0.8-0.5-1.2-1.3-1.2c-0.6,0-1.2,0.3-1.2,1c0,0.8,0.7,0.9,1.4,1.1c1.2,0.3,2.9,0.6,2.9,2.2
			c0,1.9-1.7,2.6-3.3,2.6c-1.8,0-3-0.7-3-2.6h1.7c-0.1,0.9,0.4,1.4,1.3,1.4c0.7,0,1.5-0.2,1.5-1c0-0.9-1.1-1-1.8-1.1
			c-1.1-0.3-2.5-0.8-2.5-2.1c0-1.8,1.6-2.5,3.2-2.5c1.5,0,2.7,0.8,2.7,2.4H142.7z"/>
		<path class="st0" d="M147.4,52.4l2.8-7.7h2l2.7,7.7h-1.7l-0.6-1.6h-3l-0.6,1.6H147.4z M152.2,49.5l-1.1-3.3h0l-1.1,3.3H152.2z"/>
		<path class="st0" d="M159.8,52.4h-1.7v-7.7h3.3c1.3,0,2.7,0.4,2.7,2c0,1-0.6,1.7-1.6,1.9v0c1.3,0.1,1.3,0.9,1.4,2
			c0.1,0.5,0.1,1.4,0.4,1.8h-1.8c-0.1-0.7-0.2-1.4-0.3-2.1c0-0.4-0.1-1-0.7-1h-1.7V52.4z M159.8,48h1.4c0.7,0,1.2-0.4,1.2-1.1
			c0-0.7-0.4-1-1.2-1h-1.4V48z"/>
		<path class="st0" d="M172.1,47.2c0-0.8-0.5-1.5-1.5-1.5c-1.2,0-1.5,1.7-1.5,2.8s0.3,2.8,1.5,2.8c1,0,1.5-0.7,1.5-1.5h1.8
			c-0.1,1.9-1.5,2.7-3.2,2.7c-2.2,0-3.2-1.8-3.2-4c0-2.2,1-4,3.2-4c1.8,0,3.2,0.7,3.2,2.7H172.1z"/>
		<path class="st0" d="M177.4,52.4v-7.7h1.7v3h2.9v-3h1.7v7.7H182V49H179v3.4H177.4z"/>
		<path class="st0" d="M189.2,52.4h-1.7v-7.7h1.7V52.4z"/>
		<path class="st0" d="M192.5,44.7h1.8l2,6.1h0l2-6.1h1.6l-2.8,7.7h-1.8L192.5,44.7z"/>
	</g>
	<g>
		<path class="st1" d="M4.5,33.9c-0.1-0.8-0.5-1.2-1.3-1.2c-0.6,0-1.2,0.3-1.2,1c0,0.8,0.7,0.9,1.4,1.1c1.2,0.3,2.9,0.6,2.9,2.2
			c0,1.9-1.7,2.6-3.3,2.6c-1.8,0-3-0.7-3-2.6h1.7c-0.1,0.9,0.4,1.4,1.3,1.4c0.7,0,1.5-0.2,1.5-1c0-0.9-1.1-1-1.8-1.1
			c-1.1-0.3-2.5-0.8-2.5-2.1c0-1.8,1.6-2.5,3.2-2.5c1.5,0,2.7,0.8,2.7,2.4H4.5z"/>
		<path class="st1" d="M13.8,31.7h1.9l1.3,5.8h0l1.2-5.8h1.6l-2,7.7H16l-1.4-5.9h0l-1.5,5.9h-1.9l-1.9-7.7h1.7l1.2,5.8h0L13.8,31.7z
			"/>
		<path class="st1" d="M22.3,39.4l2.8-7.7h2l2.7,7.7h-1.7l-0.6-1.6h-3l-0.6,1.6H22.3z M27.1,36.5L26,33.2h0l-1.1,3.3H27.1z"/>
	</g>
</g>
</svg>
