
########################################################################
# Colfax Cluster - https://colfaxresearch.com/
#      Date:           Sun Aug 22 05:58:35 PDT 2021
#    Job ID:           139626.c008
#      User:           u84927
# Resources:           neednodes=1:flat,nodes=1:flat,walltime=00:02:00
########################################################################


[1mNumerical integration with n=1000000000[0m
[1m Step        Time, ms        GSteps/s        Accuracy[0m
    1         385.359           2.595       2.287e-11*
    2          88.674          11.277       0.000e+00*
    3          88.654          11.280       0.000e+00*
    4          88.654          11.280       4.852e-32
    5          88.615          11.285       3.432e-32
    6          88.903          11.248       0.000e+00
    7          88.752          11.267       3.434e-31
    8          88.656          11.280       2.456e-32
    9          88.626          11.283       0.000e+00
   10          88.660          11.279       3.074e-32
-----------------------------------------------------
[1mAverage performance:[0m
           [42m    88.7+-0.1[0m   [42m    11.3+-0.0[0m
-----------------------------------------------------
* - warm-up, not included in average


########################################################################
# Colfax Cluster
# End of output for job 139626.c008
# Date: Sun Aug 22 05:58:37 PDT 2021
########################################################################

