
########################################################################
# Colfax Cluster - https://colfaxresearch.com/
#      Date:           Sun Aug 22 06:00:27 PDT 2021
#    Job ID:           139627.c008
#      User:           u84927
# Resources:           neednodes=1:flat,nodes=1:flat,walltime=00:02:00
########################################################################


[1mNumerical integration with n=1000000000[0m
[1m Step        Time, ms        GSteps/s        Accuracy[0m
    1         255.836           3.909       2.287e-11*
    2          89.474          11.176       0.000e+00*
    3          89.502          11.173       8.980e-33*
    4          89.441          11.181       1.092e-31
    5         101.745           9.829       9.532e-32
    6         137.928           7.250       0.000e+00
    7         125.949           7.940       7.726e-31
    8         149.872           6.672       6.139e-33
    9         192.578           5.193       6.912e-33
   10         154.078           6.490       6.916e-32
-----------------------------------------------------
[1mAverage performance:[0m
           [42m   135.9+-32.0[0m   [42m     7.8+-1.9[0m
-----------------------------------------------------
* - warm-up, not included in average


########################################################################
# Colfax Cluster
# End of output for job 139627.c008
# Date: Sun Aug 22 06:00:29 PDT 2021
########################################################################

