
########################################################################
# Colfax Cluster - https://colfaxresearch.com/
#      Date:           Sun Aug 22 06:01:56 PDT 2021
#    Job ID:           139628.c008
#      User:           u84927
# Resources:           neednodes=4:flat,nodes=4:flat,walltime=00:02:00
########################################################################


[1mNumerical integration with n=1000000000[0m
[1m Step        Time, ms        GSteps/s        Accuracy[0m
    1         211.594           4.726       2.288e-11*
    2          32.625          30.651       2.488e-18*
    3          26.712          37.436       2.914e-18*
    4          37.703          26.523       3.149e-18
    5          46.311          21.593       3.300e-18
    6          34.374          29.092       3.405e-18
    7          45.300          22.075       3.482e-18
    8          34.277          29.174       3.542e-18
    9          34.386          29.082       3.589e-18
   10          34.307          29.149       3.627e-18
-----------------------------------------------------
[1mAverage performance:[0m
           [42m    38.1+-5.0[0m   [42m    26.7+-3.2[0m
-----------------------------------------------------
* - warm-up, not included in average


########################################################################
# Colfax Cluster
# End of output for job 139628.c008
# Date: Sun Aug 22 06:01:59 PDT 2021
########################################################################

