Iteration	Y	var_1	var_2	var_3	var_4	var_5	var_6	var_7	var_8
1.0	0.5056930184364319	0.30722907301844704	10.0	4.0	10.0	4.0	3.0	50.0	0.0001
2.0	0.5308902263641357	0.45860157050902495	8.0	10.0	4.0	4.0	2.0	5.0	0.001
3.0	0.5400952100753784	0.2478140842452975	4.0	4.0	8.0	10.0	3.0	50.0	1e-05
4.0	0.5463936924934387	0.330449208404976	8.0	8.0	10.0	16.0	1.0	5.0	0.01
5.0	0.5195589065551758	0.24690236749642774	10.0	8.0	4.0	10.0	1.0	10.0	0.01
6.0	0.5663360953330994	0.40103254858052123	16.0	16.0	16.0	4.0	2.0	50.0	0.0001
7.0	0.558946430683136	0.20209553380607542	4.0	4.0	4.0	16.0	3.0	5.0	0.001
8.0	0.5542284846305847	0.1383233591785752	16.0	4.0	4.0	4.0	3.0	50.0	0.0001
9.0	0.53993159532547	0.4029743585882249	4.0	4.0	4.0	4.0	2.0	5.0	0.0001
10.0	0.5536276698112488	0.2744614695677088	4.0	4.0	16.0	4.0	1.0	5.0	0.0001
11.0	0.5377755165100098	0.20511129116207355	4.0	4.0	4.0	16.0	1.0	50.0	0.001
12.0	0.7215025424957275	0.012072708371916818	4.0	4.0	4.0	4.0	3.0	50.0	0.01
13.0	0.5497673749923706	0.2448561538351151	16.0	16.0	16.0	16.0	2.0	5.0	0.0001
14.0	0.5536077618598938	0.4984370495657515	16.0	16.0	16.0	16.0	1.0	5.0	0.0001
15.0	0.5420202016830444	0.3146525656673122	16.0	16.0	10.0	16.0	1.0	5.0	0.01
16.0	0.5356476306915283	0.45423430104997936	16.0	16.0	16.0	16.0	3.0	5.0	0.01
17.0	0.5459335446357727	0.06161401066839611	16.0	10.0	16.0	16.0	1.0	5.0	0.001
18.0	0.5209049582481384	0.3985815089311209	16.0	16.0	16.0	16.0	2.0	5.0	0.001
19.0	0.5445175766944885	0.4934365113651208	16.0	16.0	16.0	16.0	3.0	5.0	0.001
20.0	0.5709924697875977	0.41406648248776023	16.0	16.0	8.0	16.0	1.0	5.0	1e-05
21.0	0.5386070013046265	0.14967646503489623	16.0	16.0	16.0	16.0	1.0	5.0	1e-05
22.0	0.5578590035438538	0.08678349233992133	16.0	16.0	16.0	16.0	3.0	5.0	1e-05
23.0	0.556689441204071	0.43551255383959825	16.0	10.0	16.0	16.0	3.0	5.0	1e-05
24.0	0.5708208084106445	0.19413169795713187	16.0	16.0	16.0	16.0	1.0	5.0	1e-05
25.0	0.5512620210647583	0.34863155570751897	16.0	16.0	16.0	16.0	1.0	5.0	0.0001
