Iteration	Y	var_1	var_2	var_3	var_4	var_5	var_6	var_7	var_8
1.0	0.5064317584037781	0.30722907301844704	10.0	4.0	10.0	4.0	3.0	50.0	0.0001
2.0	0.5413659811019897	0.45860157050902495	8.0	10.0	4.0	4.0	2.0	5.0	0.001
3.0	0.5400820970535278	0.2478140842452975	4.0	4.0	8.0	10.0	3.0	50.0	1e-05
4.0	0.5478942394256592	0.330449208404976	8.0	8.0	10.0	16.0	1.0	5.0	0.01
5.0	0.5396391153335571	0.24690236749642774	10.0	8.0	4.0	10.0	1.0	10.0	0.01
6.0	0.6812252402305603	0.0	16.0	4.0	16.0	4.0	1.0	50.0	0.01
7.0	0.5541473627090454	0.5	4.0	16.0	4.0	4.0	3.0	50.0	1e-05
8.0	0.5533267855644226	0.5	4.0	4.0	4.0	4.0	3.0	50.0	1e-05
9.0	0.5480032563209534	0.5	16.0	16.0	4.0	16.0	3.0	25.0	1e-05
10.0	0.5551459789276123	0.29134650907802284	4.0	16.0	4.0	16.0	3.0	5.0	0.001
11.0	0.5550774335861206	0.313333769281	4.0	16.0	4.0	16.0	1.0	5.0	0.01
12.0	0.5462731122970581	0.23325206906221224	4.0	10.0	4.0	16.0	2.0	5.0	1e-05
13.0	0.5446644425392151	0.01099366039353633	4.0	16.0	4.0	16.0	1.0	5.0	0.01
14.0	0.5470758080482483	0.13651142209027978	4.0	10.0	4.0	16.0	3.0	5.0	0.01
15.0	0.5341503620147705	0.34632107707515464	4.0	16.0	4.0	16.0	3.0	5.0	0.01
16.0	0.5323119759559631	0.23066212174832212	4.0	16.0	4.0	16.0	2.0	5.0	0.0001
17.0	0.5448818206787109	0.47810903783062586	4.0	16.0	4.0	16.0	3.0	5.0	0.0001
18.0	0.5538597702980042	0.16592215851179676	4.0	16.0	4.0	16.0	3.0	5.0	0.0001
19.0	0.5468031167984009	0.10239033954009802	4.0	16.0	4.0	16.0	2.0	5.0	0.01
20.0	0.5459181666374207	0.40359352730693	4.0	16.0	4.0	16.0	3.0	5.0	0.001
21.0	0.5519530177116394	0.3049249178785731	4.0	16.0	4.0	16.0	2.0	5.0	0.01
22.0	0.5521154403686523	0.39978049102130536	4.0	16.0	4.0	16.0	1.0	5.0	1e-05
23.0	0.5290285348892212	0.3775270182851934	4.0	16.0	8.0	16.0	3.0	5.0	0.001
24.0	0.548003613948822	0.37875303318409964	4.0	16.0	4.0	10.0	2.0	5.0	0.001
25.0	0.5483399629592896	0.17046925200640728	4.0	16.0	4.0	16.0	1.0	5.0	1e-05
