Iteration	Y	var_1	var_2	var_3	var_4	var_5	var_6	var_7	var_8
1.0	0.5515945553779602	0.3484481806812729	16.0	16.0	16.0	10.0	1.0	10.0	0.0001
2.0	0.5474060773849487	0.2547012789339299	10.0	4.0	16.0	10.0	1.0	10.0	0.01
3.0	0.5551301836967468	0.40295900079278113	16.0	16.0	8.0	10.0	2.0	5.0	0.0001
4.0	0.5440658330917358	0.46162103767419177	4.0	16.0	8.0	16.0	3.0	10.0	0.0001
5.0	0.5781012773513794	0.18253513427539897	4.0	4.0	16.0	8.0	2.0	5.0	1e-05
6.0	0.5717812776565552	0.20176491928597662	16.0	10.0	8.0	8.0	2.0	50.0	0.001
7.0	0.5593999028205872	0.0	16.0	4.0	16.0	16.0	3.0	5.0	1e-05
8.0	0.5537367463111877	0.0	16.0	4.0	4.0	16.0	1.0	25.0	1e-05
9.0	0.5809702277183533	0.09469261911739546	4.0	16.0	4.0	16.0	2.0	5.0	0.01
10.0	0.5543044805526733	0.3204820424584555	16.0	16.0	16.0	16.0	1.0	50.0	0.0001
11.0	0.5493752360343933	0.31270691809439166	16.0	16.0	16.0	4.0	1.0	50.0	0.0001
12.0	0.5461379289627075	0.465384171732497	16.0	16.0	16.0	10.0	1.0	50.0	1e-05
13.0	0.539145290851593	0.4931470938282009	16.0	16.0	16.0	4.0	1.0	50.0	0.0001
14.0	0.5596936941146851	0.38042394844406857	16.0	16.0	16.0	4.0	2.0	50.0	0.001
15.0	0.5211068987846375	0.4264253455142011	16.0	16.0	16.0	8.0	1.0	50.0	0.001
16.0	0.5019192099571228	0.27987472098044675	16.0	16.0	16.0	4.0	3.0	50.0	0.001
17.0	0.5451318621635437	0.5	16.0	16.0	16.0	4.0	3.0	50.0	0.01
18.0	0.536583423614502	0.37858167803223003	16.0	16.0	16.0	4.0	3.0	50.0	1e-05
19.0	0.5608141422271729	0.5	16.0	16.0	16.0	4.0	3.0	50.0	1e-05
20.0	0.5799027681350708	0.3973461216040617	16.0	16.0	16.0	4.0	3.0	50.0	1e-05
21.0	0.5612425208091736	0.044672973591804464	16.0	16.0	16.0	8.0	1.0	50.0	0.01
22.0	0.5815954804420471	0.06674684547368909	16.0	16.0	16.0	4.0	1.0	50.0	0.01
23.0	0.5645416975021362	0.264216829710257	16.0	10.0	16.0	4.0	1.0	50.0	0.01
24.0	0.5421830415725708	0.27856670597145217	16.0	16.0	16.0	8.0	3.0	50.0	0.0001
25.0	0.5478713512420654	0.25958642106268187	16.0	16.0	16.0	4.0	2.0	50.0	1e-05
