<?xml version="1.0" encoding="utf-8"?>
<!DOCTYPE eagle SYSTEM "eagle.dtd">
<eagle version="9.2.1">
<drawing>
<settings>
<setting alwaysvectorfont="no"/>
<setting keepoldvectorfont="yes"/>
<setting verticaltext="up"/>
</settings>
<grid distance="50" unitdist="mil" unit="mil" style="lines" multiple="1" display="yes" altdistance="5" altunitdist="mil" altunit="mil"/>
<layers>
<layer number="1" name="Top" color="4" fill="1" visible="yes" active="yes"/>
<layer number="2" name="Route2" color="1" fill="3" visible="no" active="yes"/>
<layer number="3" name="Route3" color="4" fill="3" visible="no" active="yes"/>
<layer number="4" name="Route4" color="1" fill="4" visible="no" active="yes"/>
<layer number="5" name="Route5" color="4" fill="4" visible="no" active="yes"/>
<layer number="6" name="Route6" color="1" fill="8" visible="no" active="yes"/>
<layer number="7" name="Route7" color="4" fill="8" visible="no" active="yes"/>
<layer number="8" name="Route8" color="1" fill="2" visible="no" active="yes"/>
<layer number="9" name="Route9" color="4" fill="2" visible="no" active="yes"/>
<layer number="10" name="Route10" color="1" fill="7" visible="no" active="yes"/>
<layer number="11" name="Route11" color="4" fill="7" visible="no" active="yes"/>
<layer number="12" name="Route12" color="1" fill="5" visible="no" active="yes"/>
<layer number="13" name="Route13" color="4" fill="5" visible="no" active="yes"/>
<layer number="14" name="Route14" color="1" fill="6" visible="no" active="yes"/>
<layer number="15" name="Route15" color="4" fill="6" visible="no" active="yes"/>
<layer number="16" name="Bottom" color="1" fill="1" visible="yes" active="yes"/>
<layer number="17" name="Pads" color="2" fill="1" visible="yes" active="yes"/>
<layer number="18" name="Vias" color="2" fill="1" visible="yes" active="yes"/>
<layer number="19" name="Unrouted" color="6" fill="1" visible="yes" active="yes"/>
<layer number="20" name="Dimension" color="15" fill="1" visible="yes" active="yes"/>
<layer number="21" name="tPlace" color="7" fill="1" visible="yes" active="yes"/>
<layer number="22" name="bPlace" color="7" fill="1" visible="yes" active="yes"/>
<layer number="23" name="tOrigins" color="15" fill="1" visible="yes" active="yes"/>
<layer number="24" name="bOrigins" color="15" fill="1" visible="yes" active="yes"/>
<layer number="25" name="tNames" color="7" fill="1" visible="yes" active="yes"/>
<layer number="26" name="bNames" color="7" fill="1" visible="yes" active="yes"/>
<layer number="27" name="tValues" color="7" fill="1" visible="yes" active="yes"/>
<layer number="28" name="bValues" color="7" fill="1" visible="yes" active="yes"/>
<layer number="29" name="tStop" color="7" fill="3" visible="no" active="yes"/>
<layer number="30" name="bStop" color="7" fill="6" visible="no" active="yes"/>
<layer number="31" name="tCream" color="7" fill="4" visible="no" active="yes"/>
<layer number="32" name="bCream" color="7" fill="5" visible="no" active="yes"/>
<layer number="33" name="tFinish" color="6" fill="3" visible="no" active="yes"/>
<layer number="34" name="bFinish" color="6" fill="6" visible="no" active="yes"/>
<layer number="35" name="tGlue" color="7" fill="4" visible="no" active="yes"/>
<layer number="36" name="bGlue" color="7" fill="5" visible="no" active="yes"/>
<layer number="37" name="tTest" color="7" fill="1" visible="no" active="yes"/>
<layer number="38" name="bTest" color="7" fill="1" visible="no" active="yes"/>
<layer number="39" name="tKeepout" color="4" fill="11" visible="yes" active="yes"/>
<layer number="40" name="bKeepout" color="1" fill="11" visible="yes" active="yes"/>
<layer number="41" name="tRestrict" color="4" fill="10" visible="yes" active="yes"/>
<layer number="42" name="bRestrict" color="1" fill="10" visible="yes" active="yes"/>
<layer number="43" name="vRestrict" color="2" fill="10" visible="yes" active="yes"/>
<layer number="44" name="Drills" color="7" fill="1" visible="no" active="yes"/>
<layer number="45" name="Holes" color="7" fill="1" visible="no" active="yes"/>
<layer number="46" name="Milling" color="3" fill="1" visible="no" active="yes"/>
<layer number="47" name="Measures" color="7" fill="1" visible="no" active="yes"/>
<layer number="48" name="Document" color="7" fill="1" visible="yes" active="yes"/>
<layer number="49" name="Reference" color="7" fill="1" visible="yes" active="yes"/>
<layer number="51" name="tDocu" color="7" fill="1" visible="yes" active="yes"/>
<layer number="52" name="bDocu" color="7" fill="1" visible="yes" active="yes"/>
<layer number="91" name="Nets" color="2" fill="1" visible="yes" active="yes"/>
<layer number="92" name="Busses" color="1" fill="1" visible="yes" active="yes"/>
<layer number="93" name="Pins" color="2" fill="1" visible="yes" active="yes"/>
<layer number="94" name="Symbols" color="4" fill="1" visible="yes" active="yes"/>
<layer number="95" name="Names" color="7" fill="1" visible="yes" active="yes"/>
<layer number="96" name="Values" color="7" fill="1" visible="yes" active="yes"/>
<layer number="97" name="Info" color="7" fill="1" visible="yes" active="yes"/>
<layer number="98" name="Guide" color="6" fill="1" visible="yes" active="yes"/>
</layers>
<library>
<description>CTS Crystal Technologies</description>
<packages>
<package name="CTS403">
<smd name="4" x="-1.1" y="0.8" dx="1.4" dy="1.2" layer="1" rot="R180"/>
<smd name="3" x="1.1" y="0.8" dx="1.4" dy="1.2" layer="1" rot="R180"/>
<smd name="1" x="-1.1" y="-0.8" dx="1.4" dy="1.2" layer="1" rot="R180"/>
<smd name="2" x="1.1" y="-0.8" dx="1.4" dy="1.2" layer="1" rot="R180"/>
<wire x1="1.6" y1="1.3" x2="-1.6" y2="1.3" width="0.127" layer="51"/>
<wire x1="1.6" y1="-1.3" x2="-1.6" y2="-1.3" width="0.127" layer="51"/>
<wire x1="-1.6" y1="1.3" x2="-1.6" y2="-1.3" width="0.127" layer="51"/>
<wire x1="1.6" y1="1.3" x2="1.6" y2="-1.3" width="0.127" layer="51"/>
<text x="-2.54" y="-3.81" size="1.27" layer="27">&gt;value</text>
<text x="-2.54" y="2.54" size="1.27" layer="25">&gt;name</text>
<text x="-2.794" y="-2.159" size="1.27" layer="21">1</text>
</package>
</packages>
<symbols>
<symbol name="CRYSTAL">
<pin name="1" x="0" y="-5.08" visible="pad" length="short" rot="R90"/>
<pin name="3" x="0" y="5.08" visible="pad" length="short" rot="R270"/>
<wire x1="2.54" y1="-1.524" x2="0" y2="-1.524" width="0.254" layer="94"/>
<wire x1="0" y1="-1.524" x2="-2.54" y2="-1.524" width="0.254" layer="94"/>
<wire x1="2.54" y1="1.524" x2="0" y2="1.524" width="0.254" layer="94"/>
<wire x1="0" y1="1.524" x2="-2.54" y2="1.524" width="0.254" layer="94"/>
<wire x1="-3.81" y1="0.762" x2="3.81" y2="0.762" width="0.127" layer="94"/>
<wire x1="3.81" y1="0.762" x2="3.81" y2="-0.762" width="0.127" layer="94"/>
<wire x1="3.81" y1="-0.762" x2="-3.81" y2="-0.762" width="0.127" layer="94"/>
<wire x1="-3.81" y1="-0.762" x2="-3.81" y2="0.762" width="0.127" layer="94"/>
<wire x1="0" y1="2.54" x2="0" y2="1.524" width="0.1524" layer="94"/>
<wire x1="0" y1="-1.524" x2="0" y2="-2.54" width="0.1524" layer="94"/>
<pin name="2" x="-7.62" y="2.54" visible="pad" length="short"/>
<pin name="4" x="-7.62" y="-2.54" visible="pad" length="short"/>
<wire x1="-3.81" y1="3.048" x2="-5.08" y2="3.048" width="0.254" layer="94"/>
<wire x1="-5.08" y1="3.048" x2="-5.08" y2="-3.048" width="0.254" layer="94"/>
<wire x1="-5.08" y1="-3.048" x2="-3.81" y2="-3.048" width="0.254" layer="94"/>
<text x="5.08" y="-5.08" size="1.27" layer="96">&gt;value</text>
<text x="5.08" y="2.54" size="1.27" layer="95">&gt;name</text>
</symbol>
</symbols>
<devicesets>
<deviceset name="CTS403" prefix="X" uservalue="yes">
<description>Small footprint SMD crystal 25MHz</description>
<gates>
<gate name="G$1" symbol="CRYSTAL" x="0" y="0"/>
</gates>
<devices>
<device name="" package="CTS403">
<connects>
<connect gate="G$1" pin="1" pad="1"/>
<connect gate="G$1" pin="2" pad="2"/>
<connect gate="G$1" pin="3" pad="3"/>
<connect gate="G$1" pin="4" pad="4"/>
</connects>
<technologies>
<technology name="">
<attribute name="MPN" value="403I35D25M00000" constant="no"/>
</technology>
</technologies>
</device>
</devices>
</deviceset>
</devicesets>
</library>
</drawing>
</eagle>
