{
  "ASSETS": {
    "WUSD": {
      "name": "WUSD",
      "description": "WAVES USD",
      "decimals": 2,
      "quantity": 1000000000,
      "reissuable": true
    },
    "OPT1CALL": {
      "name": "OPT1CALL",
      "description": "test call option 1",
      "decimals": 0,
      "quantity": 1,
      "reissuable": false
    },
    "OPT2CALL": {
      "name": "OPT2CALL",
      "description": "test call option 2",
      "decimals": 0,
      "quantity": 1,
      "reissuable": false
    },
    "OPT3CALL": {
      "name": "OPT3CALL",
      "description": "test call option 3",
      "decimals": 0,
      "quantity": 1,
      "reissuable": false
    },
    "OPT4CALL": {
      "name": "OPT4CALL",
      "description": "test call option 4",
      "decimals": 0,
      "quantity": 1,
      "reissuable": false
    },
    "OPT5CALL": {
      "name": "OPT5CALL",
      "description": "test call option 5",
      "decimals": 0,
      "quantity": 1,
      "reissuable": false
    },
    "OPT6CALL": {
      "name": "OPT6CALL",
      "description": "test call option 6",
      "decimals": 0,
      "quantity": 1,
      "reissuable": false
    },
    "OPT7CALL": {
      "name": "OPT7CALL",
      "description": "test call option 7",
      "decimals": 0,
      "quantity": 1,
      "reissuable": false
    }
  },
  "ACCOUNTS": {
    "DAPP": {
      "alias": false,
      "balance": {}
    },
    "ALICE": {
      "balance": {
        "WUSD": 100000000,
        "OPT1CALL": 1,
        "OPT2CALL": 1,
        "OPT3CALL": 1,
        "OPT4CALL": 1,
        "OPT5CALL": 1,
        "OPT6CALL": 1,
        "OPT7CALL": 1
      }
    },
    "BOB": {
      "balance": {
        "WUSD": 100000000
      }
    }
  }
}
