/Users/fabianfdz/NetBeansProjects/Parcial2/src/main/java/com/fabianfdz/Models/Persona.java
/Users/fabianfdz/NetBeansProjects/Parcial2/src/main/java/com/fabianfdz/Models/Paciente.java
/Users/fabianfdz/NetBeansProjects/Parcial2/src/main/java/com/fabianfdz/UI/AgregarResultados.java
/Users/fabianfdz/NetBeansProjects/Parcial2/src/main/java/com/fabianfdz/Models/Enfermedad.java
/Users/fabianfdz/NetBeansProjects/Parcial2/src/main/java/com/fabianfdz/Models/Valoracion.java
/Users/fabianfdz/NetBeansProjects/Parcial2/src/main/java/com/fabianfdz/UI/AgregarPersona.java
/Users/fabianfdz/NetBeansProjects/Parcial2/src/main/java/com/fabianfdz/UI/ReportPacientesPorcentaje.java
/Users/fabianfdz/NetBeansProjects/Parcial2/src/main/java/com/fabianfdz/UI/ReportPacientesInfectados.java
/Users/fabianfdz/NetBeansProjects/Parcial2/src/main/java/com/fabianfdz/Models/Medico.java
/Users/fabianfdz/NetBeansProjects/Parcial2/src/main/java/com/fabianfdz/BusinessLogic/BusinessLogic.java
/Users/fabianfdz/NetBeansProjects/Parcial2/src/main/java/com/fabianfdz/UI/Validator.java
/Users/fabianfdz/NetBeansProjects/Parcial2/src/main/java/com/fabianfdz/Models/Expediente.java
/Users/fabianfdz/NetBeansProjects/Parcial2/src/main/java/com/fabianfdz/UI/MainWindow.java
