%!PS-Adobe-3.0 EPSF-3.0 
%%BoundingBox: 0 0 414 322
%%Pages: 0
%%Creator: LibreOfficeDev 7.5
%%Title: none
%%CreationDate: none
%%LanguageLevel: 2
%%EndComments
%%BeginProlog
%%BeginResource: procset SDRes-Prolog 1.0 0
/b4_inc_state save def
/dict_count countdictstack def
/op_count count 1 sub def
userdict begin
0 setgray 0 setlinecap 1 setlinewidth 0 setlinejoin 10 setmiterlimit[] 0 setdash newpath
/languagelevel where {pop languagelevel 1 ne {false setstrokeadjust false setoverprint} if} if
/bdef {bind def} bind def
/c {setrgbcolor} bdef
/l {neg lineto} bdef
/rl {neg rlineto} bdef
/lc {setlinecap} bdef
/lj {setlinejoin} bdef
/lw {setlinewidth} bdef
/ml {setmiterlimit} bdef
/ld {setdash} bdef
/m {neg moveto} bdef
/ct {6 2 roll neg 6 2 roll neg 6 2 roll neg curveto} bdef
/r {rotate} bdef
/t {neg translate} bdef
/s {scale} bdef
/sw {show} bdef
/gs {gsave} bdef
/gr {grestore} bdef
/f {findfont dup length dict begin
{1 index /FID ne {def} {pop pop} ifelse} forall /Encoding ISOLatin1Encoding def
currentdict end /NFont exch definefont pop /NFont findfont} bdef
/p {closepath} bdef
/sf {scalefont setfont} bdef
/ef {eofill}bdef
/pc {closepath stroke}bdef
/ps {stroke}bdef
/pum {matrix currentmatrix}bdef
/pom {setmatrix}bdef
/bs {/aString exch def /nXOfs exch def /nWidth exch def currentpoint nXOfs 0 rmoveto pum nWidth aString stringwidth pop div 1 scale aString show pom moveto} bdef
%%EndResource
%%EndProlog
%%BeginSetup
%%EndSetup
%%Page: 1 1
%%BeginPageSetup
%%EndPageSetup
pum
0.02832 0.02838 s 
0 -11344 t
/tm matrix currentmatrix def
tm setmatrix
-1711 -30823 t 
1 1 s 
gs
1.000 1.000 1.000 c 9005 42152 m  1698 42152 l  1698 30810 l  16311 30810 l 
16311 42152 l  9005 42152 l  p ef
gr
gs
0 lw 1 lj 0.703 0.703 0.703 c 9557 40868 m  3829 40868 l  3829 31472 l 
15285 31472 l  15285 40868 l  9557 40868 l  pc
gr
gs
0 lw 1 lj 0.703 0.703 0.703 c 15285 40867 m  3829 40867 l  ps
gr
gs
0 lw 1 lj 0.703 0.703 0.703 c 15285 39927 m  3829 39927 l  ps
gr
gs
0 lw 1 lj 0.703 0.703 0.703 c 15285 38988 m  3829 38988 l  ps
gr
gs
0 lw 1 lj 0.703 0.703 0.703 c 15285 38048 m  3829 38048 l  ps
gr
gs
0 lw 1 lj 0.703 0.703 0.703 c 15285 37108 m  3829 37108 l  ps
gr
gs
0 lw 1 lj 0.703 0.703 0.703 c 15285 36169 m  3829 36169 l  ps
gr
gs
0 lw 1 lj 0.703 0.703 0.703 c 15285 35229 m  3829 35229 l  ps
gr
gs
0 lw 1 lj 0.703 0.703 0.703 c 15285 34289 m  3829 34289 l  ps
gr
gs
0 lw 1 lj 0.703 0.703 0.703 c 15285 33350 m  3829 33350 l  ps
gr
gs
0 lw 1 lj 0.703 0.703 0.703 c 15285 32410 m  3829 32410 l  ps
gr
gs
0 lw 1 lj 0.703 0.703 0.703 c 15285 31471 m  3829 31471 l  ps
gr
gs
0 lw 1 lj 0.703 0.703 0.703 c 3829 41017 m  3829 40867 l  ps
gr
gs
0 lw 1 lj 0.703 0.703 0.703 c 3829 41017 m  3829 40867 l  ps
gr
gs
0 lw 1 lj 0.703 0.703 0.703 c 4592 41017 m  4592 40867 l  ps
gr
gs
0 lw 1 lj 0.703 0.703 0.703 c 4592 41017 m  4592 40867 l  ps
gr
gs
0 lw 1 lj 0.703 0.703 0.703 c 5356 41017 m  5356 40867 l  ps
gr
gs
0 lw 1 lj 0.703 0.703 0.703 c 5356 41017 m  5356 40867 l  ps
gr
gs
0 lw 1 lj 0.703 0.703 0.703 c 6120 41017 m  6120 40867 l  ps
gr
gs
0 lw 1 lj 0.703 0.703 0.703 c 6120 41017 m  6120 40867 l  ps
gr
gs
0 lw 1 lj 0.703 0.703 0.703 c 6884 41017 m  6884 40867 l  ps
gr
gs
0 lw 1 lj 0.703 0.703 0.703 c 6884 41017 m  6884 40867 l  ps
gr
gs
0 lw 1 lj 0.703 0.703 0.703 c 7648 41017 m  7648 40867 l  ps
gr
gs
0 lw 1 lj 0.703 0.703 0.703 c 7648 41017 m  7648 40867 l  ps
gr
gs
0 lw 1 lj 0.703 0.703 0.703 c 8411 41017 m  8411 40867 l  ps
gr
gs
0 lw 1 lj 0.703 0.703 0.703 c 8411 41017 m  8411 40867 l  ps
gr
gs
0 lw 1 lj 0.703 0.703 0.703 c 9174 41017 m  9174 40867 l  ps
gr
gs
0 lw 1 lj 0.703 0.703 0.703 c 9174 41017 m  9174 40867 l  ps
gr
gs
0 lw 1 lj 0.703 0.703 0.703 c 9938 41017 m  9938 40867 l  ps
gr
gs
0 lw 1 lj 0.703 0.703 0.703 c 9938 41017 m  9938 40867 l  ps
gr
gs
0 lw 1 lj 0.703 0.703 0.703 c 10702 41017 m  10702 40867 l  ps
gr
gs
0 lw 1 lj 0.703 0.703 0.703 c 10702 41017 m  10702 40867 l  ps
gr
gs
0 lw 1 lj 0.703 0.703 0.703 c 11466 41017 m  11466 40867 l  ps
gr
gs
0 lw 1 lj 0.703 0.703 0.703 c 11466 41017 m  11466 40867 l  ps
gr
gs
0 lw 1 lj 0.703 0.703 0.703 c 12229 41017 m  12229 40867 l  ps
gr
gs
0 lw 1 lj 0.703 0.703 0.703 c 12229 41017 m  12229 40867 l  ps
gr
gs
0 lw 1 lj 0.703 0.703 0.703 c 12993 41017 m  12993 40867 l  ps
gr
gs
0 lw 1 lj 0.703 0.703 0.703 c 12993 41017 m  12993 40867 l  ps
gr
gs
0 lw 1 lj 0.703 0.703 0.703 c 13757 41017 m  13757 40867 l  ps
gr
gs
0 lw 1 lj 0.703 0.703 0.703 c 13757 41017 m  13757 40867 l  ps
gr
gs
0 lw 1 lj 0.703 0.703 0.703 c 14521 41017 m  14521 40867 l  ps
gr
gs
0 lw 1 lj 0.703 0.703 0.703 c 14521 41017 m  14521 40867 l  ps
gr
gs
0 lw 1 lj 0.703 0.703 0.703 c 15285 41017 m  15285 40867 l  ps
gr
gs
0 lw 1 lj 0.703 0.703 0.703 c 15285 41017 m  15285 40867 l  ps
gr
gs
0 lw 1 lj 0.703 0.703 0.703 c 3829 40867 m  15285 40867 l  ps
gr
gs
0 lw 1 lj 0.703 0.703 0.703 c 3679 40867 m  3829 40867 l  ps
gr
gs
0 lw 1 lj 0.703 0.703 0.703 c 3679 40867 m  3829 40867 l  ps
gr
gs
0 lw 1 lj 0.703 0.703 0.703 c 3679 39927 m  3829 39927 l  ps
gr
gs
0 lw 1 lj 0.703 0.703 0.703 c 3679 39927 m  3829 39927 l  ps
gr
gs
0 lw 1 lj 0.703 0.703 0.703 c 3679 38988 m  3829 38988 l  ps
gr
gs
0 lw 1 lj 0.703 0.703 0.703 c 3679 38988 m  3829 38988 l  ps
gr
gs
0 lw 1 lj 0.703 0.703 0.703 c 3679 38048 m  3829 38048 l  ps
gr
gs
0 lw 1 lj 0.703 0.703 0.703 c 3679 38048 m  3829 38048 l  ps
gr
gs
0 lw 1 lj 0.703 0.703 0.703 c 3679 37108 m  3829 37108 l  ps
gr
gs
0 lw 1 lj 0.703 0.703 0.703 c 3679 37108 m  3829 37108 l  ps
gr
gs
0 lw 1 lj 0.703 0.703 0.703 c 3679 36169 m  3829 36169 l  ps
gr
gs
0 lw 1 lj 0.703 0.703 0.703 c 3679 36169 m  3829 36169 l  ps
gr
gs
0 lw 1 lj 0.703 0.703 0.703 c 3679 35229 m  3829 35229 l  ps
gr
gs
0 lw 1 lj 0.703 0.703 0.703 c 3679 35229 m  3829 35229 l  ps
gr
gs
0 lw 1 lj 0.703 0.703 0.703 c 3679 34289 m  3829 34289 l  ps
gr
gs
0 lw 1 lj 0.703 0.703 0.703 c 3679 34289 m  3829 34289 l  ps
gr
gs
0 lw 1 lj 0.703 0.703 0.703 c 3679 33350 m  3829 33350 l  ps
gr
gs
0 lw 1 lj 0.703 0.703 0.703 c 3679 33350 m  3829 33350 l  ps
gr
gs
0 lw 1 lj 0.703 0.703 0.703 c 3679 32410 m  3829 32410 l  ps
gr
gs
0 lw 1 lj 0.703 0.703 0.703 c 3679 32410 m  3829 32410 l  ps
gr
gs
0 lw 1 lj 0.703 0.703 0.703 c 3679 31471 m  3829 31471 l  ps
gr
gs
0 lw 1 lj 0.703 0.703 0.703 c 3679 31471 m  3829 31471 l  ps
gr
gs
0 lw 1 lj 0.703 0.703 0.703 c 3829 40867 m  3829 31471 l  ps
gr
gs
79.99452 lw 1 lj 0.496 0.003 0.132 c 3829 38332 m  4592 38319 l  5356 37615 l 
6120 37576 l  6884 37130 l  7647 37286 l  8411 36640 l  9174 36175 l  9938 35695 l 
10702 35554 l  11466 34962 l  12229 35114 l  12993 33903 l  13757 33395 l 
14521 33151 l  15285 32649 l  ps
gr
gs
0.496 0.003 0.132 c 3704 38332 m  3829 38457 l  3954 38332 l  3829 38207 l 
3704 38332 l  p ef
gr
gs
0 lw 1 lj 0.496 0.003 0.132 c 3704 38332 m  3829 38457 l  3954 38332 l  3829 38207 l 
3704 38332 l  pc
gr
gs
0.496 0.003 0.132 c 4467 38319 m  4592 38444 l  4717 38319 l  4592 38194 l 
4467 38319 l  p ef
gr
gs
0 lw 1 lj 0.496 0.003 0.132 c 4467 38319 m  4592 38444 l  4717 38319 l  4592 38194 l 
4467 38319 l  pc
gr
gs
0.496 0.003 0.132 c 5231 37615 m  5356 37740 l  5481 37615 l  5356 37490 l 
5231 37615 l  p ef
gr
gs
0 lw 1 lj 0.496 0.003 0.132 c 5231 37615 m  5356 37740 l  5481 37615 l  5356 37490 l 
5231 37615 l  pc
gr
gs
0.496 0.003 0.132 c 5995 37576 m  6120 37701 l  6245 37576 l  6120 37451 l 
5995 37576 l  p ef
gr
gs
0 lw 1 lj 0.496 0.003 0.132 c 5995 37576 m  6120 37701 l  6245 37576 l  6120 37451 l 
5995 37576 l  pc
gr
gs
0.496 0.003 0.132 c 6759 37130 m  6884 37255 l  7009 37130 l  6884 37005 l 
6759 37130 l  p ef
gr
gs
0 lw 1 lj 0.496 0.003 0.132 c 6759 37130 m  6884 37255 l  7009 37130 l  6884 37005 l 
6759 37130 l  pc
gr
gs
0.496 0.003 0.132 c 7522 37286 m  7647 37411 l  7772 37286 l  7647 37161 l 
7522 37286 l  p ef
gr
gs
0 lw 1 lj 0.496 0.003 0.132 c 7522 37286 m  7647 37411 l  7772 37286 l  7647 37161 l 
7522 37286 l  pc
gr
gs
0.496 0.003 0.132 c 8286 36640 m  8411 36765 l  8536 36640 l  8411 36515 l 
8286 36640 l  p ef
gr
gs
0 lw 1 lj 0.496 0.003 0.132 c 8286 36640 m  8411 36765 l  8536 36640 l  8411 36515 l 
8286 36640 l  pc
gr
gs
0.496 0.003 0.132 c 9049 36175 m  9174 36300 l  9299 36175 l  9174 36050 l 
9049 36175 l  p ef
gr
gs
0 lw 1 lj 0.496 0.003 0.132 c 9049 36175 m  9174 36300 l  9299 36175 l  9174 36050 l 
9049 36175 l  pc
gr
gs
0.496 0.003 0.132 c 9813 35695 m  9938 35820 l  10063 35695 l  9938 35570 l 
9813 35695 l  p ef
gr
gs
0 lw 1 lj 0.496 0.003 0.132 c 9813 35695 m  9938 35820 l  10063 35695 l 
9938 35570 l  9813 35695 l  pc
gr
gs
0.496 0.003 0.132 c 10577 35554 m  10702 35679 l  10827 35554 l  10702 35429 l 
10577 35554 l  p ef
gr
gs
0 lw 1 lj 0.496 0.003 0.132 c 10577 35554 m  10702 35679 l  10827 35554 l 
10702 35429 l  10577 35554 l  pc
gr
gs
0.496 0.003 0.132 c 11341 34962 m  11466 35087 l  11591 34962 l  11466 34837 l 
11341 34962 l  p ef
gr
gs
0 lw 1 lj 0.496 0.003 0.132 c 11341 34962 m  11466 35087 l  11591 34962 l 
11466 34837 l  11341 34962 l  pc
gr
gs
0.496 0.003 0.132 c 12104 35114 m  12229 35239 l  12354 35114 l  12229 34989 l 
12104 35114 l  p ef
gr
gs
0 lw 1 lj 0.496 0.003 0.132 c 12104 35114 m  12229 35239 l  12354 35114 l 
12229 34989 l  12104 35114 l  pc
gr
gs
0.496 0.003 0.132 c 12868 33903 m  12993 34028 l  13118 33903 l  12993 33778 l 
12868 33903 l  p ef
gr
gs
0 lw 1 lj 0.496 0.003 0.132 c 12868 33903 m  12993 34028 l  13118 33903 l 
12993 33778 l  12868 33903 l  pc
gr
gs
0.496 0.003 0.132 c 13632 33395 m  13757 33520 l  13882 33395 l  13757 33270 l 
13632 33395 l  p ef
gr
gs
0 lw 1 lj 0.496 0.003 0.132 c 13632 33395 m  13757 33520 l  13882 33395 l 
13757 33270 l  13632 33395 l  pc
gr
gs
0.496 0.003 0.132 c 14396 33151 m  14521 33276 l  14646 33151 l  14521 33026 l 
14396 33151 l  p ef
gr
gs
0 lw 1 lj 0.496 0.003 0.132 c 14396 33151 m  14521 33276 l  14646 33151 l 
14521 33026 l  14396 33151 l  pc
gr
gs
0.496 0.003 0.132 c 15160 32649 m  15285 32774 l  15410 32649 l  15285 32524 l 
15160 32649 l  p ef
gr
gs
0 lw 1 lj 0.496 0.003 0.132 c 15160 32649 m  15285 32774 l  15410 32649 l 
15285 32524 l  15160 32649 l  pc
gr
gs
79.99452 lw 1 lj 0.003 0.273 0.527 c 3829 39674 m  4592 39705 l  5356 39053 l 
6120 39067 l  6884 38704 l  7647 38912 l  8411 38363 l  9174 37929 l  9938 37549 l 
10702 37471 l  11466 36987 l  12229 37204 l  12993 36102 l  13757 35667 l 
14521 35541 l  15285 35128 l  ps
gr
gs
0.003 0.273 0.527 c 3704 39549 m  3704 39799 l  3954 39549 l  3954 39799 l 
3704 39549 l  p ef
gr
gs
0 lw 1 lj 0.003 0.273 0.527 c 3704 39549 m  3704 39799 l  3954 39549 l  3954 39799 l 
3704 39549 l  pc
gr
gs
0.003 0.273 0.527 c 4467 39580 m  4467 39830 l  4717 39580 l  4717 39830 l 
4467 39580 l  p ef
gr
gs
0 lw 1 lj 0.003 0.273 0.527 c 4467 39580 m  4467 39830 l  4717 39580 l  4717 39830 l 
4467 39580 l  pc
gr
gs
0.003 0.273 0.527 c 5231 38928 m  5231 39178 l  5481 38928 l  5481 39178 l 
5231 38928 l  p ef
gr
gs
0 lw 1 lj 0.003 0.273 0.527 c 5231 38928 m  5231 39178 l  5481 38928 l  5481 39178 l 
5231 38928 l  pc
gr
gs
0.003 0.273 0.527 c 5995 38942 m  5995 39192 l  6245 38942 l  6245 39192 l 
5995 38942 l  p ef
gr
gs
0 lw 1 lj 0.003 0.273 0.527 c 5995 38942 m  5995 39192 l  6245 38942 l  6245 39192 l 
5995 38942 l  pc
gr
gs
0.003 0.273 0.527 c 6759 38579 m  6759 38829 l  7009 38579 l  7009 38829 l 
6759 38579 l  p ef
gr
gs
0 lw 1 lj 0.003 0.273 0.527 c 6759 38579 m  6759 38829 l  7009 38579 l  7009 38829 l 
6759 38579 l  pc
gr
gs
0.003 0.273 0.527 c 7522 38787 m  7522 39037 l  7772 38787 l  7772 39037 l 
7522 38787 l  p ef
gr
gs
0 lw 1 lj 0.003 0.273 0.527 c 7522 38787 m  7522 39037 l  7772 38787 l  7772 39037 l 
7522 38787 l  pc
gr
gs
0.003 0.273 0.527 c 8286 38238 m  8286 38488 l  8536 38238 l  8536 38488 l 
8286 38238 l  p ef
gr
gs
0 lw 1 lj 0.003 0.273 0.527 c 8286 38238 m  8286 38488 l  8536 38238 l  8536 38488 l 
8286 38238 l  pc
gr
gs
0.003 0.273 0.527 c 9049 37804 m  9049 38054 l  9299 37804 l  9299 38054 l 
9049 37804 l  p ef
gr
gs
0 lw 1 lj 0.003 0.273 0.527 c 9049 37804 m  9049 38054 l  9299 37804 l  9299 38054 l 
9049 37804 l  pc
gr
gs
0.003 0.273 0.527 c 9813 37424 m  9813 37674 l  10063 37424 l  10063 37674 l 
9813 37424 l  p ef
gr
gs
0 lw 1 lj 0.003 0.273 0.527 c 9813 37424 m  9813 37674 l  10063 37424 l 
10063 37674 l  9813 37424 l  pc
gr
gs
0.003 0.273 0.527 c 10577 37346 m  10577 37596 l  10827 37346 l  10827 37596 l 
10577 37346 l  p ef
gr
gs
0 lw 1 lj 0.003 0.273 0.527 c 10577 37346 m  10577 37596 l  10827 37346 l 
10827 37596 l  10577 37346 l  pc
gr
gs
0.003 0.273 0.527 c 11341 36862 m  11341 37112 l  11591 36862 l  11591 37112 l 
11341 36862 l  p ef
gr
gs
0 lw 1 lj 0.003 0.273 0.527 c 11341 36862 m  11341 37112 l  11591 36862 l 
11591 37112 l  11341 36862 l  pc
gr
gs
0.003 0.273 0.527 c 12104 37079 m  12104 37329 l  12354 37079 l  12354 37329 l 
12104 37079 l  p ef
gr
gs
0 lw 1 lj 0.003 0.273 0.527 c 12104 37079 m  12104 37329 l  12354 37079 l 
12354 37329 l  12104 37079 l  pc
gr
gs
0.003 0.273 0.527 c 12868 35977 m  12868 36227 l  13118 35977 l  13118 36227 l 
12868 35977 l  p ef
gr
gs
0 lw 1 lj 0.003 0.273 0.527 c 12868 35977 m  12868 36227 l  13118 35977 l 
13118 36227 l  12868 35977 l  pc
gr
gs
0.003 0.273 0.527 c 13632 35542 m  13632 35792 l  13882 35542 l  13882 35792 l 
13632 35542 l  p ef
gr
gs
0 lw 1 lj 0.003 0.273 0.527 c 13632 35542 m  13632 35792 l  13882 35542 l 
13882 35792 l  13632 35542 l  pc
gr
gs
0.003 0.273 0.527 c 14396 35416 m  14396 35666 l  14646 35416 l  14646 35666 l 
14396 35416 l  p ef
gr
gs
0 lw 1 lj 0.003 0.273 0.527 c 14396 35416 m  14396 35666 l  14646 35416 l 
14646 35666 l  14396 35416 l  pc
gr
gs
0.003 0.273 0.527 c 15160 35003 m  15160 35253 l  15410 35003 l  15410 35253 l 
15160 35003 l  p ef
gr
gs
0 lw 1 lj 0.003 0.273 0.527 c 15160 35003 m  15160 35253 l  15410 35003 l 
15410 35253 l  15160 35003 l  pc
gr
gs
tm setmatrix
-12.99911 -12.9977 t 
0.99993 0.99982 s 
pum
1946 10627 t
0.003 0.003 0.003 c 27 0 m  27 -26 l  89 -26 l  89 -213 l  34 -174 l  34 -204 l 
91 -243 l  120 -243 l  120 -26 l  179 -26 l  179 0 l  27 0 l  p ef
364 -218 m  339 -180 321 -151 311 -129 ct 301 -108 293 -86 288 -65 ct 283 -45 280 -23 280 -1 ct 
248 -1 l  248 -32 254 -64 268 -98 ct 281 -133 303 -172 334 -217 ct 203 -217 l 
203 -243 l  364 -243 l  364 -218 l  p ef
pom
gr
gs
tm setmatrix
-12.99911 -12.9977 t 
0.99993 0.99982 s 
pum
2709 10627 t
0.003 0.003 0.003 c 27 0 m  27 -26 l  89 -26 l  89 -213 l  34 -174 l  34 -204 l 
91 -243 l  120 -243 l  120 -26 l  179 -26 l  179 0 l  27 0 l  p ef
366 -68 m  366 -46 359 -28 345 -16 ct 330 -3 310 3 283 3 ct 257 3 237 -3 222 -15 ct 
208 -28 200 -45 200 -68 ct 200 -84 205 -97 214 -108 ct 223 -119 235 -125 249 -128 ct 
249 -128 l  236 -131 225 -138 217 -148 ct 210 -159 206 -171 206 -185 ct 206 -203 213 -218 227 -230 ct 
241 -241 259 -247 283 -247 ct 306 -247 325 -241 339 -230 ct 353 -219 360 -204 360 -184 ct 
360 -171 356 -158 348 -148 ct 341 -138 330 -131 317 -129 ct 317 -128 l  332 -125 344 -119 353 -108 ct 
362 -98 366 -84 366 -68 ct p
328 -183 m  328 -210 313 -224 283 -224 ct 268 -224 257 -220 249 -214 ct 242 -207 238 -196 238 -183 ct 
238 -169 242 -158 250 -151 ct 257 -144 269 -140 283 -140 ct 298 -140 309 -143 316 -150 ct 
324 -157 328 -168 328 -183 ct p
334 -71 m  334 -86 329 -98 320 -105 ct 311 -113 299 -117 283 -117 ct 267 -117 255 -113 246 -104 ct 
237 -96 232 -85 232 -70 ct 232 -37 249 -20 284 -20 ct 300 -20 313 -24 321 -32 ct 
330 -41 334 -53 334 -71 ct p ef
pom
gr
gs
tm setmatrix
-12.99911 -12.9977 t 
0.99993 0.99982 s 
pum
3473 10627 t
0.003 0.003 0.003 c 27 0 m  27 -26 l  89 -26 l  89 -213 l  34 -174 l  34 -204 l 
91 -243 l  120 -243 l  120 -26 l  179 -26 l  179 0 l  27 0 l  p ef
365 -127 m  365 -85 357 -53 342 -31 ct 327 -8 305 3 277 3 ct 258 3 243 -1 231 -9 ct 
220 -17 211 -30 207 -48 ct 236 -52 l  242 -32 256 -22 277 -22 ct 295 -22 309 -30 319 -47 ct 
328 -63 333 -87 334 -118 ct 329 -107 321 -99 310 -93 ct 299 -87 287 -84 274 -84 ct 
252 -84 234 -91 221 -106 ct 208 -121 202 -141 202 -165 ct 202 -191 209 -211 223 -225 ct 
237 -240 257 -247 282 -247 ct 309 -247 330 -237 344 -217 ct 358 -197 365 -167 365 -127 ct 
p
331 -157 m  331 -176 326 -192 317 -204 ct 308 -216 296 -222 281 -222 ct 266 -222 255 -217 246 -207 ct 
237 -196 233 -183 233 -165 ct 233 -148 237 -134 246 -123 ct 255 -113 266 -108 281 -108 ct 
290 -108 298 -110 306 -114 ct 314 -118 320 -124 324 -131 ct 329 -139 331 -147 331 -157 ct 
p ef
pom
gr
gs
tm setmatrix
-12.99911 -12.9977 t 
0.99993 0.99982 s 
pum
4237 10627 t
0.003 0.003 0.003 c 18 0 m  18 -22 l  24 -35 31 -47 39 -58 ct 48 -68 57 -77 66 -85 ct 
75 -94 84 -101 94 -109 ct 103 -116 111 -123 118 -130 ct 126 -137 132 -145 136 -152 ct 
141 -160 143 -169 143 -179 ct 143 -192 139 -203 131 -210 ct 123 -217 113 -221 99 -221 ct 
85 -221 74 -217 66 -210 ct 57 -203 52 -193 51 -180 ct 19 -183 l  21 -202 30 -218 44 -229 ct 
58 -241 76 -247 99 -247 ct 123 -247 142 -241 155 -229 ct 168 -218 175 -201 175 -180 ct 
175 -171 173 -161 168 -152 ct 164 -143 158 -133 149 -124 ct 141 -115 124 -100 100 -81 ct 
87 -70 77 -60 69 -51 ct 61 -43 55 -34 52 -26 ct 179 -26 l  179 0 l  18 0 l  p ef
368 -122 m  368 -81 360 -50 346 -29 ct 332 -8 311 3 283 3 ct 255 3 234 -8 220 -29 ct 
206 -50 199 -81 199 -122 ct 199 -164 206 -195 219 -216 ct 233 -237 254 -247 284 -247 ct 
312 -247 334 -236 347 -215 ct 361 -194 368 -163 368 -122 ct p
336 -122 m  336 -157 332 -182 324 -198 ct 316 -214 302 -222 284 -222 ct 265 -222 251 -214 243 -199 ct 
234 -183 230 -158 230 -122 ct 230 -88 234 -62 243 -46 ct 251 -30 265 -22 283 -22 ct 
301 -22 315 -31 323 -47 ct 332 -63 336 -88 336 -122 ct p ef
pom
gr
gs
tm setmatrix
-12.99911 -12.9977 t 
0.99993 0.99982 s 
pum
5001 10627 t
0.003 0.003 0.003 c 18 0 m  18 -22 l  24 -35 31 -47 39 -58 ct 48 -68 57 -77 66 -85 ct 
75 -94 84 -101 94 -109 ct 103 -116 111 -123 118 -130 ct 126 -137 132 -145 136 -152 ct 
141 -160 143 -169 143 -179 ct 143 -192 139 -203 131 -210 ct 123 -217 113 -221 99 -221 ct 
85 -221 74 -217 66 -210 ct 57 -203 52 -193 51 -180 ct 19 -183 l  21 -202 30 -218 44 -229 ct 
58 -241 76 -247 99 -247 ct 123 -247 142 -241 155 -229 ct 168 -218 175 -201 175 -180 ct 
175 -171 173 -161 168 -152 ct 164 -143 158 -133 149 -124 ct 141 -115 124 -100 100 -81 ct 
87 -70 77 -60 69 -51 ct 61 -43 55 -34 52 -26 ct 179 -26 l  179 0 l  18 0 l  p ef
212 0 m  212 -26 l  274 -26 l  274 -213 l  219 -174 l  219 -204 l  276 -243 l 
305 -243 l  305 -26 l  364 -26 l  364 0 l  212 0 l  p ef
pom
gr
gs
tm setmatrix
-12.99911 -12.9977 t 
0.99993 0.99982 s 
pum
5765 10627 t
0.003 0.003 0.003 c 18 0 m  18 -22 l  24 -35 31 -47 39 -58 ct 48 -68 57 -77 66 -85 ct 
75 -94 84 -101 94 -109 ct 103 -116 111 -123 118 -130 ct 126 -137 132 -145 136 -152 ct 
141 -160 143 -169 143 -179 ct 143 -192 139 -203 131 -210 ct 123 -217 113 -221 99 -221 ct 
85 -221 74 -217 66 -210 ct 57 -203 52 -193 51 -180 ct 19 -183 l  21 -202 30 -218 44 -229 ct 
58 -241 76 -247 99 -247 ct 123 -247 142 -241 155 -229 ct 168 -218 175 -201 175 -180 ct 
175 -171 173 -161 168 -152 ct 164 -143 158 -133 149 -124 ct 141 -115 124 -100 100 -81 ct 
87 -70 77 -60 69 -51 ct 61 -43 55 -34 52 -26 ct 179 -26 l  179 0 l  18 0 l  p ef
203 0 m  203 -22 l  209 -35 216 -47 224 -58 ct 233 -68 242 -77 251 -85 ct 260 -94 269 -101 279 -109 ct 
288 -116 296 -123 303 -130 ct 311 -137 317 -145 321 -152 ct 326 -160 328 -169 328 -179 ct 
328 -192 324 -203 316 -210 ct 308 -217 298 -221 284 -221 ct 270 -221 259 -217 251 -210 ct 
242 -203 237 -193 236 -180 ct 204 -183 l  206 -202 215 -218 229 -229 ct 243 -241 261 -247 284 -247 ct 
308 -247 327 -241 340 -229 ct 353 -218 360 -201 360 -180 ct 360 -171 358 -161 353 -152 ct 
349 -143 343 -133 334 -124 ct 326 -115 309 -100 285 -81 ct 272 -70 262 -60 254 -51 ct 
246 -43 240 -34 237 -26 ct 364 -26 l  364 0 l  203 0 l  p ef
pom
gr
gs
tm setmatrix
-12.99911 -12.9977 t 
0.99993 0.99982 s 
pum
6528 10627 t
0.003 0.003 0.003 c 18 0 m  18 -22 l  24 -35 31 -47 39 -58 ct 48 -68 57 -77 66 -85 ct 
75 -94 84 -101 94 -109 ct 103 -116 111 -123 118 -130 ct 126 -137 132 -145 136 -152 ct 
141 -160 143 -169 143 -179 ct 143 -192 139 -203 131 -210 ct 123 -217 113 -221 99 -221 ct 
85 -221 74 -217 66 -210 ct 57 -203 52 -193 51 -180 ct 19 -183 l  21 -202 30 -218 44 -229 ct 
58 -241 76 -247 99 -247 ct 123 -247 142 -241 155 -229 ct 168 -218 175 -201 175 -180 ct 
175 -171 173 -161 168 -152 ct 164 -143 158 -133 149 -124 ct 141 -115 124 -100 100 -81 ct 
87 -70 77 -60 69 -51 ct 61 -43 55 -34 52 -26 ct 179 -26 l  179 0 l  18 0 l  p ef
366 -68 m  366 -45 359 -28 344 -16 ct 330 -3 310 3 283 3 ct 259 3 239 -3 225 -14 ct 
210 -25 201 -41 198 -63 ct 231 -66 l  235 -37 252 -23 283 -23 ct 299 -23 311 -27 320 -34 ct 
329 -42 334 -54 334 -69 ct 334 -82 328 -92 318 -100 ct 308 -107 293 -111 274 -111 ct 
257 -111 l  257 -138 l  274 -138 l  291 -138 304 -142 313 -149 ct 323 -156 327 -167 327 -180 ct 
327 -193 323 -203 316 -210 ct 308 -218 297 -221 282 -221 ct 268 -221 257 -218 249 -211 ct 
240 -204 235 -194 234 -182 ct 203 -184 l  205 -204 213 -219 227 -230 ct 242 -241 260 -247 282 -247 ct 
306 -247 325 -241 339 -230 ct 352 -219 359 -203 359 -183 ct 359 -167 355 -155 346 -145 ct 
337 -135 325 -129 308 -125 ct 308 -125 l  326 -123 341 -117 351 -106 ct 361 -96 366 -83 366 -68 ct 
p ef
pom
gr
gs
tm setmatrix
-12.99911 -12.9977 t 
0.99993 0.99982 s 
pum
7292 10627 t
0.003 0.003 0.003 c 18 0 m  18 -22 l  24 -35 31 -47 39 -58 ct 48 -68 57 -77 66 -85 ct 
75 -94 84 -101 94 -109 ct 103 -116 111 -123 118 -130 ct 126 -137 132 -145 136 -152 ct 
141 -160 143 -169 143 -179 ct 143 -192 139 -203 131 -210 ct 123 -217 113 -221 99 -221 ct 
85 -221 74 -217 66 -210 ct 57 -203 52 -193 51 -180 ct 19 -183 l  21 -202 30 -218 44 -229 ct 
58 -241 76 -247 99 -247 ct 123 -247 142 -241 155 -229 ct 168 -218 175 -201 175 -180 ct 
175 -171 173 -161 168 -152 ct 164 -143 158 -133 149 -124 ct 141 -115 124 -100 100 -81 ct 
87 -70 77 -60 69 -51 ct 61 -43 55 -34 52 -26 ct 179 -26 l  179 0 l  18 0 l  p ef
337 -55 m  337 0 l  308 0 l  308 -55 l  193 -55 l  193 -79 l  304 -243 l 
337 -243 l  337 -79 l  371 -79 l  371 -55 l  337 -55 l  p
308 -208 m  307 -207 306 -204 303 -199 ct 300 -193 298 -190 296 -187 ct 234 -96 l 
224 -83 l  222 -79 l  308 -79 l  308 -208 l  p ef
pom
gr
gs
tm setmatrix
-12.99911 -12.9977 t 
0.99993 0.99982 s 
pum
8056 10627 t
0.003 0.003 0.003 c 18 0 m  18 -22 l  24 -35 31 -47 39 -58 ct 48 -68 57 -77 66 -85 ct 
75 -94 84 -101 94 -109 ct 103 -116 111 -123 118 -130 ct 126 -137 132 -145 136 -152 ct 
141 -160 143 -169 143 -179 ct 143 -192 139 -203 131 -210 ct 123 -217 113 -221 99 -221 ct 
85 -221 74 -217 66 -210 ct 57 -203 52 -193 51 -180 ct 19 -183 l  21 -202 30 -218 44 -229 ct 
58 -241 76 -247 99 -247 ct 123 -247 142 -241 155 -229 ct 168 -218 175 -201 175 -180 ct 
175 -171 173 -161 168 -152 ct 164 -143 158 -133 149 -124 ct 141 -115 124 -100 100 -81 ct 
87 -70 77 -60 69 -51 ct 61 -43 55 -34 52 -26 ct 179 -26 l  179 0 l  18 0 l  p ef
367 -80 m  367 -54 359 -34 344 -19 ct 328 -4 307 3 280 3 ct 258 3 239 -2 226 -12 ct 
212 -22 203 -36 199 -55 ct 231 -58 l  237 -34 254 -22 281 -22 ct 298 -22 311 -27 320 -37 ct 
330 -47 334 -61 334 -79 ct 334 -94 330 -106 320 -116 ct 311 -125 298 -130 282 -130 ct 
273 -130 265 -129 258 -126 ct 251 -123 244 -119 237 -113 ct 206 -113 l  214 -243 l 
352 -243 l  352 -217 l  243 -217 l  238 -140 l  251 -150 268 -155 288 -155 ct 
312 -155 331 -148 345 -134 ct 359 -120 367 -102 367 -80 ct p ef
pom
gr
gs
tm setmatrix
-12.99911 -12.9977 t 
0.99993 0.99982 s 
pum
8820 10627 t
0.003 0.003 0.003 c 18 0 m  18 -22 l  24 -35 31 -47 39 -58 ct 48 -68 57 -77 66 -85 ct 
75 -94 84 -101 94 -109 ct 103 -116 111 -123 118 -130 ct 126 -137 132 -145 136 -152 ct 
141 -160 143 -169 143 -179 ct 143 -192 139 -203 131 -210 ct 123 -217 113 -221 99 -221 ct 
85 -221 74 -217 66 -210 ct 57 -203 52 -193 51 -180 ct 19 -183 l  21 -202 30 -218 44 -229 ct 
58 -241 76 -247 99 -247 ct 123 -247 142 -241 155 -229 ct 168 -218 175 -201 175 -180 ct 
175 -171 173 -161 168 -152 ct 164 -143 158 -133 149 -124 ct 141 -115 124 -100 100 -81 ct 
87 -70 77 -60 69 -51 ct 61 -43 55 -34 52 -26 ct 179 -26 l  179 0 l  18 0 l  p ef
366 -80 m  366 -54 359 -34 345 -19 ct 331 -4 312 3 287 3 ct 260 3 239 -7 225 -28 ct 
210 -48 203 -77 203 -116 ct 203 -158 210 -191 226 -213 ct 241 -236 262 -247 290 -247 ct 
326 -247 350 -231 359 -198 ct 329 -192 l  323 -212 310 -222 289 -222 ct 272 -222 258 -214 248 -197 ct 
239 -181 234 -157 234 -126 ct 239 -136 247 -144 258 -150 ct 268 -155 280 -158 293 -158 ct 
315 -158 333 -151 346 -137 ct 359 -123 366 -104 366 -80 ct p
334 -79 m  334 -96 330 -110 321 -120 ct 313 -129 301 -134 285 -134 ct 271 -134 259 -130 250 -121 ct 
241 -113 237 -101 237 -86 ct 237 -67 242 -52 251 -40 ct 260 -28 272 -22 286 -22 ct 
301 -22 313 -27 322 -37 ct 330 -47 334 -61 334 -79 ct p ef
pom
gr
gs
tm setmatrix
-12.99911 -12.9977 t 
0.99993 0.99982 s 
pum
9584 10627 t
0.003 0.003 0.003 c 18 0 m  18 -22 l  24 -35 31 -47 39 -58 ct 48 -68 57 -77 66 -85 ct 
75 -94 84 -101 94 -109 ct 103 -116 111 -123 118 -130 ct 126 -137 132 -145 136 -152 ct 
141 -160 143 -169 143 -179 ct 143 -192 139 -203 131 -210 ct 123 -217 113 -221 99 -221 ct 
85 -221 74 -217 66 -210 ct 57 -203 52 -193 51 -180 ct 19 -183 l  21 -202 30 -218 44 -229 ct 
58 -241 76 -247 99 -247 ct 123 -247 142 -241 155 -229 ct 168 -218 175 -201 175 -180 ct 
175 -171 173 -161 168 -152 ct 164 -143 158 -133 149 -124 ct 141 -115 124 -100 100 -81 ct 
87 -70 77 -60 69 -51 ct 61 -43 55 -34 52 -26 ct 179 -26 l  179 0 l  18 0 l  p ef
364 -218 m  339 -180 321 -151 311 -129 ct 301 -108 293 -86 288 -65 ct 283 -45 280 -23 280 -1 ct 
248 -1 l  248 -32 254 -64 268 -98 ct 281 -133 303 -172 334 -217 ct 203 -217 l 
203 -243 l  364 -243 l  364 -218 l  p ef
pom
gr
gs
tm setmatrix
-12.99911 -12.9977 t 
0.99993 0.99982 s 
pum
10347 10627 t
0.003 0.003 0.003 c 18 0 m  18 -22 l  24 -35 31 -47 39 -58 ct 48 -68 57 -77 66 -85 ct 
75 -94 84 -101 94 -109 ct 103 -116 111 -123 118 -130 ct 126 -137 132 -145 136 -152 ct 
141 -160 143 -169 143 -179 ct 143 -192 139 -203 131 -210 ct 123 -217 113 -221 99 -221 ct 
85 -221 74 -217 66 -210 ct 57 -203 52 -193 51 -180 ct 19 -183 l  21 -202 30 -218 44 -229 ct 
58 -241 76 -247 99 -247 ct 123 -247 142 -241 155 -229 ct 168 -218 175 -201 175 -180 ct 
175 -171 173 -161 168 -152 ct 164 -143 158 -133 149 -124 ct 141 -115 124 -100 100 -81 ct 
87 -70 77 -60 69 -51 ct 61 -43 55 -34 52 -26 ct 179 -26 l  179 0 l  18 0 l  p ef
366 -68 m  366 -46 359 -28 345 -16 ct 330 -3 310 3 283 3 ct 257 3 237 -3 222 -15 ct 
208 -28 200 -45 200 -68 ct 200 -84 205 -97 214 -108 ct 223 -119 235 -125 249 -128 ct 
249 -128 l  236 -131 225 -138 217 -148 ct 210 -159 206 -171 206 -185 ct 206 -203 213 -218 227 -230 ct 
241 -241 259 -247 283 -247 ct 306 -247 325 -241 339 -230 ct 353 -219 360 -204 360 -184 ct 
360 -171 356 -158 348 -148 ct 341 -138 330 -131 317 -129 ct 317 -128 l  332 -125 344 -119 353 -108 ct 
362 -98 366 -84 366 -68 ct p
328 -183 m  328 -210 313 -224 283 -224 ct 268 -224 257 -220 249 -214 ct 242 -207 238 -196 238 -183 ct 
238 -169 242 -158 250 -151 ct 257 -144 269 -140 283 -140 ct 298 -140 309 -143 316 -150 ct 
324 -157 328 -168 328 -183 ct p
334 -71 m  334 -86 329 -98 320 -105 ct 311 -113 299 -117 283 -117 ct 267 -117 255 -113 246 -104 ct 
237 -96 232 -85 232 -70 ct 232 -37 249 -20 284 -20 ct 300 -20 313 -24 321 -32 ct 
330 -41 334 -53 334 -71 ct p ef
pom
gr
gs
tm setmatrix
-12.99911 -12.9977 t 
0.99993 0.99982 s 
pum
11111 10627 t
0.003 0.003 0.003 c 18 0 m  18 -22 l  24 -35 31 -47 39 -58 ct 48 -68 57 -77 66 -85 ct 
75 -94 84 -101 94 -109 ct 103 -116 111 -123 118 -130 ct 126 -137 132 -145 136 -152 ct 
141 -160 143 -169 143 -179 ct 143 -192 139 -203 131 -210 ct 123 -217 113 -221 99 -221 ct 
85 -221 74 -217 66 -210 ct 57 -203 52 -193 51 -180 ct 19 -183 l  21 -202 30 -218 44 -229 ct 
58 -241 76 -247 99 -247 ct 123 -247 142 -241 155 -229 ct 168 -218 175 -201 175 -180 ct 
175 -171 173 -161 168 -152 ct 164 -143 158 -133 149 -124 ct 141 -115 124 -100 100 -81 ct 
87 -70 77 -60 69 -51 ct 61 -43 55 -34 52 -26 ct 179 -26 l  179 0 l  18 0 l  p ef
365 -127 m  365 -85 357 -53 342 -31 ct 327 -8 305 3 277 3 ct 258 3 243 -1 231 -9 ct 
220 -17 211 -30 207 -48 ct 236 -52 l  242 -32 256 -22 277 -22 ct 295 -22 309 -30 319 -47 ct 
328 -63 333 -87 334 -118 ct 329 -107 321 -99 310 -93 ct 299 -87 287 -84 274 -84 ct 
252 -84 234 -91 221 -106 ct 208 -121 202 -141 202 -165 ct 202 -191 209 -211 223 -225 ct 
237 -240 257 -247 282 -247 ct 309 -247 330 -237 344 -217 ct 358 -197 365 -167 365 -127 ct 
p
331 -157 m  331 -176 326 -192 317 -204 ct 308 -216 296 -222 281 -222 ct 266 -222 255 -217 246 -207 ct 
237 -196 233 -183 233 -165 ct 233 -148 237 -134 246 -123 ct 255 -113 266 -108 281 -108 ct 
290 -108 298 -110 306 -114 ct 314 -118 320 -124 324 -131 ct 329 -139 331 -147 331 -157 ct 
p ef
pom
gr
gs
tm setmatrix
-12.99911 -12.9977 t 
0.99993 0.99982 s 
pum
11875 10627 t
0.003 0.003 0.003 c 181 -68 m  181 -45 174 -28 159 -16 ct 145 -3 125 3 98 3 ct 74 3 54 -3 40 -14 ct 
25 -25 16 -41 13 -63 ct 46 -66 l  50 -37 67 -23 98 -23 ct 114 -23 126 -27 135 -34 ct 
144 -42 149 -54 149 -69 ct 149 -82 143 -92 133 -100 ct 123 -107 108 -111 89 -111 ct 
72 -111 l  72 -138 l  89 -138 l  106 -138 119 -142 128 -149 ct 138 -156 142 -167 142 -180 ct 
142 -193 138 -203 131 -210 ct 123 -218 112 -221 97 -221 ct 83 -221 72 -218 64 -211 ct 
55 -204 50 -194 49 -182 ct 18 -184 l  20 -204 28 -219 42 -230 ct 57 -241 75 -247 97 -247 ct 
121 -247 140 -241 154 -230 ct 167 -219 174 -203 174 -183 ct 174 -167 170 -155 161 -145 ct 
152 -135 140 -129 123 -125 ct 123 -125 l  141 -123 156 -117 166 -106 ct 176 -96 181 -83 181 -68 ct 
p ef
368 -122 m  368 -81 360 -50 346 -29 ct 332 -8 311 3 283 3 ct 255 3 234 -8 220 -29 ct 
206 -50 199 -81 199 -122 ct 199 -164 206 -195 219 -216 ct 233 -237 254 -247 284 -247 ct 
312 -247 334 -236 347 -215 ct 361 -194 368 -163 368 -122 ct p
336 -122 m  336 -157 332 -182 324 -198 ct 316 -214 302 -222 284 -222 ct 265 -222 251 -214 243 -199 ct 
234 -183 230 -158 230 -122 ct 230 -88 234 -62 243 -46 ct 251 -30 265 -22 283 -22 ct 
301 -22 315 -31 323 -47 ct 332 -63 336 -88 336 -122 ct p ef
pom
gr
gs
tm setmatrix
-12.99911 -12.9977 t 
0.99993 0.99982 s 
pum
12639 10627 t
0.003 0.003 0.003 c 181 -68 m  181 -45 174 -28 159 -16 ct 145 -3 125 3 98 3 ct 74 3 54 -3 40 -14 ct 
25 -25 16 -41 13 -63 ct 46 -66 l  50 -37 67 -23 98 -23 ct 114 -23 126 -27 135 -34 ct 
144 -42 149 -54 149 -69 ct 149 -82 143 -92 133 -100 ct 123 -107 108 -111 89 -111 ct 
72 -111 l  72 -138 l  89 -138 l  106 -138 119 -142 128 -149 ct 138 -156 142 -167 142 -180 ct 
142 -193 138 -203 131 -210 ct 123 -218 112 -221 97 -221 ct 83 -221 72 -218 64 -211 ct 
55 -204 50 -194 49 -182 ct 18 -184 l  20 -204 28 -219 42 -230 ct 57 -241 75 -247 97 -247 ct 
121 -247 140 -241 154 -230 ct 167 -219 174 -203 174 -183 ct 174 -167 170 -155 161 -145 ct 
152 -135 140 -129 123 -125 ct 123 -125 l  141 -123 156 -117 166 -106 ct 176 -96 181 -83 181 -68 ct 
p ef
212 0 m  212 -26 l  274 -26 l  274 -213 l  219 -174 l  219 -204 l  276 -243 l 
305 -243 l  305 -26 l  364 -26 l  364 0 l  212 0 l  p ef
pom
gr
gs
tm setmatrix
-12.99911 -12.9977 t 
0.99993 0.99982 s 
pum
13403 10627 t
0.003 0.003 0.003 c 181 -68 m  181 -45 174 -28 159 -16 ct 145 -3 125 3 98 3 ct 74 3 54 -3 40 -14 ct 
25 -25 16 -41 13 -63 ct 46 -66 l  50 -37 67 -23 98 -23 ct 114 -23 126 -27 135 -34 ct 
144 -42 149 -54 149 -69 ct 149 -82 143 -92 133 -100 ct 123 -107 108 -111 89 -111 ct 
72 -111 l  72 -138 l  89 -138 l  106 -138 119 -142 128 -149 ct 138 -156 142 -167 142 -180 ct 
142 -193 138 -203 131 -210 ct 123 -218 112 -221 97 -221 ct 83 -221 72 -218 64 -211 ct 
55 -204 50 -194 49 -182 ct 18 -184 l  20 -204 28 -219 42 -230 ct 57 -241 75 -247 97 -247 ct 
121 -247 140 -241 154 -230 ct 167 -219 174 -203 174 -183 ct 174 -167 170 -155 161 -145 ct 
152 -135 140 -129 123 -125 ct 123 -125 l  141 -123 156 -117 166 -106 ct 176 -96 181 -83 181 -68 ct 
p ef
203 0 m  203 -22 l  209 -35 216 -47 224 -58 ct 233 -68 242 -77 251 -85 ct 260 -94 269 -101 279 -109 ct 
288 -116 296 -123 303 -130 ct 311 -137 317 -145 321 -152 ct 326 -160 328 -169 328 -179 ct 
328 -192 324 -203 316 -210 ct 308 -217 298 -221 284 -221 ct 270 -221 259 -217 251 -210 ct 
242 -203 237 -193 236 -180 ct 204 -183 l  206 -202 215 -218 229 -229 ct 243 -241 261 -247 284 -247 ct 
308 -247 327 -241 340 -229 ct 353 -218 360 -201 360 -180 ct 360 -171 358 -161 353 -152 ct 
349 -143 343 -133 334 -124 ct 326 -115 309 -100 285 -81 ct 272 -70 262 -60 254 -51 ct 
246 -43 240 -34 237 -26 ct 364 -26 l  364 0 l  203 0 l  p ef
pom
gr
gs
tm setmatrix
-12.99911 -12.9977 t 
0.99993 0.99982 s 
pum
1220 10179 t
0.003 0.003 0.003 c 183 -122 m  183 -81 175 -50 161 -29 ct 147 -8 126 3 98 3 ct 
70 3 49 -8 35 -29 ct 21 -50 14 -81 14 -122 ct 14 -164 21 -195 34 -216 ct 48 -237 69 -247 99 -247 ct 
127 -247 149 -236 162 -215 ct 176 -194 183 -163 183 -122 ct p
151 -122 m  151 -157 147 -182 139 -198 ct 131 -214 117 -222 99 -222 ct 80 -222 66 -214 58 -199 ct 
49 -183 45 -158 45 -122 ct 45 -88 49 -62 58 -46 ct 66 -30 80 -22 98 -22 ct 116 -22 130 -31 138 -47 ct 
147 -63 151 -88 151 -122 ct p ef
217 0 m  217 -38 l  251 -38 l  251 0 l  217 0 l  p ef
474 -122 m  474 -81 466 -50 452 -29 ct 438 -8 417 3 389 3 ct 361 3 340 -8 326 -29 ct 
312 -50 305 -81 305 -122 ct 305 -164 312 -195 325 -216 ct 339 -237 360 -247 390 -247 ct 
418 -247 440 -236 453 -215 ct 467 -194 474 -163 474 -122 ct p
442 -122 m  442 -157 438 -182 430 -198 ct 422 -214 408 -222 390 -222 ct 371 -222 357 -214 349 -199 ct 
340 -183 336 -158 336 -122 ct 336 -88 340 -62 349 -46 ct 357 -30 371 -22 389 -22 ct 
407 -22 421 -31 429 -47 ct 438 -63 442 -88 442 -122 ct p ef
659 -122 m  659 -81 651 -50 637 -29 ct 623 -8 602 3 574 3 ct 546 3 525 -8 511 -29 ct 
497 -50 490 -81 490 -122 ct 490 -164 497 -195 510 -216 ct 524 -237 545 -247 575 -247 ct 
603 -247 625 -236 638 -215 ct 652 -194 659 -163 659 -122 ct p
627 -122 m  627 -157 623 -182 615 -198 ct 607 -214 593 -222 575 -222 ct 556 -222 542 -214 534 -199 ct 
525 -183 521 -158 521 -122 ct 521 -88 525 -62 534 -46 ct 542 -30 556 -22 574 -22 ct 
592 -22 606 -31 614 -47 ct 623 -63 627 -88 627 -122 ct p ef
pom
gr
gs
tm setmatrix
-12.99911 -12.9977 t 
0.99993 0.99982 s 
pum
1034 9239 t
0.003 0.003 0.003 c 182 -80 m  182 -54 174 -34 159 -19 ct 143 -4 122 3 95 3 ct 73 3 54 -2 41 -12 ct 
27 -22 18 -36 14 -55 ct 46 -58 l  52 -34 69 -22 96 -22 ct 113 -22 126 -27 135 -37 ct 
145 -47 149 -61 149 -79 ct 149 -94 145 -106 135 -116 ct 126 -125 113 -130 97 -130 ct 
88 -130 80 -129 73 -126 ct 66 -123 59 -119 52 -113 ct 21 -113 l  29 -243 l  167 -243 l 
167 -217 l  58 -217 l  53 -140 l  66 -150 83 -155 103 -155 ct 127 -155 146 -148 160 -134 ct 
174 -120 182 -102 182 -80 ct p ef
368 -122 m  368 -81 360 -50 346 -29 ct 332 -8 311 3 283 3 ct 255 3 234 -8 220 -29 ct 
206 -50 199 -81 199 -122 ct 199 -164 206 -195 219 -216 ct 233 -237 254 -247 284 -247 ct 
312 -247 334 -236 347 -215 ct 361 -194 368 -163 368 -122 ct p
336 -122 m  336 -157 332 -182 324 -198 ct 316 -214 302 -222 284 -222 ct 265 -222 251 -214 243 -199 ct 
234 -183 230 -158 230 -122 ct 230 -88 234 -62 243 -46 ct 251 -30 265 -22 283 -22 ct 
301 -22 315 -31 323 -47 ct 332 -63 336 -88 336 -122 ct p ef
402 0 m  402 -38 l  436 -38 l  436 0 l  402 0 l  p ef
659 -122 m  659 -81 651 -50 637 -29 ct 623 -8 602 3 574 3 ct 546 3 525 -8 511 -29 ct 
497 -50 490 -81 490 -122 ct 490 -164 497 -195 510 -216 ct 524 -237 545 -247 575 -247 ct 
603 -247 625 -236 638 -215 ct 652 -194 659 -163 659 -122 ct p
627 -122 m  627 -157 623 -182 615 -198 ct 607 -214 593 -222 575 -222 ct 556 -222 542 -214 534 -199 ct 
525 -183 521 -158 521 -122 ct 521 -88 525 -62 534 -46 ct 542 -30 556 -22 574 -22 ct 
592 -22 606 -31 614 -47 ct 623 -63 627 -88 627 -122 ct p ef
844 -122 m  844 -81 836 -50 822 -29 ct 808 -8 787 3 759 3 ct 731 3 710 -8 696 -29 ct 
682 -50 675 -81 675 -122 ct 675 -164 682 -195 695 -216 ct 709 -237 730 -247 760 -247 ct 
788 -247 810 -236 823 -215 ct 837 -194 844 -163 844 -122 ct p
812 -122 m  812 -157 808 -182 800 -198 ct 792 -214 778 -222 760 -222 ct 741 -222 727 -214 719 -199 ct 
710 -183 706 -158 706 -122 ct 706 -88 710 -62 719 -46 ct 727 -30 741 -22 759 -22 ct 
777 -22 791 -31 799 -47 ct 808 -63 812 -88 812 -122 ct p ef
pom
gr
gs
tm setmatrix
-12.99911 -12.9977 t 
0.99993 0.99982 s 
pum
849 8299 t
0.003 0.003 0.003 c 27 0 m  27 -26 l  89 -26 l  89 -213 l  34 -174 l  34 -204 l 
91 -243 l  120 -243 l  120 -26 l  179 -26 l  179 0 l  27 0 l  p ef
368 -122 m  368 -81 360 -50 346 -29 ct 332 -8 311 3 283 3 ct 255 3 234 -8 220 -29 ct 
206 -50 199 -81 199 -122 ct 199 -164 206 -195 219 -216 ct 233 -237 254 -247 284 -247 ct 
312 -247 334 -236 347 -215 ct 361 -194 368 -163 368 -122 ct p
336 -122 m  336 -157 332 -182 324 -198 ct 316 -214 302 -222 284 -222 ct 265 -222 251 -214 243 -199 ct 
234 -183 230 -158 230 -122 ct 230 -88 234 -62 243 -46 ct 251 -30 265 -22 283 -22 ct 
301 -22 315 -31 323 -47 ct 332 -63 336 -88 336 -122 ct p ef
553 -122 m  553 -81 545 -50 531 -29 ct 517 -8 496 3 468 3 ct 440 3 419 -8 405 -29 ct 
391 -50 384 -81 384 -122 ct 384 -164 391 -195 404 -216 ct 418 -237 439 -247 469 -247 ct 
497 -247 519 -236 532 -215 ct 546 -194 553 -163 553 -122 ct p
521 -122 m  521 -157 517 -182 509 -198 ct 501 -214 487 -222 469 -222 ct 450 -222 436 -214 428 -199 ct 
419 -183 415 -158 415 -122 ct 415 -88 419 -62 428 -46 ct 436 -30 450 -22 468 -22 ct 
486 -22 500 -31 508 -47 ct 517 -63 521 -88 521 -122 ct p ef
588 0 m  588 -38 l  622 -38 l  622 0 l  588 0 l  p ef
844 -122 m  844 -81 836 -50 822 -29 ct 808 -8 787 3 759 3 ct 731 3 710 -8 696 -29 ct 
682 -50 675 -81 675 -122 ct 675 -164 682 -195 695 -216 ct 709 -237 730 -247 760 -247 ct 
788 -247 810 -236 823 -215 ct 837 -194 844 -163 844 -122 ct p
812 -122 m  812 -157 808 -182 800 -198 ct 792 -214 778 -222 760 -222 ct 741 -222 727 -214 719 -199 ct 
710 -183 706 -158 706 -122 ct 706 -88 710 -62 719 -46 ct 727 -30 741 -22 759 -22 ct 
777 -22 791 -31 799 -47 ct 808 -63 812 -88 812 -122 ct p ef
1030 -122 m  1030 -81 1022 -50 1008 -29 ct 994 -8 973 3 945 3 ct 917 3 896 -8 882 -29 ct 
868 -50 861 -81 861 -122 ct 861 -164 868 -195 881 -216 ct 895 -237 916 -247 946 -247 ct 
974 -247 996 -236 1009 -215 ct 1023 -194 1030 -163 1030 -122 ct p
998 -122 m  998 -157 994 -182 986 -198 ct 978 -214 964 -222 946 -222 ct 927 -222 913 -214 905 -199 ct 
896 -183 892 -158 892 -122 ct 892 -88 896 -62 905 -46 ct 913 -30 927 -22 945 -22 ct 
963 -22 977 -31 985 -47 ct 994 -63 998 -88 998 -122 ct p ef
pom
gr
gs
tm setmatrix
-12.99911 -12.9977 t 
0.99993 0.99982 s 
pum
849 7359 t
0.003 0.003 0.003 c 27 0 m  27 -26 l  89 -26 l  89 -213 l  34 -174 l  34 -204 l 
91 -243 l  120 -243 l  120 -26 l  179 -26 l  179 0 l  27 0 l  p ef
367 -80 m  367 -54 359 -34 344 -19 ct 328 -4 307 3 280 3 ct 258 3 239 -2 226 -12 ct 
212 -22 203 -36 199 -55 ct 231 -58 l  237 -34 254 -22 281 -22 ct 298 -22 311 -27 320 -37 ct 
330 -47 334 -61 334 -79 ct 334 -94 330 -106 320 -116 ct 311 -125 298 -130 282 -130 ct 
273 -130 265 -129 258 -126 ct 251 -123 244 -119 237 -113 ct 206 -113 l  214 -243 l 
352 -243 l  352 -217 l  243 -217 l  238 -140 l  251 -150 268 -155 288 -155 ct 
312 -155 331 -148 345 -134 ct 359 -120 367 -102 367 -80 ct p ef
553 -122 m  553 -81 545 -50 531 -29 ct 517 -8 496 3 468 3 ct 440 3 419 -8 405 -29 ct 
391 -50 384 -81 384 -122 ct 384 -164 391 -195 404 -216 ct 418 -237 439 -247 469 -247 ct 
497 -247 519 -236 532 -215 ct 546 -194 553 -163 553 -122 ct p
521 -122 m  521 -157 517 -182 509 -198 ct 501 -214 487 -222 469 -222 ct 450 -222 436 -214 428 -199 ct 
419 -183 415 -158 415 -122 ct 415 -88 419 -62 428 -46 ct 436 -30 450 -22 468 -22 ct 
486 -22 500 -31 508 -47 ct 517 -63 521 -88 521 -122 ct p ef
588 0 m  588 -38 l  622 -38 l  622 0 l  588 0 l  p ef
844 -122 m  844 -81 836 -50 822 -29 ct 808 -8 787 3 759 3 ct 731 3 710 -8 696 -29 ct 
682 -50 675 -81 675 -122 ct 675 -164 682 -195 695 -216 ct 709 -237 730 -247 760 -247 ct 
788 -247 810 -236 823 -215 ct 837 -194 844 -163 844 -122 ct p
812 -122 m  812 -157 808 -182 800 -198 ct 792 -214 778 -222 760 -222 ct 741 -222 727 -214 719 -199 ct 
710 -183 706 -158 706 -122 ct 706 -88 710 -62 719 -46 ct 727 -30 741 -22 759 -22 ct 
777 -22 791 -31 799 -47 ct 808 -63 812 -88 812 -122 ct p ef
1030 -122 m  1030 -81 1022 -50 1008 -29 ct 994 -8 973 3 945 3 ct 917 3 896 -8 882 -29 ct 
868 -50 861 -81 861 -122 ct 861 -164 868 -195 881 -216 ct 895 -237 916 -247 946 -247 ct 
974 -247 996 -236 1009 -215 ct 1023 -194 1030 -163 1030 -122 ct p
998 -122 m  998 -157 994 -182 986 -198 ct 978 -214 964 -222 946 -222 ct 927 -222 913 -214 905 -199 ct 
896 -183 892 -158 892 -122 ct 892 -88 896 -62 905 -46 ct 913 -30 927 -22 945 -22 ct 
963 -22 977 -31 985 -47 ct 994 -63 998 -88 998 -122 ct p ef
pom
gr
gs
tm setmatrix
-12.99911 -12.9977 t 
0.99993 0.99982 s 
pum
849 6419 t
0.003 0.003 0.003 c 18 0 m  18 -22 l  24 -35 31 -47 39 -58 ct 48 -68 57 -77 66 -85 ct 
75 -94 84 -101 94 -109 ct 103 -116 111 -123 118 -130 ct 126 -137 132 -145 136 -152 ct 
141 -160 143 -169 143 -179 ct 143 -192 139 -203 131 -210 ct 123 -217 113 -221 99 -221 ct 
85 -221 74 -217 66 -210 ct 57 -203 52 -193 51 -180 ct 19 -183 l  21 -202 30 -218 44 -229 ct 
58 -241 76 -247 99 -247 ct 123 -247 142 -241 155 -229 ct 168 -218 175 -201 175 -180 ct 
175 -171 173 -161 168 -152 ct 164 -143 158 -133 149 -124 ct 141 -115 124 -100 100 -81 ct 
87 -70 77 -60 69 -51 ct 61 -43 55 -34 52 -26 ct 179 -26 l  179 0 l  18 0 l  p ef
368 -122 m  368 -81 360 -50 346 -29 ct 332 -8 311 3 283 3 ct 255 3 234 -8 220 -29 ct 
206 -50 199 -81 199 -122 ct 199 -164 206 -195 219 -216 ct 233 -237 254 -247 284 -247 ct 
312 -247 334 -236 347 -215 ct 361 -194 368 -163 368 -122 ct p
336 -122 m  336 -157 332 -182 324 -198 ct 316 -214 302 -222 284 -222 ct 265 -222 251 -214 243 -199 ct 
234 -183 230 -158 230 -122 ct 230 -88 234 -62 243 -46 ct 251 -30 265 -22 283 -22 ct 
301 -22 315 -31 323 -47 ct 332 -63 336 -88 336 -122 ct p ef
553 -122 m  553 -81 545 -50 531 -29 ct 517 -8 496 3 468 3 ct 440 3 419 -8 405 -29 ct 
391 -50 384 -81 384 -122 ct 384 -164 391 -195 404 -216 ct 418 -237 439 -247 469 -247 ct 
497 -247 519 -236 532 -215 ct 546 -194 553 -163 553 -122 ct p
521 -122 m  521 -157 517 -182 509 -198 ct 501 -214 487 -222 469 -222 ct 450 -222 436 -214 428 -199 ct 
419 -183 415 -158 415 -122 ct 415 -88 419 -62 428 -46 ct 436 -30 450 -22 468 -22 ct 
486 -22 500 -31 508 -47 ct 517 -63 521 -88 521 -122 ct p ef
588 0 m  588 -38 l  622 -38 l  622 0 l  588 0 l  p ef
844 -122 m  844 -81 836 -50 822 -29 ct 808 -8 787 3 759 3 ct 731 3 710 -8 696 -29 ct 
682 -50 675 -81 675 -122 ct 675 -164 682 -195 695 -216 ct 709 -237 730 -247 760 -247 ct 
788 -247 810 -236 823 -215 ct 837 -194 844 -163 844 -122 ct p
812 -122 m  812 -157 808 -182 800 -198 ct 792 -214 778 -222 760 -222 ct 741 -222 727 -214 719 -199 ct 
710 -183 706 -158 706 -122 ct 706 -88 710 -62 719 -46 ct 727 -30 741 -22 759 -22 ct 
777 -22 791 -31 799 -47 ct 808 -63 812 -88 812 -122 ct p ef
1030 -122 m  1030 -81 1022 -50 1008 -29 ct 994 -8 973 3 945 3 ct 917 3 896 -8 882 -29 ct 
868 -50 861 -81 861 -122 ct 861 -164 868 -195 881 -216 ct 895 -237 916 -247 946 -247 ct 
974 -247 996 -236 1009 -215 ct 1023 -194 1030 -163 1030 -122 ct p
998 -122 m  998 -157 994 -182 986 -198 ct 978 -214 964 -222 946 -222 ct 927 -222 913 -214 905 -199 ct 
896 -183 892 -158 892 -122 ct 892 -88 896 -62 905 -46 ct 913 -30 927 -22 945 -22 ct 
963 -22 977 -31 985 -47 ct 994 -63 998 -88 998 -122 ct p ef
pom
gr
gs
tm setmatrix
-12.99911 -12.9977 t 
0.99993 0.99982 s 
pum
849 5480 t
0.003 0.003 0.003 c 18 0 m  18 -22 l  24 -35 31 -47 39 -58 ct 48 -68 57 -77 66 -85 ct 
75 -94 84 -101 94 -109 ct 103 -116 111 -123 118 -130 ct 126 -137 132 -145 136 -152 ct 
141 -160 143 -169 143 -179 ct 143 -192 139 -203 131 -210 ct 123 -217 113 -221 99 -221 ct 
85 -221 74 -217 66 -210 ct 57 -203 52 -193 51 -180 ct 19 -183 l  21 -202 30 -218 44 -229 ct 
58 -241 76 -247 99 -247 ct 123 -247 142 -241 155 -229 ct 168 -218 175 -201 175 -180 ct 
175 -171 173 -161 168 -152 ct 164 -143 158 -133 149 -124 ct 141 -115 124 -100 100 -81 ct 
87 -70 77 -60 69 -51 ct 61 -43 55 -34 52 -26 ct 179 -26 l  179 0 l  18 0 l  p ef
367 -80 m  367 -54 359 -34 344 -19 ct 328 -4 307 3 280 3 ct 258 3 239 -2 226 -12 ct 
212 -22 203 -36 199 -55 ct 231 -58 l  237 -34 254 -22 281 -22 ct 298 -22 311 -27 320 -37 ct 
330 -47 334 -61 334 -79 ct 334 -94 330 -106 320 -116 ct 311 -125 298 -130 282 -130 ct 
273 -130 265 -129 258 -126 ct 251 -123 244 -119 237 -113 ct 206 -113 l  214 -243 l 
352 -243 l  352 -217 l  243 -217 l  238 -140 l  251 -150 268 -155 288 -155 ct 
312 -155 331 -148 345 -134 ct 359 -120 367 -102 367 -80 ct p ef
553 -122 m  553 -81 545 -50 531 -29 ct 517 -8 496 3 468 3 ct 440 3 419 -8 405 -29 ct 
391 -50 384 -81 384 -122 ct 384 -164 391 -195 404 -216 ct 418 -237 439 -247 469 -247 ct 
497 -247 519 -236 532 -215 ct 546 -194 553 -163 553 -122 ct p
521 -122 m  521 -157 517 -182 509 -198 ct 501 -214 487 -222 469 -222 ct 450 -222 436 -214 428 -199 ct 
419 -183 415 -158 415 -122 ct 415 -88 419 -62 428 -46 ct 436 -30 450 -22 468 -22 ct 
486 -22 500 -31 508 -47 ct 517 -63 521 -88 521 -122 ct p ef
588 0 m  588 -38 l  622 -38 l  622 0 l  588 0 l  p ef
844 -122 m  844 -81 836 -50 822 -29 ct 808 -8 787 3 759 3 ct 731 3 710 -8 696 -29 ct 
682 -50 675 -81 675 -122 ct 675 -164 682 -195 695 -216 ct 709 -237 730 -247 760 -247 ct 
788 -247 810 -236 823 -215 ct 837 -194 844 -163 844 -122 ct p
812 -122 m  812 -157 808 -182 800 -198 ct 792 -214 778 -222 760 -222 ct 741 -222 727 -214 719 -199 ct 
710 -183 706 -158 706 -122 ct 706 -88 710 -62 719 -46 ct 727 -30 741 -22 759 -22 ct 
777 -22 791 -31 799 -47 ct 808 -63 812 -88 812 -122 ct p ef
1030 -122 m  1030 -81 1022 -50 1008 -29 ct 994 -8 973 3 945 3 ct 917 3 896 -8 882 -29 ct 
868 -50 861 -81 861 -122 ct 861 -164 868 -195 881 -216 ct 895 -237 916 -247 946 -247 ct 
974 -247 996 -236 1009 -215 ct 1023 -194 1030 -163 1030 -122 ct p
998 -122 m  998 -157 994 -182 986 -198 ct 978 -214 964 -222 946 -222 ct 927 -222 913 -214 905 -199 ct 
896 -183 892 -158 892 -122 ct 892 -88 896 -62 905 -46 ct 913 -30 927 -22 945 -22 ct 
963 -22 977 -31 985 -47 ct 994 -63 998 -88 998 -122 ct p ef
pom
gr
gs
tm setmatrix
-12.99911 -12.9977 t 
0.99993 0.99982 s 
pum
849 4540 t
0.003 0.003 0.003 c 181 -68 m  181 -45 174 -28 159 -16 ct 145 -3 125 3 98 3 ct 74 3 54 -3 40 -14 ct 
25 -25 16 -41 13 -63 ct 46 -66 l  50 -37 67 -23 98 -23 ct 114 -23 126 -27 135 -34 ct 
144 -42 149 -54 149 -69 ct 149 -82 143 -92 133 -100 ct 123 -107 108 -111 89 -111 ct 
72 -111 l  72 -138 l  89 -138 l  106 -138 119 -142 128 -149 ct 138 -156 142 -167 142 -180 ct 
142 -193 138 -203 131 -210 ct 123 -218 112 -221 97 -221 ct 83 -221 72 -218 64 -211 ct 
55 -204 50 -194 49 -182 ct 18 -184 l  20 -204 28 -219 42 -230 ct 57 -241 75 -247 97 -247 ct 
121 -247 140 -241 154 -230 ct 167 -219 174 -203 174 -183 ct 174 -167 170 -155 161 -145 ct 
152 -135 140 -129 123 -125 ct 123 -125 l  141 -123 156 -117 166 -106 ct 176 -96 181 -83 181 -68 ct 
p ef
368 -122 m  368 -81 360 -50 346 -29 ct 332 -8 311 3 283 3 ct 255 3 234 -8 220 -29 ct 
206 -50 199 -81 199 -122 ct 199 -164 206 -195 219 -216 ct 233 -237 254 -247 284 -247 ct 
312 -247 334 -236 347 -215 ct 361 -194 368 -163 368 -122 ct p
336 -122 m  336 -157 332 -182 324 -198 ct 316 -214 302 -222 284 -222 ct 265 -222 251 -214 243 -199 ct 
234 -183 230 -158 230 -122 ct 230 -88 234 -62 243 -46 ct 251 -30 265 -22 283 -22 ct 
301 -22 315 -31 323 -47 ct 332 -63 336 -88 336 -122 ct p ef
553 -122 m  553 -81 545 -50 531 -29 ct 517 -8 496 3 468 3 ct 440 3 419 -8 405 -29 ct 
391 -50 384 -81 384 -122 ct 384 -164 391 -195 404 -216 ct 418 -237 439 -247 469 -247 ct 
497 -247 519 -236 532 -215 ct 546 -194 553 -163 553 -122 ct p
521 -122 m  521 -157 517 -182 509 -198 ct 501 -214 487 -222 469 -222 ct 450 -222 436 -214 428 -199 ct 
419 -183 415 -158 415 -122 ct 415 -88 419 -62 428 -46 ct 436 -30 450 -22 468 -22 ct 
486 -22 500 -31 508 -47 ct 517 -63 521 -88 521 -122 ct p ef
588 0 m  588 -38 l  622 -38 l  622 0 l  588 0 l  p ef
844 -122 m  844 -81 836 -50 822 -29 ct 808 -8 787 3 759 3 ct 731 3 710 -8 696 -29 ct 
682 -50 675 -81 675 -122 ct 675 -164 682 -195 695 -216 ct 709 -237 730 -247 760 -247 ct 
788 -247 810 -236 823 -215 ct 837 -194 844 -163 844 -122 ct p
812 -122 m  812 -157 808 -182 800 -198 ct 792 -214 778 -222 760 -222 ct 741 -222 727 -214 719 -199 ct 
710 -183 706 -158 706 -122 ct 706 -88 710 -62 719 -46 ct 727 -30 741 -22 759 -22 ct 
777 -22 791 -31 799 -47 ct 808 -63 812 -88 812 -122 ct p ef
1030 -122 m  1030 -81 1022 -50 1008 -29 ct 994 -8 973 3 945 3 ct 917 3 896 -8 882 -29 ct 
868 -50 861 -81 861 -122 ct 861 -164 868 -195 881 -216 ct 895 -237 916 -247 946 -247 ct 
974 -247 996 -236 1009 -215 ct 1023 -194 1030 -163 1030 -122 ct p
998 -122 m  998 -157 994 -182 986 -198 ct 978 -214 964 -222 946 -222 ct 927 -222 913 -214 905 -199 ct 
896 -183 892 -158 892 -122 ct 892 -88 896 -62 905 -46 ct 913 -30 927 -22 945 -22 ct 
963 -22 977 -31 985 -47 ct 994 -63 998 -88 998 -122 ct p ef
pom
gr
gs
tm setmatrix
-12.99911 -12.9977 t 
0.99993 0.99982 s 
pum
849 3600 t
0.003 0.003 0.003 c 181 -68 m  181 -45 174 -28 159 -16 ct 145 -3 125 3 98 3 ct 74 3 54 -3 40 -14 ct 
25 -25 16 -41 13 -63 ct 46 -66 l  50 -37 67 -23 98 -23 ct 114 -23 126 -27 135 -34 ct 
144 -42 149 -54 149 -69 ct 149 -82 143 -92 133 -100 ct 123 -107 108 -111 89 -111 ct 
72 -111 l  72 -138 l  89 -138 l  106 -138 119 -142 128 -149 ct 138 -156 142 -167 142 -180 ct 
142 -193 138 -203 131 -210 ct 123 -218 112 -221 97 -221 ct 83 -221 72 -218 64 -211 ct 
55 -204 50 -194 49 -182 ct 18 -184 l  20 -204 28 -219 42 -230 ct 57 -241 75 -247 97 -247 ct 
121 -247 140 -241 154 -230 ct 167 -219 174 -203 174 -183 ct 174 -167 170 -155 161 -145 ct 
152 -135 140 -129 123 -125 ct 123 -125 l  141 -123 156 -117 166 -106 ct 176 -96 181 -83 181 -68 ct 
p ef
367 -80 m  367 -54 359 -34 344 -19 ct 328 -4 307 3 280 3 ct 258 3 239 -2 226 -12 ct 
212 -22 203 -36 199 -55 ct 231 -58 l  237 -34 254 -22 281 -22 ct 298 -22 311 -27 320 -37 ct 
330 -47 334 -61 334 -79 ct 334 -94 330 -106 320 -116 ct 311 -125 298 -130 282 -130 ct 
273 -130 265 -129 258 -126 ct 251 -123 244 -119 237 -113 ct 206 -113 l  214 -243 l 
352 -243 l  352 -217 l  243 -217 l  238 -140 l  251 -150 268 -155 288 -155 ct 
312 -155 331 -148 345 -134 ct 359 -120 367 -102 367 -80 ct p ef
553 -122 m  553 -81 545 -50 531 -29 ct 517 -8 496 3 468 3 ct 440 3 419 -8 405 -29 ct 
391 -50 384 -81 384 -122 ct 384 -164 391 -195 404 -216 ct 418 -237 439 -247 469 -247 ct 
497 -247 519 -236 532 -215 ct 546 -194 553 -163 553 -122 ct p
521 -122 m  521 -157 517 -182 509 -198 ct 501 -214 487 -222 469 -222 ct 450 -222 436 -214 428 -199 ct 
419 -183 415 -158 415 -122 ct 415 -88 419 -62 428 -46 ct 436 -30 450 -22 468 -22 ct 
486 -22 500 -31 508 -47 ct 517 -63 521 -88 521 -122 ct p ef
588 0 m  588 -38 l  622 -38 l  622 0 l  588 0 l  p ef
844 -122 m  844 -81 836 -50 822 -29 ct 808 -8 787 3 759 3 ct 731 3 710 -8 696 -29 ct 
682 -50 675 -81 675 -122 ct 675 -164 682 -195 695 -216 ct 709 -237 730 -247 760 -247 ct 
788 -247 810 -236 823 -215 ct 837 -194 844 -163 844 -122 ct p
812 -122 m  812 -157 808 -182 800 -198 ct 792 -214 778 -222 760 -222 ct 741 -222 727 -214 719 -199 ct 
710 -183 706 -158 706 -122 ct 706 -88 710 -62 719 -46 ct 727 -30 741 -22 759 -22 ct 
777 -22 791 -31 799 -47 ct 808 -63 812 -88 812 -122 ct p ef
1030 -122 m  1030 -81 1022 -50 1008 -29 ct 994 -8 973 3 945 3 ct 917 3 896 -8 882 -29 ct 
868 -50 861 -81 861 -122 ct 861 -164 868 -195 881 -216 ct 895 -237 916 -247 946 -247 ct 
974 -247 996 -236 1009 -215 ct 1023 -194 1030 -163 1030 -122 ct p
998 -122 m  998 -157 994 -182 986 -198 ct 978 -214 964 -222 946 -222 ct 927 -222 913 -214 905 -199 ct 
896 -183 892 -158 892 -122 ct 892 -88 896 -62 905 -46 ct 913 -30 927 -22 945 -22 ct 
963 -22 977 -31 985 -47 ct 994 -63 998 -88 998 -122 ct p ef
pom
gr
gs
tm setmatrix
-12.99911 -12.9977 t 
0.99993 0.99982 s 
pum
849 2660 t
0.003 0.003 0.003 c 152 -55 m  152 0 l  123 0 l  123 -55 l  8 -55 l  8 -79 l 
119 -243 l  152 -243 l  152 -79 l  186 -79 l  186 -55 l  152 -55 l  p
123 -208 m  122 -207 121 -204 118 -199 ct 115 -193 113 -190 111 -187 ct 49 -96 l 
39 -83 l  37 -79 l  123 -79 l  123 -208 l  p ef
368 -122 m  368 -81 360 -50 346 -29 ct 332 -8 311 3 283 3 ct 255 3 234 -8 220 -29 ct 
206 -50 199 -81 199 -122 ct 199 -164 206 -195 219 -216 ct 233 -237 254 -247 284 -247 ct 
312 -247 334 -236 347 -215 ct 361 -194 368 -163 368 -122 ct p
336 -122 m  336 -157 332 -182 324 -198 ct 316 -214 302 -222 284 -222 ct 265 -222 251 -214 243 -199 ct 
234 -183 230 -158 230 -122 ct 230 -88 234 -62 243 -46 ct 251 -30 265 -22 283 -22 ct 
301 -22 315 -31 323 -47 ct 332 -63 336 -88 336 -122 ct p ef
553 -122 m  553 -81 545 -50 531 -29 ct 517 -8 496 3 468 3 ct 440 3 419 -8 405 -29 ct 
391 -50 384 -81 384 -122 ct 384 -164 391 -195 404 -216 ct 418 -237 439 -247 469 -247 ct 
497 -247 519 -236 532 -215 ct 546 -194 553 -163 553 -122 ct p
521 -122 m  521 -157 517 -182 509 -198 ct 501 -214 487 -222 469 -222 ct 450 -222 436 -214 428 -199 ct 
419 -183 415 -158 415 -122 ct 415 -88 419 -62 428 -46 ct 436 -30 450 -22 468 -22 ct 
486 -22 500 -31 508 -47 ct 517 -63 521 -88 521 -122 ct p ef
588 0 m  588 -38 l  622 -38 l  622 0 l  588 0 l  p ef
844 -122 m  844 -81 836 -50 822 -29 ct 808 -8 787 3 759 3 ct 731 3 710 -8 696 -29 ct 
682 -50 675 -81 675 -122 ct 675 -164 682 -195 695 -216 ct 709 -237 730 -247 760 -247 ct 
788 -247 810 -236 823 -215 ct 837 -194 844 -163 844 -122 ct p
812 -122 m  812 -157 808 -182 800 -198 ct 792 -214 778 -222 760 -222 ct 741 -222 727 -214 719 -199 ct 
710 -183 706 -158 706 -122 ct 706 -88 710 -62 719 -46 ct 727 -30 741 -22 759 -22 ct 
777 -22 791 -31 799 -47 ct 808 -63 812 -88 812 -122 ct p ef
1030 -122 m  1030 -81 1022 -50 1008 -29 ct 994 -8 973 3 945 3 ct 917 3 896 -8 882 -29 ct 
868 -50 861 -81 861 -122 ct 861 -164 868 -195 881 -216 ct 895 -237 916 -247 946 -247 ct 
974 -247 996 -236 1009 -215 ct 1023 -194 1030 -163 1030 -122 ct p
998 -122 m  998 -157 994 -182 986 -198 ct 978 -214 964 -222 946 -222 ct 927 -222 913 -214 905 -199 ct 
896 -183 892 -158 892 -122 ct 892 -88 896 -62 905 -46 ct 913 -30 927 -22 945 -22 ct 
963 -22 977 -31 985 -47 ct 994 -63 998 -88 998 -122 ct p ef
pom
gr
gs
tm setmatrix
-12.99911 -12.9977 t 
0.99993 0.99982 s 
pum
849 1720 t
0.003 0.003 0.003 c 152 -55 m  152 0 l  123 0 l  123 -55 l  8 -55 l  8 -79 l 
119 -243 l  152 -243 l  152 -79 l  186 -79 l  186 -55 l  152 -55 l  p
123 -208 m  122 -207 121 -204 118 -199 ct 115 -193 113 -190 111 -187 ct 49 -96 l 
39 -83 l  37 -79 l  123 -79 l  123 -208 l  p ef
367 -80 m  367 -54 359 -34 344 -19 ct 328 -4 307 3 280 3 ct 258 3 239 -2 226 -12 ct 
212 -22 203 -36 199 -55 ct 231 -58 l  237 -34 254 -22 281 -22 ct 298 -22 311 -27 320 -37 ct 
330 -47 334 -61 334 -79 ct 334 -94 330 -106 320 -116 ct 311 -125 298 -130 282 -130 ct 
273 -130 265 -129 258 -126 ct 251 -123 244 -119 237 -113 ct 206 -113 l  214 -243 l 
352 -243 l  352 -217 l  243 -217 l  238 -140 l  251 -150 268 -155 288 -155 ct 
312 -155 331 -148 345 -134 ct 359 -120 367 -102 367 -80 ct p ef
553 -122 m  553 -81 545 -50 531 -29 ct 517 -8 496 3 468 3 ct 440 3 419 -8 405 -29 ct 
391 -50 384 -81 384 -122 ct 384 -164 391 -195 404 -216 ct 418 -237 439 -247 469 -247 ct 
497 -247 519 -236 532 -215 ct 546 -194 553 -163 553 -122 ct p
521 -122 m  521 -157 517 -182 509 -198 ct 501 -214 487 -222 469 -222 ct 450 -222 436 -214 428 -199 ct 
419 -183 415 -158 415 -122 ct 415 -88 419 -62 428 -46 ct 436 -30 450 -22 468 -22 ct 
486 -22 500 -31 508 -47 ct 517 -63 521 -88 521 -122 ct p ef
588 0 m  588 -38 l  622 -38 l  622 0 l  588 0 l  p ef
844 -122 m  844 -81 836 -50 822 -29 ct 808 -8 787 3 759 3 ct 731 3 710 -8 696 -29 ct 
682 -50 675 -81 675 -122 ct 675 -164 682 -195 695 -216 ct 709 -237 730 -247 760 -247 ct 
788 -247 810 -236 823 -215 ct 837 -194 844 -163 844 -122 ct p
812 -122 m  812 -157 808 -182 800 -198 ct 792 -214 778 -222 760 -222 ct 741 -222 727 -214 719 -199 ct 
710 -183 706 -158 706 -122 ct 706 -88 710 -62 719 -46 ct 727 -30 741 -22 759 -22 ct 
777 -22 791 -31 799 -47 ct 808 -63 812 -88 812 -122 ct p ef
1030 -122 m  1030 -81 1022 -50 1008 -29 ct 994 -8 973 3 945 3 ct 917 3 896 -8 882 -29 ct 
868 -50 861 -81 861 -122 ct 861 -164 868 -195 881 -216 ct 895 -237 916 -247 946 -247 ct 
974 -247 996 -236 1009 -215 ct 1023 -194 1030 -163 1030 -122 ct p
998 -122 m  998 -157 994 -182 986 -198 ct 978 -214 964 -222 946 -222 ct 927 -222 913 -214 905 -199 ct 
896 -183 892 -158 892 -122 ct 892 -88 896 -62 905 -46 ct 913 -30 927 -22 945 -22 ct 
963 -22 977 -31 985 -47 ct 994 -63 998 -88 998 -122 ct p ef
pom
gr
gs
tm setmatrix
-12.99911 -12.9977 t 
0.99993 0.99982 s 
pum
849 781 t
0.003 0.003 0.003 c 182 -80 m  182 -54 174 -34 159 -19 ct 143 -4 122 3 95 3 ct 73 3 54 -2 41 -12 ct 
27 -22 18 -36 14 -55 ct 46 -58 l  52 -34 69 -22 96 -22 ct 113 -22 126 -27 135 -37 ct 
145 -47 149 -61 149 -79 ct 149 -94 145 -106 135 -116 ct 126 -125 113 -130 97 -130 ct 
88 -130 80 -129 73 -126 ct 66 -123 59 -119 52 -113 ct 21 -113 l  29 -243 l  167 -243 l 
167 -217 l  58 -217 l  53 -140 l  66 -150 83 -155 103 -155 ct 127 -155 146 -148 160 -134 ct 
174 -120 182 -102 182 -80 ct p ef
368 -122 m  368 -81 360 -50 346 -29 ct 332 -8 311 3 283 3 ct 255 3 234 -8 220 -29 ct 
206 -50 199 -81 199 -122 ct 199 -164 206 -195 219 -216 ct 233 -237 254 -247 284 -247 ct 
312 -247 334 -236 347 -215 ct 361 -194 368 -163 368 -122 ct p
336 -122 m  336 -157 332 -182 324 -198 ct 316 -214 302 -222 284 -222 ct 265 -222 251 -214 243 -199 ct 
234 -183 230 -158 230 -122 ct 230 -88 234 -62 243 -46 ct 251 -30 265 -22 283 -22 ct 
301 -22 315 -31 323 -47 ct 332 -63 336 -88 336 -122 ct p ef
553 -122 m  553 -81 545 -50 531 -29 ct 517 -8 496 3 468 3 ct 440 3 419 -8 405 -29 ct 
391 -50 384 -81 384 -122 ct 384 -164 391 -195 404 -216 ct 418 -237 439 -247 469 -247 ct 
497 -247 519 -236 532 -215 ct 546 -194 553 -163 553 -122 ct p
521 -122 m  521 -157 517 -182 509 -198 ct 501 -214 487 -222 469 -222 ct 450 -222 436 -214 428 -199 ct 
419 -183 415 -158 415 -122 ct 415 -88 419 -62 428 -46 ct 436 -30 450 -22 468 -22 ct 
486 -22 500 -31 508 -47 ct 517 -63 521 -88 521 -122 ct p ef
588 0 m  588 -38 l  622 -38 l  622 0 l  588 0 l  p ef
844 -122 m  844 -81 836 -50 822 -29 ct 808 -8 787 3 759 3 ct 731 3 710 -8 696 -29 ct 
682 -50 675 -81 675 -122 ct 675 -164 682 -195 695 -216 ct 709 -237 730 -247 760 -247 ct 
788 -247 810 -236 823 -215 ct 837 -194 844 -163 844 -122 ct p
812 -122 m  812 -157 808 -182 800 -198 ct 792 -214 778 -222 760 -222 ct 741 -222 727 -214 719 -199 ct 
710 -183 706 -158 706 -122 ct 706 -88 710 -62 719 -46 ct 727 -30 741 -22 759 -22 ct 
777 -22 791 -31 799 -47 ct 808 -63 812 -88 812 -122 ct p ef
1030 -122 m  1030 -81 1022 -50 1008 -29 ct 994 -8 973 3 945 3 ct 917 3 896 -8 882 -29 ct 
868 -50 861 -81 861 -122 ct 861 -164 868 -195 881 -216 ct 895 -237 916 -247 946 -247 ct 
974 -247 996 -236 1009 -215 ct 1023 -194 1030 -163 1030 -122 ct p
998 -122 m  998 -157 994 -182 986 -198 ct 978 -214 964 -222 946 -222 ct 927 -222 913 -214 905 -199 ct 
896 -183 892 -158 892 -122 ct 892 -88 896 -62 905 -46 ct 913 -30 927 -22 945 -22 ct 
963 -22 977 -31 985 -47 ct 994 -63 998 -88 998 -122 ct p ef
pom
gr
gs
1.000 1.000 1.000 c 6035 35871 m  4249 35871 l  4249 34255 l  7821 34255 l 
7821 35871 l  6035 35871 l  p ef
gr
gs
0 lw 1 lj 0.703 0.703 0.703 c 6035 35871 m  4249 35871 l  4249 34255 l 
7821 34255 l  7821 35871 l  6035 35871 l  pc
gr
gs
79.99452 lw 1 lj 0.496 0.003 0.132 c 4539 34594 m  5339 34594 l  ps
gr
gs
0.496 0.003 0.132 c 4833 34594 m  4939 34700 l  5044 34594 l  4939 34489 l 
4833 34594 l  p ef
gr
gs
0 lw 1 lj 0.496 0.003 0.132 c 4833 34594 m  4939 34700 l  5044 34594 l  4939 34489 l 
4833 34594 l  pc
gr
gs
79.99452 lw 1 lj 0.003 0.273 0.527 c 4539 35133 m  5339 35133 l  ps
gr
gs
0.003 0.273 0.527 c 4833 35028 m  4833 35239 l  5044 35028 l  5044 35239 l 
4833 35028 l  p ef
gr
gs
0 lw 1 lj 0.003 0.273 0.527 c 4833 35028 m  4833 35239 l  5044 35028 l  5044 35239 l 
4833 35028 l  pc
gr
gs
tm setmatrix
-12.99911 -12.9977 t 
0.99993 0.99982 s 
pum
3741 3905 t
0.003 0.003 0.003 c 95 -1 m  85 2 75 3 64 3 ct 39 3 27 -11 27 -39 ct 27 -164 l  5 -164 l 
5 -187 l  28 -187 l  37 -228 l  58 -228 l  58 -187 l  92 -187 l  92 -164 l 
58 -164 l  58 -46 l  58 -37 59 -31 62 -27 ct 65 -23 70 -22 78 -22 ct 82 -22 88 -22 95 -24 ct 
95 -1 l  p ef
288 -94 m  288 -61 280 -37 266 -21 ct 252 -5 231 3 203 3 ct 176 3 156 -5 142 -22 ct 
128 -38 121 -62 121 -94 ct 121 -158 149 -190 204 -190 ct 233 -190 254 -182 267 -167 ct 
281 -151 288 -127 288 -94 ct p
255 -94 m  255 -119 251 -138 243 -150 ct 236 -161 223 -167 205 -167 ct 187 -167 174 -161 166 -149 ct 
157 -137 153 -119 153 -94 ct 153 -69 157 -51 165 -38 ct 173 -26 186 -20 203 -20 ct 
222 -20 235 -26 243 -38 ct 251 -50 255 -68 255 -94 ct p ef
386 -1 m  376 2 366 3 355 3 ct 330 3 318 -11 318 -39 ct 318 -164 l  296 -164 l 
296 -187 l  319 -187 l  328 -228 l  349 -228 l  349 -187 l  383 -187 l 
383 -164 l  349 -164 l  349 -46 l  349 -37 350 -31 353 -27 ct 356 -23 361 -22 369 -22 ct 
373 -22 379 -22 386 -24 ct 386 -1 l  p ef
468 3 m  450 3 436 -2 426 -12 ct 417 -22 412 -35 412 -53 ct 412 -72 418 -87 431 -97 ct 
444 -107 464 -113 492 -114 ct 534 -114 l  534 -125 l  534 -140 531 -151 525 -157 ct 
518 -164 508 -167 494 -167 ct 480 -167 470 -165 464 -160 ct 458 -155 454 -148 453 -137 ct 
420 -140 l  426 -174 451 -191 495 -191 ct 519 -191 536 -185 548 -175 ct 560 -164 566 -148 566 -128 ct 
566 -48 l  566 -38 567 -31 569 -27 ct 572 -22 576 -20 583 -20 ct 586 -20 590 -20 593 -21 ct 
593 -2 l  586 0 578 1 569 1 ct 558 1 550 -2 544 -8 ct 539 -14 536 -23 535 -36 ct 
534 -36 l  526 -22 517 -12 507 -6 ct 496 0 483 3 468 3 ct p
475 -20 m  487 -20 497 -23 506 -28 ct 515 -33 522 -40 527 -49 ct 532 -58 534 -67 534 -77 ct 
534 -92 l  500 -92 l  486 -92 475 -91 467 -88 ct 460 -85 454 -81 450 -75 ct 
446 -69 444 -62 444 -52 ct 444 -42 447 -34 452 -29 ct 458 -23 465 -20 475 -20 ct 
p ef
606 0 m  606 -256 l  637 -256 l  637 0 l  606 0 l  p ef
791 0 m  791 -143 l  791 -156 791 -171 790 -187 ct 820 -187 l  821 -165 821 -153 821 -148 ct 
822 -148 l  827 -164 832 -175 839 -181 ct 845 -187 854 -190 866 -190 ct 870 -190 874 -189 879 -188 ct 
879 -160 l  875 -161 869 -162 862 -162 ct 849 -162 839 -156 833 -145 ct 826 -134 823 -118 823 -97 ct 
823 0 l  791 0 l  p ef
927 -187 m  927 -69 l  927 -56 928 -47 931 -40 ct 933 -33 937 -28 942 -25 ct 
948 -22 955 -21 966 -21 ct 981 -21 992 -26 1001 -36 ct 1010 -47 1014 -61 1014 -79 ct 
1014 -187 l  1045 -187 l  1045 -40 l  1045 -19 1045 -5 1046 0 ct 1017 0 l 
1016 -1 1016 -3 1016 -5 ct 1016 -8 1016 -11 1016 -14 ct 1016 -17 1015 -23 1015 -32 ct 
1015 -32 l  1008 -19 999 -10 990 -5 ct 981 0 969 3 955 3 ct 935 3 920 -2 910 -12 ct 
901 -22 896 -39 896 -63 ct 896 -187 l  927 -187 l  p ef
1200 0 m  1200 -118 l  1200 -131 1199 -140 1197 -147 ct 1194 -154 1190 -159 1185 -162 ct 
1180 -165 1172 -166 1162 -166 ct 1147 -166 1135 -161 1126 -151 ct 1118 -140 1114 -126 1114 -108 ct 
1114 0 l  1082 0 l  1082 -147 l  1082 -168 1082 -182 1081 -187 ct 1111 -187 l 
1111 -186 1111 -184 1111 -182 ct 1111 -179 1111 -176 1112 -173 ct 1112 -170 1112 -164 1112 -155 ct 
1113 -155 l  1120 -168 1128 -177 1137 -182 ct 1147 -187 1158 -190 1172 -190 ct 
1193 -190 1208 -185 1217 -175 ct 1227 -165 1231 -148 1231 -124 ct 1231 0 l  1200 0 l 
p ef
1339 -1 m  1329 2 1319 3 1308 3 ct 1283 3 1271 -11 1271 -39 ct 1271 -164 l  1249 -164 l 
1249 -187 l  1272 -187 l  1281 -228 l  1302 -228 l  1302 -187 l  1336 -187 l 
1336 -164 l  1302 -164 l  1302 -46 l  1302 -37 1303 -31 1306 -27 ct 1309 -23 1314 -22 1322 -22 ct 
1326 -22 1332 -22 1339 -24 ct 1339 -1 l  p ef
1373 -226 m  1373 -256 l  1404 -256 l  1404 -226 l  1373 -226 l  p
1373 0 m  1373 -187 l  1404 -187 l  1404 0 l  1373 0 l  p ef
1561 0 m  1561 -118 l  1561 -136 1559 -149 1554 -156 ct 1549 -163 1540 -166 1527 -166 ct 
1514 -166 1504 -161 1496 -151 ct 1488 -141 1484 -127 1484 -108 ct 1484 0 l  1453 0 l 
1453 -147 l  1453 -168 1453 -182 1452 -187 ct 1482 -187 l  1482 -186 1482 -184 1482 -182 ct 
1482 -179 1482 -176 1483 -173 ct 1483 -170 1483 -164 1483 -155 ct 1484 -155 l 
1490 -168 1498 -177 1507 -182 ct 1515 -187 1526 -190 1538 -190 ct 1552 -190 1563 -187 1572 -182 ct 
1580 -176 1586 -167 1589 -155 ct 1589 -155 l  1596 -167 1604 -176 1613 -182 ct 
1622 -187 1633 -190 1646 -190 ct 1665 -190 1678 -185 1687 -175 ct 1696 -164 1700 -148 1700 -124 ct 
1700 0 l  1669 0 l  1669 -118 l  1669 -136 1667 -149 1662 -156 ct 1657 -163 1648 -166 1635 -166 ct 
1621 -166 1611 -161 1603 -151 ct 1596 -141 1592 -127 1592 -108 ct 1592 0 l  1561 0 l 
p ef
1768 -87 m  1768 -66 1772 -49 1781 -38 ct 1790 -26 1803 -20 1820 -20 ct 1833 -20 1844 -23 1852 -28 ct 
1860 -34 1866 -41 1868 -49 ct 1896 -41 l  1885 -12 1859 3 1820 3 ct 1792 3 1771 -5 1757 -22 ct 
1742 -38 1735 -62 1735 -95 ct 1735 -125 1742 -149 1757 -165 ct 1771 -182 1792 -190 1818 -190 ct 
1873 -190 1901 -157 1901 -91 ct 1901 -87 l  1768 -87 l  p
1869 -111 m  1867 -130 1862 -145 1854 -154 ct 1845 -163 1833 -167 1818 -167 ct 
1803 -167 1791 -162 1782 -152 ct 1773 -142 1769 -128 1768 -111 ct 1869 -111 l 
p ef
pom
gr
gs
tm setmatrix
-12.99911 -12.9977 t 
0.99993 0.99982 s 
pum
3741 4444 t
0.003 0.003 0.003 c 182 -94 m  182 -61 174 -37 160 -21 ct 146 -5 125 3 97 3 ct 70 3 50 -5 36 -22 ct 
22 -38 15 -62 15 -94 ct 15 -158 43 -190 98 -190 ct 127 -190 148 -182 161 -167 ct 
175 -151 182 -127 182 -94 ct p
149 -94 m  149 -119 145 -138 137 -150 ct 130 -161 117 -167 99 -167 ct 81 -167 68 -161 60 -149 ct 
51 -137 47 -119 47 -94 ct 47 -69 51 -51 59 -38 ct 67 -26 80 -20 97 -20 ct 116 -20 129 -26 137 -38 ct 
145 -50 149 -68 149 -94 ct p ef
367 -94 m  367 -29 344 3 298 3 ct 269 3 250 -8 240 -29 ct 239 -29 l  240 -28 240 -19 240 0 ct 
240 73 l  209 73 l  209 -149 l  209 -168 208 -181 208 -187 ct 238 -187 l 
238 -186 238 -185 238 -182 ct 239 -179 239 -175 239 -169 ct 239 -163 239 -159 239 -157 ct 
240 -157 l  246 -168 253 -177 262 -182 ct 271 -187 283 -190 298 -190 ct 321 -190 338 -182 349 -167 ct 
361 -152 367 -127 367 -94 ct p
334 -94 m  334 -120 330 -138 323 -149 ct 316 -160 305 -166 290 -166 ct 278 -166 268 -163 261 -158 ct 
254 -153 249 -145 245 -134 ct 242 -123 240 -109 240 -91 ct 240 -67 244 -49 252 -37 ct 
259 -26 272 -20 290 -20 ct 305 -20 316 -26 323 -37 ct 330 -48 334 -67 334 -94 ct 
p ef
418 -87 m  418 -66 422 -49 431 -38 ct 440 -26 453 -20 470 -20 ct 483 -20 494 -23 502 -28 ct 
510 -34 516 -41 518 -49 ct 546 -41 l  535 -12 509 3 470 3 ct 442 3 421 -5 407 -22 ct 
392 -38 385 -62 385 -95 ct 385 -125 392 -149 407 -165 ct 421 -182 442 -190 468 -190 ct 
523 -190 551 -157 551 -91 ct 551 -87 l  418 -87 l  p
519 -111 m  517 -130 512 -145 504 -154 ct 495 -163 483 -167 468 -167 ct 453 -167 441 -162 432 -152 ct 
423 -142 419 -128 418 -111 ct 519 -111 l  p ef
698 0 m  698 -118 l  698 -131 697 -140 695 -147 ct 692 -154 688 -159 683 -162 ct 
678 -165 670 -166 660 -166 ct 645 -166 633 -161 624 -151 ct 616 -140 612 -126 612 -108 ct 
612 0 l  580 0 l  580 -147 l  580 -168 580 -182 579 -187 ct 609 -187 l  609 -186 609 -184 609 -182 ct 
609 -179 609 -176 610 -173 ct 610 -170 610 -164 610 -155 ct 611 -155 l  618 -168 626 -177 635 -182 ct 
645 -187 656 -190 670 -190 ct 691 -190 706 -185 715 -175 ct 725 -165 729 -148 729 -124 ct 
729 0 l  698 0 l  p ef
765 0 m  765 -143 l  765 -156 765 -171 764 -187 ct 794 -187 l  795 -165 795 -153 795 -148 ct 
796 -148 l  801 -164 806 -175 813 -181 ct 819 -187 828 -190 840 -190 ct 844 -190 848 -189 853 -188 ct 
853 -160 l  849 -161 843 -162 836 -162 ct 823 -162 813 -156 807 -145 ct 800 -134 797 -118 797 -97 ct 
797 0 l  765 0 l  p ef
1029 -94 m  1029 -61 1021 -37 1007 -21 ct 993 -5 972 3 944 3 ct 917 3 897 -5 883 -22 ct 
869 -38 862 -62 862 -94 ct 862 -158 890 -190 945 -190 ct 974 -190 995 -182 1008 -167 ct 
1022 -151 1029 -127 1029 -94 ct p
996 -94 m  996 -119 992 -138 984 -150 ct 977 -161 964 -167 946 -167 ct 928 -167 915 -161 907 -149 ct 
898 -137 894 -119 894 -94 ct 894 -69 898 -51 906 -38 ct 914 -26 927 -20 944 -20 ct 
963 -20 976 -26 984 -38 ct 992 -50 996 -68 996 -94 ct p ef
1103 3 m  1085 3 1071 -2 1061 -12 ct 1052 -22 1047 -35 1047 -53 ct 1047 -72 1053 -87 1066 -97 ct 
1079 -107 1099 -113 1127 -114 ct 1169 -114 l  1169 -125 l  1169 -140 1166 -151 1160 -157 ct 
1153 -164 1143 -167 1129 -167 ct 1115 -167 1105 -165 1099 -160 ct 1093 -155 1089 -148 1088 -137 ct 
1055 -140 l  1061 -174 1086 -191 1130 -191 ct 1154 -191 1171 -185 1183 -175 ct 
1195 -164 1201 -148 1201 -128 ct 1201 -48 l  1201 -38 1202 -31 1204 -27 ct 1207 -22 1211 -20 1218 -20 ct 
1221 -20 1225 -20 1228 -21 ct 1228 -2 l  1221 0 1213 1 1204 1 ct 1193 1 1185 -2 1179 -8 ct 
1174 -14 1171 -23 1170 -36 ct 1169 -36 l  1161 -22 1152 -12 1142 -6 ct 1131 0 1118 3 1103 3 ct 
p
1110 -20 m  1122 -20 1132 -23 1141 -28 ct 1150 -33 1157 -40 1162 -49 ct 1167 -58 1169 -67 1169 -77 ct 
1169 -92 l  1135 -92 l  1121 -92 1110 -91 1102 -88 ct 1095 -85 1089 -81 1085 -75 ct 
1081 -69 1079 -62 1079 -52 ct 1079 -42 1082 -34 1087 -29 ct 1093 -23 1100 -20 1110 -20 ct 
p ef
1359 -30 m  1353 -18 1345 -10 1336 -5 ct 1326 0 1314 3 1300 3 ct 1277 3 1260 -5 1248 -21 ct 
1237 -37 1232 -61 1232 -93 ct 1232 -158 1255 -190 1300 -190 ct 1315 -190 1326 -187 1336 -182 ct 
1345 -177 1353 -169 1359 -158 ct 1359 -158 l  1359 -179 l  1359 -256 l  1390 -256 l 
1390 -39 l  1390 -19 1390 -7 1391 0 ct 1361 0 l  1361 -2 1360 -7 1360 -13 ct 
1359 -20 1359 -26 1359 -30 ct 1359 -30 l  p
1264 -94 m  1264 -68 1268 -49 1275 -38 ct 1282 -27 1293 -21 1308 -21 ct 1326 -21 1339 -27 1347 -39 ct 
1355 -51 1359 -70 1359 -96 ct 1359 -120 1355 -138 1347 -150 ct 1339 -161 1326 -167 1309 -167 ct 
1293 -167 1282 -161 1275 -150 ct 1268 -138 1264 -120 1264 -94 ct p ef
1434 -151 m  1434 -187 l  1468 -187 l  1468 -151 l  1434 -151 l  p
1434 0 m  1434 -36 l  1468 -36 l  1468 0 l  1434 0 l  p ef
1756 -30 m  1750 -18 1742 -10 1733 -5 ct 1723 0 1711 3 1697 3 ct 1674 3 1657 -5 1645 -21 ct 
1634 -37 1629 -61 1629 -93 ct 1629 -158 1652 -190 1697 -190 ct 1712 -190 1723 -187 1733 -182 ct 
1742 -177 1750 -169 1756 -158 ct 1756 -158 l  1756 -179 l  1756 -256 l  1787 -256 l 
1787 -39 l  1787 -19 1787 -7 1788 0 ct 1758 0 l  1758 -2 1757 -7 1757 -13 ct 
1756 -20 1756 -26 1756 -30 ct 1756 -30 l  p
1661 -94 m  1661 -68 1665 -49 1672 -38 ct 1679 -27 1690 -21 1705 -21 ct 1723 -21 1736 -27 1744 -39 ct 
1752 -51 1756 -70 1756 -96 ct 1756 -120 1752 -138 1744 -150 ct 1736 -161 1723 -167 1706 -167 ct 
1690 -167 1679 -161 1672 -150 ct 1665 -138 1661 -120 1661 -94 ct p ef
1847 -87 m  1847 -66 1851 -49 1860 -38 ct 1869 -26 1882 -20 1899 -20 ct 1912 -20 1923 -23 1931 -28 ct 
1939 -34 1945 -41 1947 -49 ct 1975 -41 l  1964 -12 1938 3 1899 3 ct 1871 3 1850 -5 1836 -22 ct 
1821 -38 1814 -62 1814 -95 ct 1814 -125 1821 -149 1836 -165 ct 1850 -182 1871 -190 1897 -190 ct 
1952 -190 1980 -157 1980 -91 ct 1980 -87 l  1847 -87 l  p
1948 -111 m  1946 -130 1941 -145 1933 -154 ct 1924 -163 1912 -167 1897 -167 ct 
1882 -167 1870 -162 1861 -152 ct 1852 -142 1848 -128 1847 -111 ct 1948 -111 l 
p ef
pom
gr
gs
tm setmatrix
-12.99911 -12.9977 t 
0.99993 0.99982 s 
pum
5725 4444 t
0.003 0.003 0.003 c 16 -80 m  16 -108 l  102 -108 l  102 -80 l  16 -80 l  p ef
pom
gr
gs
tm setmatrix
-12.99911 -12.9977 t 
0.99993 0.99982 s 
pum
3741 4841 t
0.003 0.003 0.003 c 95 -1 m  85 2 75 3 64 3 ct 39 3 27 -11 27 -39 ct 27 -164 l  5 -164 l 
5 -187 l  28 -187 l  37 -228 l  58 -228 l  58 -187 l  92 -187 l  92 -164 l 
58 -164 l  58 -46 l  58 -37 59 -31 62 -27 ct 65 -23 70 -22 78 -22 ct 82 -22 88 -22 95 -24 ct 
95 -1 l  p ef
177 3 m  159 3 145 -2 135 -12 ct 126 -22 121 -35 121 -53 ct 121 -72 127 -87 140 -97 ct 
153 -107 173 -113 201 -114 ct 243 -114 l  243 -125 l  243 -140 240 -151 234 -157 ct 
227 -164 217 -167 203 -167 ct 189 -167 179 -165 173 -160 ct 167 -155 163 -148 162 -137 ct 
129 -140 l  135 -174 160 -191 204 -191 ct 228 -191 245 -185 257 -175 ct 269 -164 275 -148 275 -128 ct 
275 -48 l  275 -38 276 -31 278 -27 ct 281 -22 285 -20 292 -20 ct 295 -20 299 -20 302 -21 ct 
302 -2 l  295 0 287 1 278 1 ct 267 1 259 -2 253 -8 ct 248 -14 245 -23 244 -36 ct 
243 -36 l  235 -22 226 -12 216 -6 ct 205 0 192 3 177 3 ct p
184 -20 m  196 -20 206 -23 215 -28 ct 224 -33 231 -40 236 -49 ct 241 -58 243 -67 243 -77 ct 
243 -92 l  209 -92 l  195 -92 184 -91 176 -88 ct 169 -85 163 -81 159 -75 ct 
155 -69 153 -62 153 -52 ct 153 -42 156 -34 161 -29 ct 167 -23 174 -20 184 -20 ct 
p ef
315 -226 m  315 -256 l  346 -256 l  346 -226 l  315 -226 l  p
315 0 m  315 -187 l  346 -187 l  346 0 l  315 0 l  p ef
394 0 m  394 -256 l  425 -256 l  425 0 l  394 0 l  p ef
498 -87 m  498 -66 502 -49 511 -38 ct 520 -26 533 -20 550 -20 ct 563 -20 574 -23 582 -28 ct 
590 -34 596 -41 598 -49 ct 626 -41 l  615 -12 589 3 550 3 ct 522 3 501 -5 487 -22 ct 
472 -38 465 -62 465 -95 ct 465 -125 472 -149 487 -165 ct 501 -182 522 -190 548 -190 ct 
603 -190 631 -157 631 -91 ct 631 -87 l  498 -87 l  p
599 -111 m  597 -130 592 -145 584 -154 ct 575 -163 563 -167 548 -167 ct 533 -167 521 -162 512 -152 ct 
503 -142 499 -128 498 -111 ct 599 -111 l  p ef
777 -30 m  771 -18 763 -10 754 -5 ct 744 0 732 3 718 3 ct 695 3 678 -5 666 -21 ct 
655 -37 650 -61 650 -93 ct 650 -158 673 -190 718 -190 ct 733 -190 744 -187 754 -182 ct 
763 -177 771 -169 777 -158 ct 777 -158 l  777 -179 l  777 -256 l  808 -256 l 
808 -39 l  808 -19 808 -7 809 0 ct 779 0 l  779 -2 778 -7 778 -13 ct 777 -20 777 -26 777 -30 ct 
777 -30 l  p
682 -94 m  682 -68 686 -49 693 -38 ct 700 -27 711 -21 726 -21 ct 744 -21 757 -27 765 -39 ct 
773 -51 777 -70 777 -96 ct 777 -120 773 -138 765 -150 ct 757 -161 744 -167 727 -167 ct 
711 -167 700 -161 693 -150 ct 686 -138 682 -120 682 -94 ct p ef
815 70 m  815 48 l  1020 48 l  1020 70 l  815 70 l  p ef
1029 0 m  1029 -143 l  1029 -156 1029 -171 1028 -187 ct 1058 -187 l  1059 -165 1059 -153 1059 -148 ct 
1060 -148 l  1065 -164 1070 -175 1077 -181 ct 1083 -187 1092 -190 1104 -190 ct 
1108 -190 1112 -189 1117 -188 ct 1117 -160 l  1113 -161 1107 -162 1100 -162 ct 
1087 -162 1077 -156 1071 -145 ct 1064 -134 1061 -118 1061 -97 ct 1061 0 l  1029 0 l 
p ef
1293 -94 m  1293 -61 1285 -37 1271 -21 ct 1257 -5 1236 3 1208 3 ct 1181 3 1161 -5 1147 -22 ct 
1133 -38 1126 -62 1126 -94 ct 1126 -158 1154 -190 1209 -190 ct 1238 -190 1259 -182 1272 -167 ct 
1286 -151 1293 -127 1293 -94 ct p
1260 -94 m  1260 -119 1256 -138 1248 -150 ct 1241 -161 1228 -167 1210 -167 ct 
1192 -167 1179 -161 1171 -149 ct 1162 -137 1158 -119 1158 -94 ct 1158 -69 1162 -51 1170 -38 ct 
1178 -26 1191 -20 1208 -20 ct 1227 -20 1240 -26 1248 -38 ct 1256 -50 1260 -68 1260 -94 ct 
p ef
1350 -187 m  1350 -69 l  1350 -56 1351 -47 1354 -40 ct 1356 -33 1360 -28 1365 -25 ct 
1371 -22 1378 -21 1389 -21 ct 1404 -21 1415 -26 1424 -36 ct 1433 -47 1437 -61 1437 -79 ct 
1437 -187 l  1468 -187 l  1468 -40 l  1468 -19 1468 -5 1469 0 ct 1440 0 l 
1439 -1 1439 -3 1439 -5 ct 1439 -8 1439 -11 1439 -14 ct 1439 -17 1438 -23 1438 -32 ct 
1438 -32 l  1431 -19 1422 -10 1413 -5 ct 1404 0 1392 3 1378 3 ct 1358 3 1343 -2 1333 -12 ct 
1324 -22 1319 -39 1319 -63 ct 1319 -187 l  1350 -187 l  p ef
1577 -1 m  1567 2 1557 3 1546 3 ct 1521 3 1509 -11 1509 -39 ct 1509 -164 l  1487 -164 l 
1487 -187 l  1510 -187 l  1519 -228 l  1540 -228 l  1540 -187 l  1574 -187 l 
1574 -164 l  1540 -164 l  1540 -46 l  1540 -37 1541 -31 1544 -27 ct 1547 -23 1552 -22 1560 -22 ct 
1564 -22 1570 -22 1577 -24 ct 1577 -1 l  p ef
1612 -226 m  1612 -256 l  1643 -256 l  1643 -226 l  1612 -226 l  p
1612 0 m  1612 -187 l  1643 -187 l  1643 0 l  1612 0 l  p ef
1809 0 m  1809 -118 l  1809 -131 1808 -140 1806 -147 ct 1803 -154 1799 -159 1794 -162 ct 
1789 -165 1781 -166 1771 -166 ct 1756 -166 1744 -161 1735 -151 ct 1727 -140 1723 -126 1723 -108 ct 
1723 0 l  1691 0 l  1691 -147 l  1691 -168 1691 -182 1690 -187 ct 1720 -187 l 
1720 -186 1720 -184 1720 -182 ct 1720 -179 1720 -176 1721 -173 ct 1721 -170 1721 -164 1721 -155 ct 
1722 -155 l  1729 -168 1737 -177 1746 -182 ct 1756 -187 1767 -190 1781 -190 ct 
1802 -190 1817 -185 1826 -175 ct 1836 -165 1840 -148 1840 -124 ct 1840 0 l  1809 0 l 
p ef
1946 73 m  1926 73 1910 69 1898 61 ct 1886 53 1878 42 1875 27 ct 1906 22 l  1908 31 1912 38 1919 42 ct 
1927 47 1936 49 1947 49 ct 1978 49 1994 31 1994 -5 ct 1994 -35 l  1993 -35 l 
1987 -23 1979 -14 1969 -8 ct 1959 -2 1947 1 1933 1 ct 1911 1 1894 -7 1883 -22 ct 
1872 -37 1867 -61 1867 -93 ct 1867 -126 1873 -151 1884 -166 ct 1896 -182 1913 -190 1937 -190 ct 
1950 -190 1961 -187 1971 -181 ct 1981 -175 1988 -166 1994 -155 ct 1994 -155 l 
1994 -159 1994 -165 1995 -173 ct 1995 -182 1996 -186 1996 -186 ct 2026 -186 l 
2025 -180 2025 -167 2025 -148 ct 2025 -5 l  2025 47 1999 73 1946 73 ct p
1994 -94 m  1994 -109 1992 -122 1987 -133 ct 1983 -144 1978 -152 1970 -158 ct 
1962 -164 1954 -167 1944 -167 ct 1929 -167 1917 -161 1910 -150 ct 1903 -138 1899 -120 1899 -94 ct 
1899 -68 1902 -50 1909 -39 ct 1916 -28 1927 -22 1944 -22 ct 1954 -22 1962 -25 1970 -31 ct 
1977 -36 1983 -45 1987 -55 ct 1992 -66 1994 -79 1994 -94 ct p ef
pom
gr
gs
tm setmatrix
-12.99911 -12.9977 t 
0.99993 0.99982 s 
pum
6120 11170 t
0.003 0.003 0.003 c 195 -153 m  195 -132 189 -116 175 -103 ct 162 -91 143 -85 120 -85 ct 
56 -85 l  56 0 l  26 0 l  26 -219 l  118 -219 l  143 -219 162 -213 175 -201 ct 
189 -190 195 -174 195 -153 ct p
166 -152 m  166 -181 149 -195 115 -195 ct 56 -195 l  56 -108 l  116 -108 l 
149 -108 166 -123 166 -152 ct p ef
233 -203 m  233 -230 l  261 -230 l  261 -203 l  233 -203 l  p
233 0 m  233 -168 l  261 -168 l  261 0 l  233 0 l  p ef
455 -85 m  455 -26 434 3 393 3 ct 367 3 349 -7 341 -26 ct 340 -26 l  340 -25 340 -17 340 0 ct 
340 66 l  312 66 l  312 -134 l  312 -151 312 -162 312 -168 ct 339 -168 l 
339 -168 339 -166 339 -164 ct 339 -161 339 -157 340 -152 ct 340 -147 340 -143 340 -141 ct 
341 -141 l  346 -151 352 -159 360 -164 ct 369 -169 379 -171 393 -171 ct 413 -171 429 -164 439 -150 ct 
449 -136 455 -115 455 -85 ct p
425 -84 m  425 -108 422 -124 416 -134 ct 409 -144 399 -149 386 -149 ct 374 -149 366 -147 360 -142 ct 
353 -138 349 -131 345 -121 ct 342 -111 340 -98 340 -82 ct 340 -60 344 -44 351 -33 ct 
358 -23 369 -18 385 -18 ct 399 -18 409 -23 416 -33 ct 422 -43 425 -60 425 -84 ct 
p ef
519 -78 m  519 -59 523 -44 531 -34 ct 539 -23 550 -18 566 -18 ct 578 -18 588 -20 595 -25 ct 
602 -30 607 -36 610 -44 ct 634 -37 l  624 -10 601 3 566 3 ct 541 3 522 -4 509 -19 ct 
496 -34 490 -56 490 -85 ct 490 -113 496 -134 509 -149 ct 522 -164 541 -171 565 -171 ct 
614 -171 639 -141 639 -82 ct 639 -78 l  519 -78 l  p
610 -99 m  608 -117 604 -130 596 -138 ct 589 -146 578 -150 564 -150 ct 551 -150 540 -146 532 -137 ct 
524 -128 520 -115 519 -99 ct 610 -99 l  p ef
682 1 m  682 -230 l  710 -230 l  710 1 l  682 1 l  p ef
762 -203 m  762 -230 l  790 -230 l  790 -203 l  762 -203 l  p
762 0 m  762 -168 l  790 -168 l  790 0 l  762 0 l  p ef
948 0 m  948 -106 l  948 -118 947 -126 945 -132 ct 943 -138 939 -143 934 -145 ct 
930 -148 923 -149 913 -149 ct 900 -149 889 -145 882 -136 ct 874 -126 870 -114 870 -97 ct 
870 0 l  842 0 l  842 -132 l  842 -152 842 -164 841 -168 ct 868 -168 l  868 -167 868 -166 868 -164 ct 
868 -161 868 -159 868 -156 ct 868 -153 869 -147 869 -139 ct 869 -139 l  876 -151 883 -159 892 -164 ct 
900 -169 910 -171 923 -171 ct 941 -171 955 -166 963 -157 ct 972 -148 976 -133 976 -112 ct 
976 0 l  948 0 l  p ef
1048 -78 m  1048 -59 1052 -44 1060 -34 ct 1068 -23 1079 -18 1095 -18 ct 1107 -18 1117 -20 1124 -25 ct 
1131 -30 1136 -36 1139 -44 ct 1163 -37 l  1153 -10 1130 3 1095 3 ct 1070 3 1051 -4 1038 -19 ct 
1025 -34 1019 -56 1019 -85 ct 1019 -113 1025 -134 1038 -149 ct 1051 -164 1070 -171 1094 -171 ct 
1143 -171 1168 -141 1168 -82 ct 1168 -78 l  1048 -78 l  p
1139 -99 m  1137 -117 1133 -130 1125 -138 ct 1118 -146 1107 -150 1093 -150 ct 
1080 -150 1069 -146 1061 -137 ct 1053 -128 1049 -115 1048 -99 ct 1139 -99 l 
p ef
1452 0 m  1420 0 l  1391 -119 l  1385 -145 l  1384 -140 1383 -134 1381 -125 ct 
1379 -116 1368 -75 1349 0 ct 1317 0 l  1270 -168 l  1297 -168 l  1326 -54 l 
1326 -51 1329 -41 1332 -23 ct 1335 -35 l  1370 -168 l  1400 -168 l  1429 -53 l 
1436 -23 l  1441 -45 l  1473 -168 l  1500 -168 l  1452 0 l  p ef
1529 -203 m  1529 -230 l  1557 -230 l  1557 -203 l  1529 -203 l  p
1529 0 m  1529 -168 l  1557 -168 l  1557 0 l  1529 0 l  p ef
1715 -27 m  1710 -16 1703 -8 1695 -3 ct 1686 1 1676 4 1663 4 ct 1642 4 1626 -4 1616 -18 ct 
1606 -32 1601 -54 1601 -83 ct 1601 -141 1622 -171 1663 -171 ct 1676 -171 1687 -168 1695 -164 ct 
1703 -159 1710 -152 1715 -141 ct 1716 -141 l  1715 -160 l  1715 -230 l  1743 -230 l 
1743 -34 l  1743 -17 1744 -5 1744 0 ct 1718 0 l  1717 -1 1717 -5 1717 -11 ct 
1716 -17 1716 -22 1716 -27 ct 1715 -27 l  p
1631 -84 m  1631 -60 1634 -43 1640 -33 ct 1646 -23 1656 -18 1670 -18 ct 1686 -18 1698 -23 1705 -34 ct 
1712 -45 1715 -62 1715 -86 ct 1715 -108 1712 -124 1705 -134 ct 1698 -145 1686 -150 1671 -150 ct 
1657 -150 1646 -145 1640 -134 ct 1634 -124 1631 -107 1631 -84 ct p ef
1859 -2 m  1850 1 1840 2 1831 2 ct 1808 2 1797 -11 1797 -36 ct 1797 -148 l  1778 -148 l 
1778 -168 l  1798 -168 l  1807 -206 l  1825 -206 l  1825 -168 l  1856 -168 l 
1856 -148 l  1825 -148 l  1825 -42 l  1825 -34 1826 -28 1829 -25 ct 1832 -22 1836 -20 1843 -20 ct 
1847 -20 1852 -21 1859 -22 ct 1859 -2 l  p ef
1901 -139 m  1907 -150 1914 -158 1923 -163 ct 1931 -168 1942 -171 1955 -171 ct 
1973 -171 1987 -166 1995 -157 ct 2004 -148 2008 -133 2008 -111 ct 2008 1 l  1980 1 l 
1980 -106 l  1980 -118 1979 -127 1977 -132 ct 1975 -138 1971 -142 1966 -145 ct 
1961 -148 1954 -149 1945 -149 ct 1932 -149 1922 -144 1914 -135 ct 1906 -126 1902 -114 1902 -99 ct 
1902 1 l  1874 1 l  1874 -230 l  1902 -230 l  1902 -170 l  1902 -164 1902 -157 1901 -150 ct 
1901 -144 1901 -140 1901 -139 ct 1901 -139 l  p ef
2140 66 m  2140 -230 l  2203 -230 l  2203 -210 l  2167 -210 l  2167 46 l 
2203 46 l  2203 66 l  2140 66 l  p ef
2210 -72 m  2210 -97 l  2288 -97 l  2288 -72 l  2210 -72 l  p ef
2304 66 m  2304 46 l  2341 46 l  2341 -210 l  2304 -210 l  2304 -230 l 
2368 -230 l  2368 66 l  2304 66 l  p ef
pom
gr
gs
tm setmatrix
-12.99911 -12.9977 t 
0.99993 0.99982 s 
pum
386 6391 t
90.0 r 0.003 0.003 0.003 c 181 0 m  124 -91 l  56 -91 l  56 0 l  26 0 l  26 -219 l 
129 -219 l  154 -219 173 -213 186 -202 ct 200 -191 206 -176 206 -156 ct 206 -140 201 -126 192 -115 ct 
183 -104 169 -97 153 -94 ct 215 0 l  181 0 l  p
176 -156 m  176 -169 172 -178 163 -185 ct 155 -192 142 -195 126 -195 ct 56 -195 l 
56 -114 l  127 -114 l  143 -114 155 -118 164 -125 ct 172 -133 176 -143 176 -156 ct 
p ef
287 -168 m  287 -62 l  287 -50 288 -42 290 -36 ct 292 -30 296 -25 300 -23 ct 
305 -20 312 -19 321 -19 ct 335 -19 345 -23 353 -32 ct 361 -42 365 -54 365 -71 ct 
365 -168 l  393 -168 l  393 -36 l  393 -16 393 -4 394 0 ct 367 0 l  367 -1 367 -2 367 -4 ct 
367 -7 367 -9 367 -12 ct 366 -15 366 -21 366 -29 ct 366 -29 l  359 -17 352 -9 343 -4 ct 
335 1 324 3 312 3 ct 293 3 280 -2 271 -11 ct 263 -20 259 -35 259 -56 ct 259 -168 l 
287 -168 l  p ef
551 0 m  551 -106 l  551 -118 550 -126 548 -132 ct 546 -138 542 -143 537 -145 ct 
533 -148 526 -149 516 -149 ct 503 -149 492 -145 485 -136 ct 477 -126 473 -114 473 -97 ct 
473 0 l  445 0 l  445 -132 l  445 -152 445 -164 444 -168 ct 471 -168 l  471 -167 471 -166 471 -164 ct 
471 -161 471 -159 471 -156 ct 471 -153 472 -147 472 -139 ct 472 -139 l  479 -151 486 -159 495 -164 ct 
503 -169 513 -171 526 -171 ct 544 -171 558 -166 566 -157 ct 575 -148 579 -133 579 -112 ct 
579 0 l  551 0 l  p ef
695 -2 m  686 1 676 2 667 2 ct 644 2 633 -11 633 -36 ct 633 -148 l  614 -148 l 
614 -168 l  634 -168 l  643 -206 l  661 -206 l  661 -168 l  692 -168 l 
692 -148 l  661 -148 l  661 -42 l  661 -34 662 -28 665 -25 ct 668 -22 672 -20 679 -20 ct 
683 -20 688 -21 695 -22 ct 695 -2 l  p ef
709 -203 m  709 -230 l  737 -230 l  737 -203 l  709 -203 l  p
709 0 m  709 -168 l  737 -168 l  737 0 l  709 0 l  p ef
886 0 m  886 -106 l  886 -123 884 -134 880 -140 ct 875 -146 867 -149 856 -149 ct 
844 -149 834 -145 827 -136 ct 820 -127 817 -114 817 -97 ct 817 0 l  789 0 l 
789 -132 l  789 -152 789 -164 788 -168 ct 815 -168 l  815 -167 815 -166 815 -164 ct 
815 -161 815 -159 815 -156 ct 815 -153 816 -147 816 -139 ct 816 -139 l  822 -151 829 -159 837 -164 ct 
845 -169 854 -171 865 -171 ct 878 -171 888 -168 895 -163 ct 903 -158 908 -150 911 -139 ct 
911 -139 l  917 -150 924 -159 932 -164 ct 941 -169 951 -171 962 -171 ct 979 -171 992 -166 999 -157 ct 
1007 -148 1011 -133 1011 -112 ct 1011 0 l  983 0 l  983 -106 l  983 -123 981 -134 977 -140 ct 
972 -146 964 -149 953 -149 ct 940 -149 931 -145 924 -136 ct 917 -127 914 -114 914 -97 ct 
914 0 l  886 0 l  p ef
1075 -78 m  1075 -59 1079 -44 1087 -34 ct 1095 -23 1106 -18 1122 -18 ct 1134 -18 1144 -20 1151 -25 ct 
1158 -30 1163 -36 1166 -44 ct 1190 -37 l  1180 -10 1157 3 1122 3 ct 1097 3 1078 -4 1065 -19 ct 
1052 -34 1046 -56 1046 -85 ct 1046 -113 1052 -134 1065 -149 ct 1078 -164 1097 -171 1121 -171 ct 
1170 -171 1195 -141 1195 -82 ct 1195 -78 l  1075 -78 l  p
1166 -99 m  1164 -117 1160 -130 1152 -138 ct 1145 -146 1134 -150 1120 -150 ct 
1107 -150 1096 -146 1088 -137 ct 1080 -128 1076 -115 1075 -99 ct 1166 -99 l 
p ef
1319 66 m  1319 -230 l  1382 -230 l  1382 -210 l  1346 -210 l  1346 46 l 
1382 46 l  1382 66 l  1319 66 l  p ef
1524 -47 m  1524 -31 1518 -19 1506 -10 ct 1494 -1 1477 3 1455 3 ct 1434 3 1418 0 1407 -7 ct 
1396 -14 1388 -25 1385 -40 ct 1410 -44 l  1412 -35 1417 -29 1424 -25 ct 1432 -20 1442 -18 1455 -18 ct 
1470 -18 1480 -20 1486 -25 ct 1493 -29 1496 -36 1496 -44 ct 1496 -51 1494 -56 1490 -61 ct 
1485 -65 1478 -68 1467 -71 ct 1447 -76 l  1431 -80 1420 -84 1413 -88 ct 1406 -92 1401 -97 1397 -103 ct 
1393 -109 1392 -116 1392 -124 ct 1392 -139 1397 -151 1408 -159 ct 1419 -167 1435 -171 1456 -171 ct 
1474 -171 1489 -168 1500 -161 ct 1511 -155 1518 -144 1521 -130 ct 1495 -127 l 
1494 -134 1490 -140 1483 -144 ct 1476 -148 1467 -150 1456 -150 ct 1443 -150 1434 -148 1428 -144 ct 
1422 -140 1419 -135 1419 -127 ct 1419 -122 1420 -118 1422 -115 ct 1425 -112 1429 -109 1433 -107 ct 
1438 -105 1449 -102 1464 -98 ct 1479 -94 1490 -91 1496 -88 ct 1503 -84 1508 -81 1512 -77 ct 
1515 -73 1518 -69 1520 -64 ct 1522 -59 1524 -53 1524 -47 ct p ef
1537 66 m  1537 46 l  1574 46 l  1574 -210 l  1537 -210 l  1537 -230 l 
1601 -230 l  1601 66 l  1537 66 l  p ef
pom
gr
0 11344 t 
pom
count op_count sub {pop} repeat countdictstack dict_count sub {end} repeat b4_inc_state restore
%%PageTrailer
%%Trailer
%%EOF
