<?xml version="1.0" encoding="UTF-8"?>
<!DOCTYPE svg PUBLIC "-//W3C//DTD SVG 1.1//EN" "http://www.w3.org/Graphics/SVG/1.1/DTD/svg11.dtd">
<svg version="1.2" width="215.9mm" height="279.4mm" viewBox="0 0 21590 27940" preserveAspectRatio="xMidYMid" fill-rule="evenodd" stroke-width="28.222" stroke-linejoin="round" xmlns="http://www.w3.org/2000/svg" xmlns:ooo="http://xml.openoffice.org/svg/export" xmlns:xlink="http://www.w3.org/1999/xlink" xmlns:presentation="http://sun.com/xmlns/staroffice/presentation" xmlns:smil="http://www.w3.org/2001/SMIL20/" xmlns:anim="urn:oasis:names:tc:opendocument:xmlns:animation:1.0" xml:space="preserve">
 <defs class="ClipPathGroup">
  <clipPath id="presentation_clip_path" clipPathUnits="userSpaceOnUse">
   <rect x="0" y="0" width="21590" height="27940"/>
  </clipPath>
  <clipPath id="presentation_clip_path_shrink" clipPathUnits="userSpaceOnUse">
   <rect x="21" y="27" width="21547" height="27885"/>
  </clipPath>
 </defs>
 <defs>
  <font id="EmbeddedFont_1" horiz-adv-x="2048">
   <font-face font-family="Arial embedded" units-per-em="2048" font-weight="normal" font-style="normal" ascent="1852" descent="423"/>
   <missing-glyph horiz-adv-x="2048" d="M 0,0 L 2047,0 2047,2047 0,2047 0,0 Z"/>
   <glyph unicode="÷" horiz-adv-x="1006" d="M 478,958 L 478,1141 646,1141 646,958 478,958 Z M 65,608 L 65,754 1060,754 1060,608 65,608 Z M 478,223 L 478,406 646,406 646,223 478,223 Z"/>
   <glyph unicode="u" horiz-adv-x="874" d="M 314,1082 L 314,396 C 314,325 321,269 335,230 349,191 371,162 402,145 433,128 478,119 537,119 624,119 692,149 742,208 792,267 817,350 817,455 L 817,1082 997,1082 997,231 C 997,105 999,28 1003,0 L 833,0 C 832,3 832,12 831,27 830,42 830,59 829,78 828,97 826,132 825,185 L 822,185 C 781,110 733,58 679,27 624,-4 557,-20 476,-20 357,-20 271,10 216,69 161,128 133,225 133,361 L 133,1082 314,1082 Z"/>
   <glyph unicode="t" horiz-adv-x="531" d="M 554,8 C 495,-8 434,-16 372,-16 228,-16 156,66 156,229 L 156,951 31,951 31,1082 163,1082 216,1324 336,1324 336,1082 536,1082 536,951 336,951 336,268 C 336,216 345,180 362,159 379,138 408,127 450,127 474,127 509,132 554,141 L 554,8 Z"/>
   <glyph unicode="s" horiz-adv-x="901" d="M 950,299 C 950,197 912,118 835,63 758,8 650,-20 511,-20 376,-20 273,2 200,47 127,91 79,160 57,254 L 216,285 C 231,227 263,185 311,158 359,131 426,117 511,117 602,117 669,131 712,159 754,187 775,229 775,285 775,328 760,362 731,389 702,416 654,438 589,455 L 460,489 C 357,516 283,542 240,568 196,593 162,624 137,661 112,698 100,743 100,796 100,895 135,970 206,1022 276,1073 378,1099 513,1099 632,1099 727,1078 798,1036 868,994 912,927 931,834 L 769,814 C 759,862 732,899 689,925 645,950 586,963 513,963 432,963 372,951 333,926 294,901 275,864 275,814 275,783 283,758 299,738 315,718 339,701 370,687 401,673 467,654 568,629 663,605 732,583 774,563 816,542 849,520 874,495 898,470 917,442 930,410 943,377 950,340 950,299 Z"/>
   <glyph unicode="r" horiz-adv-x="530" d="M 142,0 L 142,830 C 142,906 140,990 136,1082 L 306,1082 C 311,959 314,886 314,861 L 318,861 C 347,954 380,1017 417,1051 454,1085 507,1102 575,1102 599,1102 623,1099 648,1092 L 648,927 C 624,934 592,937 552,937 477,937 420,905 381,841 342,776 322,684 322,564 L 322,0 142,0 Z"/>
   <glyph unicode="o" horiz-adv-x="980" d="M 1053,542 C 1053,353 1011,212 928,119 845,26 724,-20 565,-20 407,-20 288,28 207,125 126,221 86,360 86,542 86,915 248,1102 571,1102 736,1102 858,1057 936,966 1014,875 1053,733 1053,542 Z M 864,542 C 864,691 842,800 798,868 753,935 679,969 574,969 469,969 393,935 346,866 299,797 275,689 275,542 275,399 298,292 345,221 391,149 464,113 563,113 671,113 748,148 795,217 841,286 864,395 864,542 Z"/>
   <glyph unicode="n" horiz-adv-x="874" d="M 825,0 L 825,686 C 825,757 818,813 804,852 790,891 768,920 737,937 706,954 661,963 602,963 515,963 447,933 397,874 347,815 322,732 322,627 L 322,0 142,0 142,851 C 142,977 140,1054 136,1082 L 306,1082 C 307,1079 307,1070 308,1055 309,1040 310,1024 311,1005 312,986 313,950 314,897 L 317,897 C 358,972 406,1025 461,1056 515,1087 582,1102 663,1102 782,1102 869,1073 924,1014 979,955 1006,857 1006,721 L 1006,0 825,0 Z"/>
   <glyph unicode="l" horiz-adv-x="187" d="M 138,0 L 138,1484 318,1484 318,0 138,0 Z"/>
   <glyph unicode="i" horiz-adv-x="187" d="M 137,1312 L 137,1484 317,1484 317,1312 137,1312 Z M 137,0 L 137,1082 317,1082 317,0 137,0 Z"/>
   <glyph unicode="g" horiz-adv-x="927" d="M 548,-425 C 430,-425 336,-402 266,-356 196,-309 151,-243 131,-158 L 312,-132 C 324,-182 351,-220 392,-248 433,-274 486,-288 553,-288 732,-288 822,-183 822,27 L 822,201 820,201 C 786,132 739,80 680,45 621,10 551,-8 472,-8 339,-8 242,36 180,124 117,212 86,350 86,539 86,730 120,872 187,963 254,1054 355,1099 492,1099 569,1099 635,1082 692,1047 748,1012 791,962 822,897 L 824,897 C 824,917 825,952 828,1001 831,1050 833,1077 836,1082 L 1007,1082 C 1003,1046 1001,971 1001,858 L 1001,31 C 1001,-273 850,-425 548,-425 Z M 822,541 C 822,629 810,705 786,769 762,832 728,881 685,915 641,948 591,965 536,965 444,965 377,932 335,865 293,798 272,690 272,541 272,393 292,287 331,222 370,157 438,125 533,125 590,125 640,142 684,175 728,208 762,256 786,319 810,381 822,455 822,541 Z"/>
   <glyph unicode="a" horiz-adv-x="1060" d="M 414,-20 C 305,-20 224,9 169,66 114,123 87,202 87,302 87,414 124,500 198,560 271,620 390,652 554,656 L 797,660 797,719 C 797,807 778,870 741,908 704,946 645,965 565,965 484,965 426,951 389,924 352,897 330,853 323,793 L 135,810 C 166,1005 310,1102 569,1102 705,1102 807,1071 876,1009 945,946 979,856 979,738 L 979,272 C 979,219 986,179 1000,152 1014,125 1041,111 1080,111 1097,111 1117,113 1139,118 L 1139,6 C 1094,-5 1047,-10 1000,-10 933,-10 885,8 855,43 824,78 807,132 803,207 L 797,207 C 751,124 698,66 637,32 576,-3 501,-20 414,-20 Z M 455,115 C 521,115 580,130 631,160 682,190 723,231 753,284 782,336 797,390 797,445 L 797,534 600,530 C 515,529 451,520 408,504 364,488 330,463 307,430 284,397 272,353 272,299 272,240 288,195 320,163 351,131 396,115 455,115 Z"/>
   <glyph unicode="V" horiz-adv-x="1377" d="M 782,0 L 584,0 9,1409 210,1409 600,417 684,168 768,417 1156,1409 1357,1409 782,0 Z"/>
   <glyph unicode="T" horiz-adv-x="1192" d="M 720,1253 L 720,0 530,0 530,1253 46,1253 46,1409 1204,1409 1204,1253 720,1253 Z"/>
   <glyph unicode="S" horiz-adv-x="1192" d="M 1272,389 C 1272,259 1221,158 1120,87 1018,16 875,-20 690,-20 347,-20 148,99 93,338 L 278,375 C 299,290 345,228 414,189 483,149 578,129 697,129 820,129 916,150 983,193 1050,235 1083,297 1083,379 1083,425 1073,462 1052,491 1031,520 1001,543 963,562 925,581 880,596 827,609 774,622 716,635 652,650 541,675 456,699 399,724 341,749 295,776 262,807 229,837 203,872 186,913 168,954 159,1000 159,1053 159,1174 205,1267 298,1332 390,1397 522,1430 694,1430 854,1430 976,1406 1061,1357 1146,1308 1205,1224 1239,1106 L 1051,1073 C 1030,1148 991,1202 933,1236 875,1269 795,1286 692,1286 579,1286 493,1267 434,1230 375,1193 345,1137 345,1063 345,1020 357,984 380,956 403,927 436,903 479,884 522,864 609,840 738,811 781,801 825,791 868,781 911,770 952,758 991,744 1030,729 1067,712 1102,693 1136,674 1166,650 1191,622 1216,594 1236,561 1251,523 1265,485 1272,440 1272,389 Z"/>
   <glyph unicode="R" horiz-adv-x="1244" d="M 1164,0 L 798,585 359,585 359,0 168,0 168,1409 831,1409 C 990,1409 1112,1374 1199,1303 1285,1232 1328,1133 1328,1006 1328,901 1298,813 1237,742 1176,671 1091,626 984,607 L 1384,0 1164,0 Z M 1136,1004 C 1136,1086 1108,1149 1053,1192 997,1235 917,1256 812,1256 L 359,1256 359,736 820,736 C 921,736 999,760 1054,807 1109,854 1136,919 1136,1004 Z"/>
   <glyph unicode="P" horiz-adv-x="1112" d="M 1258,985 C 1258,852 1215,746 1128,667 1041,588 922,549 773,549 L 359,549 359,0 168,0 168,1409 761,1409 C 919,1409 1041,1372 1128,1298 1215,1224 1258,1120 1258,985 Z M 1066,983 C 1066,1165 957,1256 738,1256 L 359,1256 359,700 746,700 C 959,700 1066,794 1066,983 Z"/>
   <glyph unicode="N" horiz-adv-x="1165" d="M 1082,0 L 328,1200 333,1103 338,936 338,0 168,0 168,1409 390,1409 1152,201 C 1144,332 1140,426 1140,485 L 1140,1409 1312,1409 1312,0 1082,0 Z"/>
   <glyph unicode="M" horiz-adv-x="1377" d="M 1366,0 L 1366,940 C 1366,1044 1369,1144 1375,1240 1342,1121 1313,1027 1287,960 L 923,0 789,0 420,960 364,1130 331,1240 334,1129 338,940 338,0 168,0 168,1409 419,1409 794,432 C 807,393 820,351 833,306 845,261 853,228 857,208 862,235 874,275 891,330 908,384 919,418 925,432 L 1293,1409 1538,1409 1538,0 1366,0 Z"/>
   <glyph unicode="L" horiz-adv-x="927" d="M 168,0 L 168,1409 359,1409 359,156 1071,156 1071,0 168,0 Z"/>
   <glyph unicode="I" horiz-adv-x="213" d="M 189,0 L 189,1409 380,1409 380,0 189,0 Z"/>
   <glyph unicode="F" horiz-adv-x="1006" d="M 359,1253 L 359,729 1145,729 1145,571 359,571 359,0 168,0 168,1409 1169,1409 1169,1253 359,1253 Z"/>
   <glyph unicode="C" horiz-adv-x="1324" d="M 792,1274 C 636,1274 515,1224 428,1124 341,1023 298,886 298,711 298,538 343,400 434,295 524,190 646,137 800,137 997,137 1146,235 1245,430 L 1401,352 C 1343,231 1262,138 1157,75 1052,12 930,-20 791,-20 649,-20 526,10 423,69 319,128 240,212 186,322 131,431 104,561 104,711 104,936 165,1112 286,1239 407,1366 575,1430 790,1430 940,1430 1065,1401 1166,1342 1267,1283 1341,1196 1388,1081 L 1207,1021 C 1174,1103 1122,1166 1050,1209 977,1252 891,1274 792,1274 Z"/>
   <glyph unicode="A" horiz-adv-x="1377" d="M 1167,0 L 1006,412 364,412 202,0 4,0 579,1409 796,1409 1362,0 1167,0 Z M 685,1265 L 676,1237 C 659,1182 635,1111 602,1024 L 422,561 949,561 768,1026 C 749,1072 731,1124 712,1182 L 685,1265 Z"/>
   <glyph unicode="2" horiz-adv-x="954" d="M 103,0 L 103,127 C 137,205 179,274 228,334 277,393 328,447 382,496 436,544 490,589 543,630 596,671 643,713 686,754 729,795 763,839 790,884 816,929 829,981 829,1038 829,1115 806,1175 761,1218 716,1261 653,1282 572,1282 495,1282 432,1261 383,1220 333,1178 304,1119 295,1044 L 111,1061 C 124,1174 172,1263 255,1330 337,1397 443,1430 572,1430 714,1430 823,1397 900,1330 976,1263 1014,1167 1014,1044 1014,989 1002,935 977,881 952,827 914,773 865,719 816,665 721,581 582,468 505,405 444,349 399,299 354,248 321,200 301,153 L 1036,153 1036,0 103,0 Z"/>
   <glyph unicode="/" horiz-adv-x="583" d="M 0,-20 L 411,1484 569,1484 162,-20 0,-20 Z"/>
   <glyph unicode=" " horiz-adv-x="556"/>
  </font>
 </defs>
 <defs>
  <font id="EmbeddedFont_2" horiz-adv-x="2048">
   <font-face font-family="Arial embedded" units-per-em="2048" font-weight="bold" font-style="normal" ascent="1852" descent="423"/>
   <missing-glyph horiz-adv-x="2048" d="M 0,0 L 2047,0 2047,2047 0,2047 0,0 Z"/>
   <glyph unicode="i" horiz-adv-x="292" d="M 143,1277 L 143,1484 424,1484 424,1277 143,1277 Z M 143,0 L 143,1082 424,1082 424,0 143,0 Z"/>
   <glyph unicode="S" horiz-adv-x="1244" d="M 1286,406 C 1286,268 1235,163 1133,90 1030,17 880,-20 682,-20 501,-20 360,12 257,76 154,140 88,237 59,367 L 344,414 C 363,339 401,285 457,252 513,218 591,201 690,201 896,201 999,264 999,389 999,429 987,462 964,488 940,514 907,536 864,553 821,570 738,591 616,616 511,641 437,661 396,676 355,691 317,708 284,729 251,749 222,773 199,802 176,831 158,864 145,903 132,942 125,986 125,1036 125,1163 173,1261 269,1329 364,1396 503,1430 686,1430 861,1430 992,1403 1080,1348 1167,1293 1224,1203 1249,1077 L 963,1038 C 948,1099 919,1144 874,1175 829,1206 764,1221 680,1221 501,1221 412,1165 412,1053 412,1016 422,986 441,963 460,940 488,920 525,904 562,887 638,867 752,842 887,813 984,787 1043,763 1101,738 1147,710 1181,678 1215,645 1241,607 1259,562 1277,517 1286,465 1286,406 Z"/>
   <glyph unicode="5" horiz-adv-x="1033" d="M 1082,469 C 1082,320 1036,201 943,113 850,24 722,-20 560,-20 419,-20 306,12 221,76 136,139 83,231 63,352 L 344,375 C 359,315 385,271 422,244 459,217 506,203 563,203 633,203 689,225 731,270 772,315 793,379 793,463 793,537 773,596 734,641 695,685 640,707 569,707 491,707 427,677 378,616 L 104,616 153,1409 1000,1409 1000,1200 408,1200 385,844 C 453,904 538,934 640,934 774,934 881,892 962,809 1042,726 1082,612 1082,469 Z"/>
   <glyph unicode="4" horiz-adv-x="1113" d="M 940,287 L 940,0 672,0 672,287 31,287 31,498 626,1409 940,1409 940,496 1128,496 1128,287 940,287 Z M 672,957 C 672,993 673,1032 676,1074 678,1116 680,1143 681,1155 664,1118 632,1064 587,993 L 260,496 672,496 672,957 Z"/>
   <glyph unicode="3" horiz-adv-x="1060" d="M 1065,391 C 1065,259 1022,157 935,85 848,13 725,-23 565,-23 414,-23 293,12 204,82 115,151 62,252 47,383 L 333,408 C 351,273 428,205 564,205 631,205 684,222 721,255 758,288 777,339 777,408 777,471 754,519 709,552 664,585 596,602 507,602 L 409,602 409,829 501,829 C 582,829 642,846 683,879 724,912 744,959 744,1020 744,1078 728,1124 696,1157 663,1190 616,1206 554,1206 496,1206 449,1190 414,1158 378,1126 357,1081 352,1022 L 71,1042 C 86,1163 136,1258 222,1327 308,1396 420,1430 559,1430 706,1430 822,1397 905,1331 988,1264 1029,1172 1029,1055 1029,967 1003,895 952,838 900,781 825,744 728,725 L 728,721 C 836,708 919,673 978,615 1036,556 1065,482 1065,391 Z"/>
   <glyph unicode="0" horiz-adv-x="980" d="M 1055,705 C 1055,467 1014,287 933,164 851,41 728,-20 565,-20 242,-20 81,222 81,705 81,874 99,1011 134,1118 169,1225 222,1303 293,1354 364,1405 457,1430 573,1430 740,1430 862,1370 939,1249 1016,1128 1055,947 1055,705 Z M 773,705 C 773,835 767,936 754,1008 741,1080 721,1132 693,1163 665,1194 624,1210 571,1210 514,1210 472,1194 443,1163 414,1131 393,1079 381,1008 368,936 362,835 362,705 362,576 369,476 382,404 395,331 415,279 444,248 472,217 513,201 567,201 620,201 662,218 691,251 720,284 741,336 754,409 767,482 773,580 773,705 Z"/>
  </font>
 </defs>
 <defs class="TextShapeIndex">
  <g ooo:slide="id1" ooo:id-list="id3 id4 id5 id6 id7 id8 id9 id10 id11 id12 id13 id14 id15 id16 id17 id18 id19 id20 id21 id22 id23 id24 id25 id26 id27 id28 id29 id30 id31 id32 id33 id34 id35 id36 id37 id38 id39 id40 id41 id42 id43 id44 id45 id46 id47 id48 id49 id50 id51 id52 id53 id54 id55 id56 id57 id58 id59 id60 id61 id62 id63"/>
 </defs>
 <defs class="EmbeddedBulletChars">
  <g id="bullet-char-template-57356" transform="scale(0.00048828125,-0.00048828125)">
   <path d="M 580,1141 L 1163,571 580,0 -4,571 580,1141 Z"/>
  </g>
  <g id="bullet-char-template-57354" transform="scale(0.00048828125,-0.00048828125)">
   <path d="M 8,1128 L 1137,1128 1137,0 8,0 8,1128 Z"/>
  </g>
  <g id="bullet-char-template-10146" transform="scale(0.00048828125,-0.00048828125)">
   <path d="M 174,0 L 602,739 174,1481 1456,739 174,0 Z M 1358,739 L 309,1346 659,739 1358,739 Z"/>
  </g>
  <g id="bullet-char-template-10132" transform="scale(0.00048828125,-0.00048828125)">
   <path d="M 2015,739 L 1276,0 717,0 1260,543 174,543 174,936 1260,936 717,1481 1274,1481 2015,739 Z"/>
  </g>
  <g id="bullet-char-template-10007" transform="scale(0.00048828125,-0.00048828125)">
   <path d="M 0,-2 C -7,14 -16,27 -25,37 L 356,567 C 262,823 215,952 215,954 215,979 228,992 255,992 264,992 276,990 289,987 310,991 331,999 354,1012 L 381,999 492,748 772,1049 836,1024 860,1049 C 881,1039 901,1025 922,1006 886,937 835,863 770,784 769,783 710,716 594,584 L 774,223 C 774,196 753,168 711,139 L 727,119 C 717,90 699,76 672,76 641,76 570,178 457,381 L 164,-76 C 142,-110 111,-127 72,-127 30,-127 9,-110 8,-76 1,-67 -2,-52 -2,-32 -2,-23 -1,-13 0,-2 Z"/>
  </g>
  <g id="bullet-char-template-10004" transform="scale(0.00048828125,-0.00048828125)">
   <path d="M 285,-33 C 182,-33 111,30 74,156 52,228 41,333 41,471 41,549 55,616 82,672 116,743 169,778 240,778 293,778 328,747 346,684 L 369,508 C 377,444 397,411 428,410 L 1163,1116 C 1174,1127 1196,1133 1229,1133 1271,1133 1292,1118 1292,1087 L 1292,965 C 1292,929 1282,901 1262,881 L 442,47 C 390,-6 338,-33 285,-33 Z"/>
  </g>
  <g id="bullet-char-template-9679" transform="scale(0.00048828125,-0.00048828125)">
   <path d="M 813,0 C 632,0 489,54 383,161 276,268 223,411 223,592 223,773 276,916 383,1023 489,1130 632,1184 813,1184 992,1184 1136,1130 1245,1023 1353,916 1407,772 1407,592 1407,412 1353,268 1245,161 1136,54 992,0 813,0 Z"/>
  </g>
  <g id="bullet-char-template-8226" transform="scale(0.00048828125,-0.00048828125)">
   <path d="M 346,457 C 273,457 209,483 155,535 101,586 74,649 74,723 74,796 101,859 155,911 209,963 273,989 346,989 419,989 480,963 531,910 582,859 608,796 608,723 608,648 583,586 532,535 482,483 420,457 346,457 Z"/>
  </g>
  <g id="bullet-char-template-8211" transform="scale(0.00048828125,-0.00048828125)">
   <path d="M -4,459 L 1135,459 1135,606 -4,606 -4,459 Z"/>
  </g>
  <g id="bullet-char-template-61548" transform="scale(0.00048828125,-0.00048828125)">
   <path d="M 173,740 C 173,903 231,1043 346,1159 462,1274 601,1332 765,1332 928,1332 1067,1274 1183,1159 1299,1043 1357,903 1357,740 1357,577 1299,437 1183,322 1067,206 928,148 765,148 601,148 462,206 346,322 231,437 173,577 173,740 Z"/>
  </g>
 </defs>
 <g>
  <g id="id2" class="Master_Slide">
   <g id="bg-id2" class="Background"/>
   <g id="bo-id2" class="BackgroundObjects"/>
  </g>
 </g>
 <g class="SlideGroup">
  <g>
   <g id="container-id1">
    <g id="id1" class="Slide" clip-path="url(#presentation_clip_path)">
     <g class="Page">
      <g class="com.sun.star.drawing.LineShape">
       <g id="id3">
        <rect class="BoundingBox" stroke="none" fill="none" x="6412" y="4091" width="820" height="27"/>
        <path fill="none" stroke="rgb(0,0,0)" stroke-width="25" stroke-linejoin="round" stroke-linecap="round" d="M 6425,4104 L 7218,4104"/>
       </g>
      </g>
      <g class="com.sun.star.drawing.LineShape">
       <g id="id4">
        <rect class="BoundingBox" stroke="none" fill="none" x="5199" y="2549" width="699" height="29"/>
        <path fill="none" stroke="rgb(0,0,0)" stroke-width="28" stroke-linejoin="round" stroke-linecap="round" d="M 5883,2563 L 5213,2563"/>
       </g>
      </g>
      <g class="com.sun.star.drawing.LineShape">
       <g id="id5">
        <rect class="BoundingBox" stroke="none" fill="none" x="7173" y="4450" width="4900" height="27"/>
        <path fill="none" stroke="rgb(0,0,0)" stroke-width="25" stroke-linejoin="round" stroke-linecap="round" d="M 12059,4463 L 7186,4463"/>
       </g>
      </g>
      <g class="com.sun.star.drawing.LineShape">
       <g id="id6">
        <rect class="BoundingBox" stroke="none" fill="none" x="7220" y="3904" width="4563" height="27"/>
        <path fill="none" stroke="rgb(0,0,0)" stroke-width="25" stroke-linejoin="round" stroke-linecap="round" d="M 7233,3917 L 11769,3917"/>
       </g>
      </g>
      <g class="com.sun.star.drawing.LineShape">
       <g id="id7">
        <rect class="BoundingBox" stroke="none" fill="none" x="7172" y="3369" width="4803" height="27"/>
        <path fill="none" stroke="rgb(0,0,0)" stroke-width="25" stroke-linejoin="round" stroke-linecap="round" d="M 7185,3382 L 11961,3382"/>
       </g>
      </g>
      <g class="com.sun.star.drawing.LineShape">
       <g id="id8">
        <rect class="BoundingBox" stroke="none" fill="none" x="7163" y="2820" width="4761" height="27"/>
        <path fill="none" stroke="rgb(0,0,0)" stroke-width="25" stroke-linejoin="round" stroke-linecap="round" d="M 11910,2833 L 7176,2833"/>
       </g>
      </g>
      <g class="com.sun.star.drawing.LineShape">
       <g id="id9">
        <rect class="BoundingBox" stroke="none" fill="none" x="11797" y="4350" width="332" height="27"/>
        <path fill="none" stroke="rgb(0,0,0)" stroke-width="25" stroke-linejoin="round" stroke-linecap="round" d="M 11810,4363 L 12115,4363"/>
       </g>
      </g>
      <g class="com.sun.star.drawing.LineShape">
       <g id="id10">
        <rect class="BoundingBox" stroke="none" fill="none" x="11797" y="3808" width="332" height="27"/>
        <path fill="none" stroke="rgb(0,0,0)" stroke-width="25" stroke-linejoin="round" stroke-linecap="round" d="M 11810,3821 L 12115,3821"/>
       </g>
      </g>
      <g class="com.sun.star.drawing.LineShape">
       <g id="id11">
        <rect class="BoundingBox" stroke="none" fill="none" x="11797" y="3268" width="332" height="27"/>
        <path fill="none" stroke="rgb(0,0,0)" stroke-width="25" stroke-linejoin="round" stroke-linecap="round" d="M 11810,3281 L 12115,3281"/>
       </g>
      </g>
      <g class="com.sun.star.drawing.ClosedBezierShape">
       <g id="id12">
        <rect class="BoundingBox" stroke="none" fill="none" x="11877" y="4527" width="128" height="122"/>
        <path fill="rgb(255,255,255)" stroke="none" d="M 11991,4588 C 11991,4614 11968,4635 11941,4635 11912,4635 11890,4614 11890,4588 11890,4561 11912,4540 11941,4540 11968,4540 11991,4561 11991,4588 Z"/>
        <path fill="none" stroke="rgb(0,0,0)" stroke-width="25" stroke-linejoin="miter" stroke-linecap="round" d="M 11991,4588 C 11991,4614 11968,4635 11941,4635 11912,4635 11890,4614 11890,4588 11890,4561 11912,4540 11941,4540 11968,4540 11991,4561 11991,4588 Z"/>
       </g>
      </g>
      <g class="com.sun.star.drawing.PolyPolygonShape">
       <g id="id13">
        <rect class="BoundingBox" stroke="none" fill="none" x="11700" y="4265" width="370" height="396"/>
        <path fill="rgb(255,255,255)" stroke="none" d="M 11713,4647 L 11713,4278 12056,4462 11713,4647 Z"/>
        <path fill="none" stroke="rgb(0,0,0)" stroke-width="25" stroke-linejoin="round" stroke-linecap="round" d="M 11713,4647 L 11713,4278 12056,4462 11713,4647 Z"/>
       </g>
      </g>
      <g class="com.sun.star.drawing.ClosedBezierShape">
       <g id="id14">
        <rect class="BoundingBox" stroke="none" fill="none" x="11877" y="3984" width="128" height="123"/>
        <path fill="rgb(255,255,255)" stroke="none" d="M 11991,4046 C 11991,4072 11968,4093 11941,4093 11912,4093 11890,4072 11890,4046 11890,4020 11912,3997 11941,3997 11968,3997 11991,4020 11991,4046 Z"/>
        <path fill="none" stroke="rgb(0,0,0)" stroke-width="25" stroke-linejoin="miter" stroke-linecap="round" d="M 11991,4046 C 11991,4072 11968,4093 11941,4093 11912,4093 11890,4072 11890,4046 11890,4020 11912,3997 11941,3997 11968,3997 11991,4020 11991,4046 Z"/>
       </g>
      </g>
      <g class="com.sun.star.drawing.PolyPolygonShape">
       <g id="id15">
        <rect class="BoundingBox" stroke="none" fill="none" x="11700" y="3722" width="370" height="396"/>
        <path fill="rgb(255,255,255)" stroke="none" d="M 11713,4104 L 11713,3735 12056,3920 11713,4104 Z"/>
        <path fill="none" stroke="rgb(0,0,0)" stroke-width="25" stroke-linejoin="round" stroke-linecap="round" d="M 11713,4104 L 11713,3735 12056,3920 11713,4104 Z"/>
       </g>
      </g>
      <g class="com.sun.star.drawing.LineShape">
       <g id="id16">
        <rect class="BoundingBox" stroke="none" fill="none" x="11982" y="3495" width="142" height="27"/>
        <path fill="none" stroke="rgb(0,0,0)" stroke-width="25" stroke-linejoin="round" stroke-linecap="round" d="M 11995,3508 L 12110,3508"/>
       </g>
      </g>
      <g class="com.sun.star.drawing.LineShape">
       <g id="id17">
        <rect class="BoundingBox" stroke="none" fill="none" x="11982" y="4577" width="142" height="27"/>
        <path fill="none" stroke="rgb(0,0,0)" stroke-width="25" stroke-linejoin="round" stroke-linecap="round" d="M 11995,4590 L 12110,4590"/>
       </g>
      </g>
      <g class="com.sun.star.drawing.LineShape">
       <g id="id18">
        <rect class="BoundingBox" stroke="none" fill="none" x="11982" y="4035" width="142" height="27"/>
        <path fill="none" stroke="rgb(0,0,0)" stroke-width="25" stroke-linejoin="round" stroke-linecap="round" d="M 11995,4048 L 12110,4048"/>
       </g>
      </g>
      <g class="com.sun.star.drawing.ClosedBezierShape">
       <g id="id19">
        <rect class="BoundingBox" stroke="none" fill="none" x="11877" y="3445" width="128" height="122"/>
        <path fill="rgb(255,255,255)" stroke="none" d="M 11991,3505 C 11991,3531 11968,3553 11941,3553 11912,3553 11890,3531 11890,3505 11890,3479 11912,3458 11941,3458 11968,3458 11991,3479 11991,3505 Z"/>
        <path fill="none" stroke="rgb(0,0,0)" stroke-width="25" stroke-linejoin="miter" stroke-linecap="round" d="M 11991,3505 C 11991,3531 11968,3553 11941,3553 11912,3553 11890,3531 11890,3505 11890,3479 11912,3458 11941,3458 11968,3458 11991,3479 11991,3505 Z"/>
       </g>
      </g>
      <g class="com.sun.star.drawing.PolyPolygonShape">
       <g id="id20">
        <rect class="BoundingBox" stroke="none" fill="none" x="11700" y="3183" width="370" height="396"/>
        <path fill="rgb(255,255,255)" stroke="none" d="M 11713,3565 L 11713,3196 12056,3380 11713,3565 Z"/>
        <path fill="none" stroke="rgb(0,0,0)" stroke-width="25" stroke-linejoin="round" stroke-linecap="round" d="M 11713,3565 L 11713,3196 12056,3380 11713,3565 Z"/>
       </g>
      </g>
      <g class="com.sun.star.drawing.LineShape">
       <g id="id21">
        <rect class="BoundingBox" stroke="none" fill="none" x="11797" y="2719" width="332" height="27"/>
        <path fill="none" stroke="rgb(0,0,0)" stroke-width="25" stroke-linejoin="round" stroke-linecap="round" d="M 11810,2732 L 12115,2732"/>
       </g>
      </g>
      <g class="com.sun.star.drawing.ClosedBezierShape">
       <g id="id22">
        <rect class="BoundingBox" stroke="none" fill="none" x="11877" y="2896" width="128" height="122"/>
        <path fill="rgb(255,255,255)" stroke="none" d="M 11991,2956 C 11991,2983 11968,3004 11941,3004 11912,3004 11890,2983 11890,2956 11890,2930 11912,2909 11941,2909 11968,2909 11991,2930 11991,2956 Z"/>
        <path fill="none" stroke="rgb(0,0,0)" stroke-width="25" stroke-linejoin="miter" stroke-linecap="round" d="M 11991,2956 C 11991,2983 11968,3004 11941,3004 11912,3004 11890,2983 11890,2956 11890,2930 11912,2909 11941,2909 11968,2909 11991,2930 11991,2956 Z"/>
       </g>
      </g>
      <g class="com.sun.star.drawing.PolyPolygonShape">
       <g id="id23">
        <rect class="BoundingBox" stroke="none" fill="none" x="11700" y="2633" width="370" height="397"/>
        <path fill="rgb(255,255,255)" stroke="none" d="M 11713,3016 L 11713,2646 12056,2831 11713,3016 Z"/>
        <path fill="none" stroke="rgb(0,0,0)" stroke-width="25" stroke-linejoin="round" stroke-linecap="round" d="M 11713,3016 L 11713,2646 12056,2831 11713,3016 Z"/>
       </g>
      </g>
      <g class="com.sun.star.drawing.LineShape">
       <g id="id24">
        <rect class="BoundingBox" stroke="none" fill="none" x="11982" y="2946" width="142" height="27"/>
        <path fill="none" stroke="rgb(0,0,0)" stroke-width="25" stroke-linejoin="round" stroke-linecap="round" d="M 11995,2959 L 12110,2959"/>
       </g>
      </g>
      <g class="TextShape">
       <g id="id25">
        <rect class="BoundingBox" stroke="none" fill="none" x="9081" y="5772" width="922" height="328"/>
        <text class="SVGTextShape"><tspan class="TextParagraph" font-family="Arial, sans-serif" font-size="293px" font-weight="700"><tspan class="TextPosition" x="9081" y="6034"><tspan fill="rgb(0,0,0)" stroke="none">Si5340</tspan></tspan></tspan></text>
       </g>
      </g>
      <g class="com.sun.star.drawing.ClosedBezierShape">
       <g id="id26">
        <rect class="BoundingBox" stroke="none" fill="none" x="3301" y="1953" width="8887" height="4776"/>
        <path fill="none" stroke="rgb(0,0,0)" stroke-width="25" stroke-linejoin="round" stroke-linecap="round" d="M 3314,6630 C 3314,6676 3367,6715 3432,6715 L 12055,6715 C 12121,6715 12174,6676 12174,6630 L 12174,2050 C 12174,2004 12121,1966 12055,1966 L 3432,1966 C 3367,1966 3314,2004 3314,2050 L 3314,6630 Z"/>
       </g>
      </g>
      <g class="com.sun.star.drawing.PolyLineShape">
       <g id="id27">
        <rect class="BoundingBox" stroke="none" fill="none" x="2922" y="5070" width="770" height="27"/>
        <path fill="none" stroke="rgb(0,0,0)" stroke-width="25" stroke-linejoin="round" stroke-linecap="round" d="M 3678,5083 L 3163,5083 3072,5083 2935,5083"/>
       </g>
      </g>
      <g class="com.sun.star.drawing.ClosedBezierShape">
       <g id="id28">
        <rect class="BoundingBox" stroke="none" fill="none" x="2791" y="5006" width="158" height="157"/>
        <path fill="rgb(0,0,0)" stroke="none" d="M 2948,5162 L 2791,5083 2947,5006 C 2923,5055 2923,5112 2947,5162 L 2948,5162 Z"/>
       </g>
      </g>
      <g class="com.sun.star.drawing.PolyLineShape">
       <g id="id29">
        <rect class="BoundingBox" stroke="none" fill="none" x="2908" y="5949" width="770" height="27"/>
        <path fill="none" stroke="rgb(0,0,0)" stroke-width="25" stroke-linejoin="round" stroke-linecap="round" d="M 3664,5962 L 3535,5962 3527,5962 3058,5962 2921,5962"/>
       </g>
      </g>
      <g class="com.sun.star.drawing.ClosedBezierShape">
       <g id="id30">
        <rect class="BoundingBox" stroke="none" fill="none" x="3521" y="5884" width="158" height="158"/>
        <path fill="rgb(0,0,0)" stroke="none" d="M 3521,5884 L 3678,5963 3522,6041 C 3546,5991 3546,5934 3522,5884 L 3521,5884 Z"/>
       </g>
      </g>
      <g class="com.sun.star.drawing.ClosedBezierShape">
       <g id="id31">
        <rect class="BoundingBox" stroke="none" fill="none" x="2777" y="5885" width="159" height="157"/>
        <path fill="rgb(0,0,0)" stroke="none" d="M 2934,6041 L 2777,5963 2933,5885 C 2909,5935 2909,5992 2933,6041 L 2934,6041 Z"/>
       </g>
      </g>
      <g class="com.sun.star.drawing.PolyPolygonShape">
       <g id="id32">
        <rect class="BoundingBox" stroke="none" fill="none" x="3665" y="5646" width="2394" height="646"/>
        <path fill="rgb(255,255,255)" stroke="none" d="M 3678,5659 L 6045,5659 6045,6278 3678,6278 3678,5659 Z"/>
        <path fill="none" stroke="rgb(0,0,0)" stroke-width="25" stroke-linejoin="round" stroke-linecap="round" d="M 3678,5659 L 6045,5659 6045,6278 3678,6278 3678,5659 Z"/>
       </g>
      </g>
      <g class="TextShape">
       <g id="id33">
        <rect class="BoundingBox" stroke="none" fill="none" x="1353" y="5783" width="1167" height="328"/>
        <text class="SVGTextShape"><tspan class="TextParagraph" font-family="Arial, sans-serif" font-size="293px" font-weight="400"><tspan class="TextPosition" x="1353" y="6045"><tspan fill="rgb(0,0,0)" stroke="none">I2C / SPI</tspan></tspan></tspan></text>
       </g>
      </g>
      <g class="com.sun.star.drawing.PolyPolygonShape">
       <g id="id34">
        <rect class="BoundingBox" stroke="none" fill="none" x="6027" y="5646" width="1140" height="650"/>
        <path fill="rgb(255,255,255)" stroke="none" d="M 6040,5659 L 7153,5659 7153,6282 6040,6282 6040,5659 Z"/>
        <path fill="none" stroke="rgb(0,0,0)" stroke-width="25" stroke-linejoin="round" stroke-linecap="round" d="M 6040,5659 L 7153,5659 7153,6282 6040,6282 6040,5659 Z"/>
       </g>
      </g>
      <g class="TextShape">
       <g id="id35">
        <rect class="BoundingBox" stroke="none" fill="none" x="4389" y="5791" width="939" height="328"/>
        <text class="SVGTextShape"><tspan class="TextParagraph" font-family="Arial, sans-serif" font-size="293px" font-weight="400"><tspan class="TextPosition" x="4389" y="6053"><tspan fill="rgb(0,0,0)" stroke="none">Control</tspan></tspan></tspan></text>
       </g>
      </g>
      <g class="TextShape">
       <g id="id36">
        <rect class="BoundingBox" stroke="none" fill="none" x="6260" y="5793" width="669" height="328"/>
        <text class="SVGTextShape"><tspan class="TextParagraph" font-family="Arial, sans-serif" font-size="293px" font-weight="400"><tspan class="TextPosition" x="6270" y="6055"><tspan fill="rgb(0,0,0)" stroke="none">NVM</tspan></tspan></tspan></text>
       </g>
      </g>
      <g class="com.sun.star.drawing.PolyPolygonShape">
       <g id="id37">
        <rect class="BoundingBox" stroke="none" fill="none" x="3693" y="4797" width="2355" height="643"/>
        <path fill="rgb(255,255,255)" stroke="none" d="M 3706,4810 L 6034,4810 6034,5426 3706,5426 3706,4810 Z"/>
        <path fill="none" stroke="rgb(0,0,0)" stroke-width="25" stroke-linejoin="round" stroke-linecap="round" d="M 3706,4810 L 6034,4810 6034,5426 3706,5426 3706,4810 Z"/>
       </g>
      </g>
      <g class="TextShape">
       <g id="id38">
        <rect class="BoundingBox" stroke="none" fill="none" x="1000" y="4920" width="1620" height="328"/>
        <text class="SVGTextShape"><tspan class="TextParagraph" font-family="Arial, sans-serif" font-size="293px" font-weight="400"><tspan class="TextPosition" x="1000" y="5182"><tspan fill="rgb(0,0,0)" stroke="none">Status Flags</tspan></tspan></tspan></text>
       </g>
      </g>
      <g class="TextShape">
       <g id="id39">
        <rect class="BoundingBox" stroke="none" fill="none" x="3924" y="4940" width="1884" height="328"/>
        <text class="SVGTextShape"><tspan class="TextParagraph" font-family="Arial, sans-serif" font-size="293px" font-weight="400"><tspan class="TextPosition" x="3924" y="5202"><tspan fill="rgb(0,0,0)" stroke="none">Status Monitor</tspan></tspan></tspan></text>
       </g>
      </g>
      <g class="com.sun.star.drawing.PolyPolygonShape">
       <g id="id40">
        <rect class="BoundingBox" stroke="none" fill="none" x="4285" y="1230" width="230" height="455"/>
        <path fill="rgb(255,255,255)" stroke="none" d="M 4501,1243 L 4501,1671 4298,1671 4298,1243 4501,1243 Z"/>
        <path fill="none" stroke="rgb(0,0,0)" stroke-width="25" stroke-linejoin="round" stroke-linecap="round" d="M 4501,1243 L 4501,1671 4298,1671 4298,1243 4501,1243 Z"/>
       </g>
      </g>
      <g class="com.sun.star.drawing.LineShape">
       <g id="id41">
        <rect class="BoundingBox" stroke="none" fill="none" x="4587" y="1194" width="27" height="526"/>
        <path fill="none" stroke="rgb(0,0,0)" stroke-width="25" stroke-linejoin="round" stroke-linecap="round" d="M 4600,1207 L 4600,1706"/>
       </g>
      </g>
      <g class="com.sun.star.drawing.LineShape">
       <g id="id42">
        <rect class="BoundingBox" stroke="none" fill="none" x="4184" y="1194" width="27" height="526"/>
        <path fill="none" stroke="rgb(0,0,0)" stroke-width="25" stroke-linejoin="round" stroke-linecap="round" d="M 4197,1207 L 4197,1706"/>
       </g>
      </g>
      <g class="com.sun.star.drawing.PolyLineShape">
       <g id="id43">
        <rect class="BoundingBox" stroke="none" fill="none" x="4624" y="1445" width="156" height="909"/>
        <path fill="none" stroke="rgb(0,0,0)" stroke-width="25" stroke-linejoin="round" stroke-linecap="round" d="M 4637,1458 L 4766,1458 4766,2340"/>
       </g>
      </g>
      <g class="com.sun.star.drawing.PolyLineShape">
       <g id="id44">
        <rect class="BoundingBox" stroke="none" fill="none" x="4020" y="1445" width="153" height="922"/>
        <path fill="none" stroke="rgb(0,0,0)" stroke-width="25" stroke-linejoin="round" stroke-linecap="round" d="M 4159,1458 L 4033,1458 4033,2353"/>
       </g>
      </g>
      <g class="com.sun.star.drawing.PolyPolygonShape">
       <g id="id45">
        <rect class="BoundingBox" stroke="none" fill="none" x="9764" y="2773" width="370" height="1733"/>
        <path fill="rgb(255,255,255)" stroke="none" d="M 9777,2786 L 10120,2786 10120,4492 9777,4492 9777,2786 Z"/>
        <path fill="none" stroke="rgb(0,0,0)" stroke-width="25" stroke-linejoin="round" stroke-linecap="round" d="M 9777,2786 L 10120,2786 10120,4492 9777,4492 9777,2786 Z"/>
       </g>
      </g>
      <g class="com.sun.star.drawing.LineShape">
       <g id="id46">
        <rect class="BoundingBox" stroke="none" fill="none" x="9764" y="2773" width="370" height="1733"/>
        <path fill="none" stroke="rgb(0,0,0)" stroke-width="25" stroke-linejoin="round" stroke-linecap="round" d="M 9777,2786 L 10120,4492"/>
       </g>
      </g>
      <g class="com.sun.star.drawing.LineShape">
       <g id="id47">
        <rect class="BoundingBox" stroke="none" fill="none" x="9764" y="2773" width="370" height="1733"/>
        <path fill="none" stroke="rgb(0,0,0)" stroke-width="25" stroke-linejoin="round" stroke-linecap="round" d="M 10120,2786 L 9777,4492"/>
       </g>
      </g>
      <g class="com.sun.star.drawing.PolyPolygonShape">
       <g id="id48">
        <rect class="BoundingBox" stroke="none" fill="none" x="10576" y="2677" width="704" height="317"/>
        <path fill="rgb(255,255,255)" stroke="none" d="M 10589,2690 L 11266,2690 11266,2980 10589,2980 10589,2690 Z"/>
        <path fill="none" stroke="rgb(0,0,0)" stroke-width="25" stroke-linejoin="round" stroke-linecap="round" d="M 10589,2690 L 11266,2690 11266,2980 10589,2980 10589,2690 Z"/>
       </g>
      </g>
      <g class="TextShape">
       <g id="id49">
        <rect class="BoundingBox" stroke="none" fill="none" x="10606" y="2657" width="634" height="328"/>
        <text class="SVGTextShape"><tspan class="TextParagraph" font-family="Arial, sans-serif" font-size="293px" font-weight="400"><tspan class="TextPosition" x="10606" y="2919"><tspan fill="rgb(0,0,0)" stroke="none">÷INT</tspan></tspan></tspan></text>
       </g>
      </g>
      <g class="com.sun.star.drawing.PolyPolygonShape">
       <g id="id50">
        <rect class="BoundingBox" stroke="none" fill="none" x="10576" y="4323" width="704" height="317"/>
        <path fill="rgb(255,255,255)" stroke="none" d="M 10589,4336 L 11266,4336 11266,4626 10589,4626 10589,4336 Z"/>
        <path fill="none" stroke="rgb(0,0,0)" stroke-width="25" stroke-linejoin="round" stroke-linecap="round" d="M 10589,4336 L 11266,4336 11266,4626 10589,4626 10589,4336 Z"/>
       </g>
      </g>
      <g class="com.sun.star.drawing.PolyPolygonShape">
       <g id="id51">
        <rect class="BoundingBox" stroke="none" fill="none" x="10576" y="3773" width="704" height="317"/>
        <path fill="rgb(255,255,255)" stroke="none" d="M 10589,3786 L 11266,3786 11266,4076 10589,4076 10589,3786 Z"/>
        <path fill="none" stroke="rgb(0,0,0)" stroke-width="25" stroke-linejoin="round" stroke-linecap="round" d="M 10589,3786 L 11266,3786 11266,4076 10589,4076 10589,3786 Z"/>
       </g>
      </g>
      <g class="TextShape">
       <g id="id52">
        <rect class="BoundingBox" stroke="none" fill="none" x="10606" y="4303" width="634" height="328"/>
        <text class="SVGTextShape"><tspan class="TextParagraph" font-family="Arial, sans-serif" font-size="293px" font-weight="400"><tspan class="TextPosition" x="10606" y="4565"><tspan fill="rgb(0,0,0)" stroke="none">÷INT</tspan></tspan></tspan></text>
       </g>
      </g>
      <g class="com.sun.star.drawing.PolyPolygonShape">
       <g id="id53">
        <rect class="BoundingBox" stroke="none" fill="none" x="10576" y="3251" width="704" height="316"/>
        <path fill="rgb(255,255,255)" stroke="none" d="M 10589,3264 L 11266,3264 11266,3553 10589,3553 10589,3264 Z"/>
        <path fill="none" stroke="rgb(0,0,0)" stroke-width="25" stroke-linejoin="round" stroke-linecap="round" d="M 10589,3264 L 11266,3264 11266,3553 10589,3553 10589,3264 Z"/>
       </g>
      </g>
      <g class="TextShape">
       <g id="id54">
        <rect class="BoundingBox" stroke="none" fill="none" x="10606" y="3753" width="634" height="328"/>
        <text class="SVGTextShape"><tspan class="TextParagraph" font-family="Arial, sans-serif" font-size="293px" font-weight="400"><tspan class="TextPosition" x="10606" y="4015"><tspan fill="rgb(0,0,0)" stroke="none">÷INT</tspan></tspan></tspan></text>
       </g>
      </g>
      <g class="TextShape">
       <g id="id55">
        <rect class="BoundingBox" stroke="none" fill="none" x="10606" y="3230" width="634" height="328"/>
        <text class="SVGTextShape"><tspan class="TextParagraph" font-family="Arial, sans-serif" font-size="293px" font-weight="400"><tspan class="TextPosition" x="10606" y="3492"><tspan fill="rgb(0,0,0)" stroke="none">÷INT</tspan></tspan></tspan></text>
       </g>
      </g>
      <g class="com.sun.star.drawing.PolyPolygonShape">
       <g id="id56">
        <rect class="BoundingBox" stroke="none" fill="none" x="5870" y="2269" width="1141" height="650"/>
        <path fill="rgb(255,255,255)" stroke="none" d="M 5883,2282 L 6997,2282 6997,2905 5883,2905 5883,2282 Z"/>
        <path fill="none" stroke="rgb(0,0,0)" stroke-width="25" stroke-linejoin="round" stroke-linecap="round" d="M 5883,2282 L 6997,2282 6997,2905 5883,2905 5883,2282 Z"/>
       </g>
      </g>
      <g class="com.sun.star.drawing.LineShape">
       <g id="id57">
        <rect class="BoundingBox" stroke="none" fill="none" x="7171" y="2532" width="105" height="2755"/>
        <path fill="none" stroke="rgb(0,0,0)" stroke-width="104" stroke-linejoin="round" stroke-linecap="round" d="M 7223,2584 L 7223,5234"/>
       </g>
      </g>
      <g class="TextShape">
       <g id="id58">
        <rect class="BoundingBox" stroke="none" fill="none" x="6155" y="2442" width="537" height="328"/>
        <text class="SVGTextShape"><tspan class="TextParagraph" font-family="Arial, sans-serif" font-size="293px" font-weight="400"><tspan class="TextPosition" x="6165" y="2704"><tspan fill="rgb(0,0,0)" stroke="none">PLL</tspan></tspan></tspan></text>
       </g>
      </g>
      <g class="com.sun.star.drawing.LineShape">
       <g id="id59">
        <rect class="BoundingBox" stroke="none" fill="none" x="6412" y="2892" width="28" height="1226"/>
        <path fill="none" stroke="rgb(0,0,0)" stroke-width="25" stroke-linejoin="round" stroke-linecap="round" d="M 6426,4104 L 6425,2905"/>
       </g>
      </g>
      <g class="com.sun.star.drawing.PolyPolygonShape">
       <g id="id60">
        <rect class="BoundingBox" stroke="none" fill="none" x="8166" y="2689" width="1103" height="317"/>
        <path fill="rgb(255,255,255)" stroke="none" d="M 8179,2702 L 9255,2702 9255,2992 8179,2992 8179,2702 Z"/>
        <path fill="none" stroke="rgb(0,0,0)" stroke-width="25" stroke-linejoin="round" stroke-linecap="round" d="M 8179,2702 L 9255,2702 9255,2992 8179,2992 8179,2702 Z"/>
        <text class="SVGTextShape"><tspan class="TextParagraph" font-family="Arial, sans-serif" font-size="293px" font-weight="400"><tspan class="TextPosition" x="8239" y="2946"><tspan fill="rgb(0,0,0)" stroke="none">÷FRAC</tspan></tspan></tspan></text>
       </g>
      </g>
      <g class="com.sun.star.drawing.PolyPolygonShape">
       <g id="id61">
        <rect class="BoundingBox" stroke="none" fill="none" x="8166" y="4305" width="1103" height="317"/>
        <path fill="rgb(255,255,255)" stroke="none" d="M 8179,4318 L 9255,4318 9255,4608 8179,4608 8179,4318 Z"/>
        <path fill="none" stroke="rgb(0,0,0)" stroke-width="25" stroke-linejoin="round" stroke-linecap="round" d="M 8179,4318 L 9255,4318 9255,4608 8179,4608 8179,4318 Z"/>
        <text class="SVGTextShape"><tspan class="TextParagraph" font-family="Arial, sans-serif" font-size="293px" font-weight="400"><tspan class="TextPosition" x="8239" y="4562"><tspan fill="rgb(0,0,0)" stroke="none">÷FRAC</tspan></tspan></tspan></text>
       </g>
      </g>
      <g class="com.sun.star.drawing.PolyPolygonShape">
       <g id="id62">
        <rect class="BoundingBox" stroke="none" fill="none" x="8166" y="3759" width="1103" height="317"/>
        <path fill="rgb(255,255,255)" stroke="none" d="M 8179,3772 L 9255,3772 9255,4062 8179,4062 8179,3772 Z"/>
        <path fill="none" stroke="rgb(0,0,0)" stroke-width="25" stroke-linejoin="round" stroke-linecap="round" d="M 8179,3772 L 9255,3772 9255,4062 8179,4062 8179,3772 Z"/>
        <text class="SVGTextShape"><tspan class="TextParagraph" font-family="Arial, sans-serif" font-size="293px" font-weight="400"><tspan class="TextPosition" x="8239" y="4016"><tspan fill="rgb(0,0,0)" stroke="none">÷FRAC</tspan></tspan></tspan></text>
       </g>
      </g>
      <g class="com.sun.star.drawing.PolyPolygonShape">
       <g id="id63">
        <rect class="BoundingBox" stroke="none" fill="none" x="8166" y="3230" width="1103" height="317"/>
        <path fill="rgb(255,255,255)" stroke="none" d="M 8179,3243 L 9255,3243 9255,3533 8179,3533 8179,3243 Z"/>
        <path fill="none" stroke="rgb(0,0,0)" stroke-width="25" stroke-linejoin="round" stroke-linecap="round" d="M 8179,3243 L 9255,3243 9255,3533 8179,3533 8179,3243 Z"/>
        <text class="SVGTextShape"><tspan class="TextParagraph" font-family="Arial, sans-serif" font-size="293px" font-weight="400"><tspan class="TextPosition" x="8239" y="3487"><tspan fill="rgb(0,0,0)" stroke="none">÷FRAC</tspan></tspan></tspan></text>
       </g>
      </g>
     </g>
    </g>
   </g>
  </g>
 </g>
</svg>