0,0,0,
8.474575,-32.03081,-40.45295,
7.919641,-27.83765,-36.98891,
6.929324,-23.82489,-34.35865,
6.128356,-20.68128,-31.4765,
5.234276,-17.21725,-28.64855,
4.717675,-14.05052,-25.98991,
4.390861,-11.37111,-23.55501,
4.166306,-9.314176,-21.24595,
4.173679,-8.150795,-19.25503,
4.10452,-7.848751,-17.70507,
4.014503,-7.517785,-16.39542,
3.718959,-7.36644,-15.53928,
3.193309,-6.182922,-14.92406,
3.081298,-6.557478,-15.12466,
3.111993,-6.148446,-14.91077,
5.075852,-12.77447,-14.54362,
4.81865,-12.52752,-15.16108,
4.592782,-12.35039,-16.08624,
3.444656,-8.756612,-19.08277,
3.311164,-9.113061,-21.66142,
3.007769,-8.94492,-24.57333,
2.901494,-8.871907,-28.16206,
2.488637,-7.903773,-32.08855,
2.252954,-6.982156,-36.75333,
2.008378,-6.05993,-41.60665,
1.849247,-5.102579,-45.94395,
1.712637,-4.045477,-50.15262,
1.823698,-3.476672,-53.3688,
1.82219,-2.999584,-55.76368,
1.923397,-2.702434,-57.13621,
1.974296,-2.412228,-57.61217,
1.91817,-2.235332,-57.78004,
1.841631,-2.107055,-57.68912,
1.757233,-2.136871,-57.7208,
1.80559,-2.195041,-57.57558,
1.855285,-2.283197,-57.68143,
1.952835,-2.371659,-57.78371,
2.052769,-2.482595,-57.67081,
2.10852,-2.507983,-57.41153,
2.102841,-2.603258,-56.91338,
2.229238,-2.810213,-56.13158,
2.463616,-3.186602,-54.77453,
2.696199,-3.597507,-52.90655,
2.854147,-4.310819,-50.67719,
3.235645,-5.551308,-48.41016,
3.699009,-7.503422,-45.77965,
4.068259,-9.558498,-43.2788,
4.51614,-12.01848,-41.03843,
5.563371,-15.10748,-39.49448,
6.057966,-17.77736,-38.62928,
6.758918,-20.491,-38.66323,
7.203788,-23.48834,-38.59294,
8.467402,-28.61854,-38.44959,
8.647315,-32.40083,-40.52843,
8.087393,-33.78745,-43.94224,
9.097277,-33.4965,-41.02248,
