0,0,0,
19.9321,-32.30725,-33.89175,
20.26327,-27.56023,-32.3455,
19.8089,-22.42255,-32.34302,
21.04799,-17.56491,-30.38638,
23.13893,-14.02918,-26.01483,
22.02324,-6.282395,-25.80328,
21.52404,0.4978695,-25.05572,
21.19885,6.036391,-23.55318,
20.73901,11.38357,-22.1315,
20.44918,13.90644,-20.84999,
20.00392,16.17257,-19.86393,
19.82403,17.23711,-19.0905,
18.97802,20.40907,-17.93816,
18.7968,20.84238,-17.34539,
18.76126,20.87368,-16.96855,
18.65395,20.76074,-16.72317,
18.68515,19.98963,-16.50565,
18.19831,20.50064,-16.36974,
18.06163,20.46074,-16.40267,
17.81106,20.32989,-16.48697,
17.62931,20.37083,-17.14152,
17.56462,20.22865,-18.21184,
16.78825,20.42659,-19.82955,
17.37991,18.51329,-20.79388,
17.7204,15.92414,-22.84438,
18.94301,11.89771,-25.05805,
23.30757,6.582632,-26.1179,
15.85222,1.519261,-33.08698,
15.48,-4.824064,-34.18078,
16.38485,-9.33764,-33.98559,
17.52267,-11.92017,-33.51788,
19.01168,-13.55912,-32.83629,
17.08413,-17.03866,-33.45634,
18.36065,-17.15848,-32.68593,
15.9182,-20.3349,-33.10007,
17.11935,-18.70884,-32.84007,
19.38859,-17.48307,-32.05463,
16.9547,-18.52299,-32.99879,
15.64343,-20.26029,-32.90421,
15.20029,-20.93896,-32.89072,
15.04228,-21.19902,-33.03883,
19.10874,-16.73638,-32.33699,
21.01319,-16.16752,-31.74725,
20.97787,-16.18052,-31.83644,
21.0001,-16.3248,-31.80183,
17.02234,-18.47814,-33.14338,
21.28654,-16.45864,-31.73437,
15.37652,-21.44059,-33.03856,
15.39648,-21.45787,-32.99216,
15.42612,-21.48286,-32.98232,
15.4029,-21.43351,-32.94892,
15.27355,-21.25589,-33.185,
18.73884,-16.95425,-32.6103,
17.06945,-17.88241,-33.59949,
20.19693,-16.07814,-32.02525,
16.71403,-18.44228,-35.38626,
16.63949,-19.24077,-37.71851,
16.8499,-19.12198,-38.48898,
17.2741,-18.97464,-37.86754,
18.1501,-19.60865,-37.53287,
17.96896,-21.70771,-38.39627,
19.89361,-22.97412,-35.4753,
20.75991,-25.59263,-34.22911,
21.55093,-29.75703,-32.59497,
21.59901,-31.90577,-33.12593,
21.59885,-31.90074,-33.11404,
