0,0,0,
17.15474,-33.55085,-34.83315,
17.8943,-30.92469,-33.95328,
18.63941,-28.99273,-34.30566,
21.32621,-24.05201,-29.74303,
20.34453,-15.69934,-34.25007,
22.81403,-12.0132,-29.52946,
24.26862,-3.506148,-30.68777,
26.44684,1.20761,-27.97842,
28.00985,2.471213,-24.49218,
29.51983,7.372423,-24.06659,
30.12281,8.753974,-23.18434,
30.56266,10.44314,-22.66652,
30.67718,11.39774,-22.16942,
30.6585,12.08036,-22.07605,
30.58399,12.42349,-22.1244,
30.52051,12.54539,-22.05362,
30.4193,12.79223,-22.16467,
30.26842,12.94329,-21.79463,
30.01727,13.27939,-20.93235,
30.06981,15.65638,-20.21815,
29.51356,16.31204,-18.03838,
28.17352,14.36147,-14.68566,
27.32673,14.56778,-11.54588,
26.24123,14.73761,-8.262634,
25.13407,15.89503,-4.580261,
23.76076,11.92172,-1.358994,
22.57851,10.08411,1.326187,
21.8534,7.605298,1.687195,
21.61776,6.17989,1.488907,
21.22577,5.8735,1.68013,
20.97286,6.516863,1.787292,
20.90925,6.826787,1.621841,
20.86288,6.821433,1.75972,
20.95614,6.630342,1.665588,
21.04186,6.464632,1.707947,
21.10519,6.348305,1.703384,
21.18158,6.472963,1.852814,
21.1956,6.472831,1.814499,
21.24743,6.511395,1.913422,
21.34935,6.265379,1.848663,
21.36222,6.414087,1.913315,
21.47873,6.565874,1.908844,
21.49016,6.558933,1.974915,
21.49656,6.556389,2.004761,
21.51189,6.567629,2.047958,
21.5146,6.567077,2.077576,
22.79987,7.265285,1.146744,
23.33945,7.572367,0.16539,
23.95611,10.70175,0.01368713,
24.28732,10.86733,-2.227722,
24.38679,9.826099,-5.30043,
24.25622,7.864518,-8.528381,
23.4826,5.804378,-11.19939,
22.39408,3.018102,-15.09272,
21.10122,-0.2753448,-19.25787,
20.35241,-6.584587,-22.37558,
20.19128,-12.41626,-24.97223,
19.06219,-16.15969,-28.89577,
16.97651,-19.65692,-32.2193,
16.34858,-25.18086,-32.58435,
16.5375,-32.78934,-35.51223,
23.87266,-34.05666,-23.38845,
23.45687,-33.75628,-24.34262,
