0,0,0,
25.25842,-33.78917,-29.22688,
25.23117,-31.51317,-29.55401,
24.30185,-25.99463,-31.93291,
25.03889,-21.64046,-30.5041,
25.15303,-16.48325,-29.26889,
25.38362,-11.62964,-26.97564,
25.71088,-7.059479,-24.29147,
25.92114,-3.673504,-21.59132,
26.00035,-1.010611,-18.82661,
25.61515,1.511786,-16.27632,
25.55849,3.050269,-13.7908,
25.68156,3.718134,-11.84298,
25.8241,3.990004,-10.56575,
23.29177,7.815567,-8.752686,
23.54653,8.752926,-10.06894,
25.35252,6.60909,-13.48094,
25.58484,6.876121,-16.32661,
26.02642,6.656363,-18.74405,
26.48767,6.391194,-20.131,
26.54643,6.183404,-20.43382,
26.45532,6.040173,-20.31771,
26.31194,6.086553,-20.16096,
26.16313,6.043311,-20.12305,
26.13785,6.076758,-19.9409,
26.17641,6.058103,-19.82944,
26.3012,6.15366,-19.90925,
26.20922,6.485457,-19.90636,
25.78099,7.143942,-20.05678,
24.45461,8.178291,-20.14622,
22.29703,10.25741,-20.28407,
20.77774,7.496216,-18.94032,
17.02794,8.768575,-17.83498,
13.70997,7.822021,-16.28324,
15.98748,0.8564186,-18.36598,
14.37351,0.4823513,-17.66248,
13.14811,-0.4260101,-17.49731,
10.33792,-0.2136936,-15.97643,
7.262856,-0.15907,-13.98669,
6.209023,-1.74202,-13.6987,
2.536358,-2.623153,-11.07356,
-0.100125,-3.75437,-9.795517,
-0.3295567,-6.403676,-10.29968,
3.098952,-9.042496,-13.07336,
2.995001,-9.646827,-12.98045,
3.299527,-10.20473,-12.78033,
3.20292,-10.05532,-12.76022,
5.650851,-10.81555,-15.35081,
11.39369,-13.22387,-17.50304,
5.501719,-8.845,-16.4628,
7.494268,-9.64291,-17.04456,
6.910876,-8.566663,-17.88095,
7.333645,-9.098382,-19.63699,
7.787087,-10.10207,-23.77275,
6.745548,-12.80079,-25.90137,
23.56404,-16.28094,-20.63081,
9.975906,-11.31422,-27.74129,
15.31222,-10.28037,-26.80725,
14.26757,-7.676692,-26.95173,
22.3354,-12.01682,-21.66687,
21.50808,-10.61031,-23.30818,
21.82711,-9.753805,-28.8416,
23.30454,-11.1647,-29.42799,
24.95672,-10.49632,-30.2076,
26.71245,-9.067198,-30.56733,
28.88127,-7.895848,-30.26092,
31.74255,-8.497199,-25.44398,
34.04758,-7.736093,-24.80109,
35.72487,-6.31993,-26.34743,
37.37901,-5.93239,-27.10192,
39.22845,-6.931704,-27.48857,
40.96064,-9.069951,-28.89526,
41.97192,-11.72831,-30.97234,
42.60838,-13.9315,-32.06258,
43.19471,-15.20822,-32.26685,
42.93498,-15.96825,-32.25719,
43.00733,-16.19665,-32.35116,
42.85358,-16.25791,-32.38045,
42.59794,-15.90421,-32.72247,
42.45303,-15.74843,-32.76833,
42.2844,-15.52603,-32.78405,
42.10811,-15.13705,-33.10691,
41.88965,-14.9676,-33.07784,
41.80071,-14.77284,-33.12962,
41.61898,-14.45072,-33.56536,
41.33195,-14.28265,-33.69501,
40.93983,-14.03332,-34.01583,
40.45169,-13.94057,-34.0004,
39.82092,-13.72249,-34.25679,
38.9344,-13.53916,-34.21832,
37.43525,-13.39268,-34.27387,
35.77264,-13.58187,-34.26584,
33.72591,-14.22924,-34.21563,
31.20921,-15.6244,-34.499,
28.4708,-16.98161,-35.02732,
28.40403,-16.93678,-35.16119,
28.3354,-16.89335,-35.30064,
28.31953,-16.87974,-35.40726,
19.39477,-26.80606,-38.43654,
17.71871,-29.98524,-40.29638,
16.62467,-31.49773,-41.18935,
15.67611,-32.99305,-40.99551,
20.9095,-33.42742,-30.92801,
