{
  "src_folders" : ["nw"],
  "output_folder" : "reports",
  "custom_commands_path" : "",
  "custom_assertions_path" : "",
  "page_objects_path" : "",
  "globals_path" : "",

  "selenium" : {
    "start_process" : true,
    "server_path" : "",
    "log_path" : "",
    "port" : 4445,
    "cli_args" : {
       "webdriver.chrome.driver" : "./bin/chromedriver"
    }
  },

  "test_settings" : {
    "default" : {
      "launch_url" : "http://localhost",
      "selenium_port"  : 4445,
      "selenium_host"  : "localhost",
      "silent": true,
      "screenshots" : {
        "enabled" : false,
        "path" : ""
      },
      "desiredCapabilities": {
        "browserName": "webdriver.chrome.driver",
        "marionette": true
      }
    },

    "chrome" : {
      "desiredCapabilities": {
        "browserName": "chrome"
      }
    },

    "edge" : {
      "desiredCapabilities": {
        "browserName": "MicrosoftEdge"
      }
    }
  }
}