<?xml version="1.0" encoding="UTF-8" standalone="no"?>
<!-- Created with Inkscape (http://www.inkscape.org/) -->

<svg
   xmlns:dc="http://purl.org/dc/elements/1.1/"
   xmlns:cc="http://creativecommons.org/ns#"
   xmlns:rdf="http://www.w3.org/1999/02/22-rdf-syntax-ns#"
   xmlns:svg="http://www.w3.org/2000/svg"
   xmlns="http://www.w3.org/2000/svg"
   xmlns:sodipodi="http://sodipodi.sourceforge.net/DTD/sodipodi-0.dtd"
   xmlns:inkscape="http://www.inkscape.org/namespaces/inkscape"
   id="svg2"
   version="1.1"
   inkscape:version="0.92.5 (0.92.5+68)"
   width="180"
   height="180"
   xml:space="preserve"
   sodipodi:docname="Extension.round-icon.svg"
   inkscape:export-filename="/media/Media/Kunden/_Typoworx/CI/Logo-Design_2017/Web - RGB/Favicon+Appicons/Extension.round-icon.svg.png"
   inkscape:export-xdpi="96"
   inkscape:export-ydpi="96"><metadata
     id="metadata8"><rdf:RDF><cc:Work
         rdf:about=""><dc:format>image/svg+xml</dc:format><dc:type
           rdf:resource="http://purl.org/dc/dcmitype/StillImage" /><dc:title></dc:title></cc:Work></rdf:RDF></metadata><defs
     id="defs6" /><sodipodi:namedview
     pagecolor="#ffffff"
     bordercolor="#666666"
     borderopacity="1"
     objecttolerance="10"
     gridtolerance="10"
     guidetolerance="10"
     inkscape:pageopacity="0"
     inkscape:pageshadow="2"
     inkscape:window-width="1855"
     inkscape:window-height="1056"
     id="namedview4"
     showgrid="false"
     inkscape:zoom="1.8599343"
     inkscape:cx="-24.720443"
     inkscape:cy="115.62818"
     inkscape:window-x="1985"
     inkscape:window-y="24"
     inkscape:window-maximized="1"
     inkscape:current-layer="g12"
     fit-margin-top="0.63662"
     fit-margin-left="2.734245"
     fit-margin-right="2.734245"
     fit-margin-bottom="0.63662"
     showguides="true"
     inkscape:guide-bbox="true"><sodipodi:guide
       position="25.25,223.66381"
       orientation="1,0"
       id="guide847"
       inkscape:locked="false"
       inkscape:label=""
       inkscape:color="rgb(0,0,255)" /><sodipodi:guide
       position="208.60952,25.25"
       orientation="0,1"
       id="guide849"
       inkscape:locked="false"
       inkscape:label=""
       inkscape:color="rgb(0,0,255)" /><sodipodi:guide
       position="154.75,226.88973"
       orientation="1,0"
       id="guide851"
       inkscape:locked="false"
       inkscape:label=""
       inkscape:color="rgb(0,0,255)" /><sodipodi:guide
       position="196.78114,154.75"
       orientation="0,1"
       id="guide858"
       inkscape:locked="false"
       inkscape:label=""
       inkscape:color="rgb(0,0,255)" /></sodipodi:namedview><g
     id="g10"
     inkscape:groupmode="layer"
     inkscape:label="Typoworx_Logo-Entwurf-V1.1_RGB_MiniX"
     transform="matrix(1.25,0,0,-1.25,-8.3823957,227.77728)"><g
       id="g12"
       transform="matrix(1.3239454,0,0,1.3239454,3.1738684,4.4515283)"><rect
   style="opacity:1;fill:#ffffff;fill-opacity:0.99215686;fill-rule:nonzero;stroke:none;stroke-width:2.56172514;stroke-linecap:round;stroke-miterlimit:3.9000001;stroke-dasharray:none;stroke-dashoffset:0;stroke-opacity:0.71126757"
   id="rect860"
   width="108.76582"
   height="108.76582"
   x="2.6678202"
   y="-134.27313"
   transform="scale(1,-1)" /><g
   id="g856"
   transform="translate(8.7616921,9.2003319)"><path
     inkscape:connector-curvature="0"
     id="path14"
     style="fill:#00cc00;fill-opacity:1;fill-rule:nonzero;stroke:none"
     d="m 10.252036,30.726036 15.156,21.563 -14.023,19.922 h 8.789 l 6.367,-9.727 c 1.195,-1.852 2.156,-3.402 2.891,-4.648 1.14,1.714 2.195,3.238 3.164,4.57 l 6.992,9.805 h 8.398 l -14.336,-19.532 15.43,-21.953 h -8.633 l -8.515,12.891 -2.266,3.476 -10.898,-16.367 z" /><path
     inkscape:connector-curvature="0"
     id="path16"
     style="fill:#00cc00;fill-opacity:1;fill-rule:nonzero;stroke:none"
     d="m 18.854036,85.797036 c 0,-2.676 -2.172,-4.848 -4.848,-4.848 -2.68,0 -4.8519996,2.172 -4.8519996,4.848 0,2.679 2.1719996,4.847 4.8519996,4.847 2.676,0 4.848,-2.168 4.848,-4.847 z" /><path
     inkscape:connector-curvature="0"
     id="path18"
     style="fill:#00cc00;fill-opacity:0.9;fill-rule:nonzero;stroke:none"
     d="m 31.654036,100.68304 c 0,-2.676004 -2.172,-4.847004 -4.847,-4.847004 -2.68,0 -4.852,2.171 -4.852,4.847004 0,2.68 2.172,4.852 4.852,4.852 2.675,0 4.847,-2.172 4.847,-4.852 z" /><path
     inkscape:connector-curvature="0"
     id="path20"
     style="fill:#00cc00;fill-opacity:0.7;fill-rule:nonzero;stroke:none"
     d="m 70.166036,101.59304 c 0,-2.675004 -2.168,-4.847004 -4.848,-4.847004 -2.675,0 -4.847,2.172 -4.847,4.847004 0,2.68 2.172,4.852 4.847,4.852 2.68,0 4.848,-2.172 4.848,-4.852 z" /><path
     inkscape:connector-curvature="0"
     id="path22"
     style="fill:#00cc00;fill-opacity:0.55;fill-rule:nonzero;stroke:none"
     d="m 87.424036,70.140036 c 0,-2.679 -2.168,-4.847 -4.848,-4.847 -2.679,0 -4.847,2.168 -4.847,4.847 0,2.676 2.168,4.848 4.847,4.848 2.68,0 4.848,-2.172 4.848,-4.848 z" /><path
     inkscape:connector-curvature="0"
     id="path24"
     style="fill:#00cc00;fill-opacity:0.5;fill-rule:nonzero;stroke:none"
     d="m 81.596036,51.339036 c 0,-2.675 -2.172,-4.847 -4.848,-4.847 -2.68,0 -4.848,2.172 -4.848,4.847 0,2.68 2.168,4.848 4.848,4.848 2.676,0 4.848,-2.168 4.848,-4.848 z" /><path
     inkscape:connector-curvature="0"
     id="path26"
     style="fill:#00cc00;fill-opacity:0.45;fill-rule:nonzero;stroke:none"
     d="m 65.709036,37.910036 c 0,-2.676 -2.168,-4.848 -4.848,-4.848 -2.675,0 -4.847,2.172 -4.847,4.848 0,2.679 2.172,4.851 4.847,4.851 2.68,0 4.848,-2.172 4.848,-4.851 z" /><path
     inkscape:connector-curvature="0"
     id="path28"
     style="fill:#00cc00;fill-opacity:0.6;fill-rule:nonzero;stroke:none"
     d="m 82.994036,88.082036 c 0,-2.676 -2.172,-4.848 -4.847,-4.848 -2.68,0 -4.852,2.172 -4.852,4.848 0,2.679 2.172,4.851 4.852,4.851 2.675,0 4.847,-2.172 4.847,-4.851 z" /><path
     inkscape:connector-curvature="0"
     id="path30"
     style="fill:#00cc00;fill-opacity:0.8;fill-rule:nonzero;stroke:none"
     d="m 50.397036,106.67904 c 0,-2.675 -2.172,-4.847 -4.848,-4.847 -2.68,0 -4.852,2.172 -4.852,4.847 0,2.68 2.172,4.852 4.852,4.852 2.676,0 4.848,-2.172 4.848,-4.852 z" /></g>
</g></g></svg>