<?xml version="1.0" encoding="utf-8"?>
<!-- Generator: Adobe Illustrator 16.0.3, SVG Export Plug-In . SVG Version: 6.00 Build 0)  -->
<!DOCTYPE svg PUBLIC "-//W3C//DTD SVG 1.1//EN" "http://www.w3.org/Graphics/SVG/1.1/DTD/svg11.dtd">
<svg version="1.1" id="Ebene_1" xmlns="http://www.w3.org/2000/svg" xmlns:xlink="http://www.w3.org/1999/xlink" x="0px" y="0px"
	 width="65px" height="65px" viewBox="0 0 65 65" enable-background="new 0 0 65 65" xml:space="preserve">
<rect y="0.022" fill="#88B004" width="65" height="65"/>
<g id="surface1">
	<path fill="#FFFFFF" d="M23.727,21.873H7.036v9.272h16.69V21.873z M12.328,27.708l-1.311,1.311l-1.854-1.855
		c-0.362-0.362-0.362-0.949,0-1.311l1.854-1.855l1.311,1.311l-1.199,1.199L12.328,27.708z M15.335,29.584l-1.763-0.586l1.855-5.563
		l1.762,0.586L15.335,29.584z M21.601,27.165l-1.855,1.855l-1.311-1.311l1.199-1.2l-1.199-1.199l1.311-1.311l1.855,1.855
		C21.962,26.216,21.962,26.802,21.601,27.165z"/>
	<path fill="#FFFFFF" d="M43.199,49.69h15.765v-9.273H43.199V49.69z M48.765,42.273h8.346v1.854h-8.346V42.273z M48.765,45.982
		h8.346v1.854h-8.346V45.982z M45.055,42.273h1.854v1.854h-1.854V42.273z M45.055,45.982h1.854v1.854h-1.854V45.982z"/>
	<path fill="#FFFFFF" d="M41.346,50.618V39.491c0-0.513,0.415-0.928,0.928-0.928H53.4v-7.418H28.363
		c-0.512,0-0.927-0.414-0.927-0.927V11.673c0-0.513,0.415-0.928,0.927-0.928H53.4V8.891c0-0.881-0.621-1.641-1.484-1.817
		c-0.12-0.025-0.245-0.038-0.369-0.038H14.455c-1.024,0-1.855,0.83-1.855,1.855v11.127h12.055c0.512,0,0.927,0.415,0.927,0.927
		v11.128c0,0.512-0.415,0.927-0.927,0.927H12.6v20.4h36.165c0.511,0,0.926,0.415,0.926,0.928v2.782c0,1.023,0.831,1.854,1.856,1.854
		c1.023,0,1.854-0.83,1.854-1.854v-5.563H42.273C41.761,51.547,41.346,51.131,41.346,50.618z M21.873,8.891h1.854v1.854h-1.854
		V8.891z M18.163,8.891h1.855v1.854h-1.855V8.891z M14.455,8.891h1.855v1.854h-1.855V8.891z M14.455,14.455V12.6h11.127v1.855
		H14.455z M39.491,46.909c0,0.513-0.415,0.928-0.928,0.928H15.381c-0.512,0-0.927-0.415-0.927-0.928V35.781
		c0-0.512,0.415-0.928,0.927-0.928h23.182c0.513,0,0.928,0.416,0.928,0.928V46.909z"/>
	<path fill="#FFFFFF" d="M47.837,55.254H7.036v1.856c0,1.023,0.831,1.854,1.855,1.854h39.444c-0.328-0.563-0.498-1.202-0.498-1.854
		V55.254z"/>
	<path fill="#FFFFFF" d="M16.31,45.982h21.326V36.71H16.31V45.982z M35.782,44.127h-4.637v-1.854h4.637V44.127z M33.928,38.563
		h1.854v1.854h-1.854V38.563z M23.727,38.563h8.347v1.854h-8.347V38.563z M18.163,38.563h3.71v1.854h-3.71V38.563z M18.163,42.273
		h11.128v1.854H18.163V42.273z"/>
	<path fill="#FFFFFF" d="M50.619,17.7c0,0.768-0.623,1.391-1.392,1.391c-0.768,0-1.391-0.623-1.391-1.391s0.623-1.391,1.391-1.391
		C49.996,16.31,50.619,16.932,50.619,17.7z"/>
	<path fill="#FFFFFF" d="M46.666,27.333c-0.295,0.153-0.647,0.135-0.928-0.044l-8.121-5.25l-8.326,4.996v2.257h29.672v-2.244
		l-5.584-3.192L46.666,27.333z"/>
	<path fill="#FFFFFF" d="M29.292,12.6v12.272l7.867-4.721c0.305-0.183,0.686-0.176,0.982,0.016l8.149,5.272l6.683-3.462
		c0.28-0.144,0.614-0.138,0.889,0.019l5.103,2.916V12.6H29.292z M49.228,20.945c-1.794,0-3.244-1.452-3.244-3.245
		s1.45-3.246,3.244-3.246c1.792,0,3.245,1.453,3.245,3.246S51.02,20.945,49.228,20.945z"/>
</g>
</svg>
