{
  "$schema": "https://docs.renovatebot.com/renovate-schema.json",
  "extends": [
    "config:recommended"
  ],
  "packageRules": [
    {
      "packagePatterns": [
        "^php:8\\.2\\.[0-9]+$"
      ],
      "updateTypes": ["patch"],
      "enabled": true
    }
  ]
}